You are viewing a plain text version of this content. The canonical link for it is here.
Posted to builds@beam.apache.org by Apache Jenkins Server <je...@builds.apache.org> on 2023/11/12 05:02:44 UTC
Build failed in Jenkins: beam_PreCommit_PythonDocker_Cron #5205
See <https://ci-beam.apache.org/job/beam_PreCommit_PythonDocker_Cron/5205/display/redirect>
Changes:
------------------------------------------
Started by timer
Running as SYSTEM
[EnvInject] - Loading node environment variables.
Building remotely on apache-beam-jenkins-2 (beam) in workspace <https://ci-beam.apache.org/job/beam_PreCommit_PythonDocker_Cron/ws/>
The recommended git tool is: NONE
No credentials specified
Wiping out workspace first.
Cloning the remote Git repository
Using shallow clone with depth 1
Avoid fetching tags
Cloning repository https://github.com/apache/beam.git
> git init <https://ci-beam.apache.org/job/beam_PreCommit_PythonDocker_Cron/ws/src> # timeout=10
Fetching upstream changes from https://github.com/apache/beam.git
> git --version # timeout=10
> git --version # 'git version 2.25.1'
> git fetch --no-tags --force --progress --depth=1 -- https://github.com/apache/beam.git +refs/heads/*:refs/remotes/origin/* # timeout=10
> git config remote.origin.url https://github.com/apache/beam.git # timeout=10
> git config --add remote.origin.fetch +refs/heads/*:refs/remotes/origin/* # timeout=10
> git config remote.origin.url https://github.com/apache/beam.git # timeout=10
Using shallow fetch with depth 1
Fetching upstream changes from https://github.com/apache/beam.git
> git fetch --no-tags --force --progress --depth=1 -- https://github.com/apache/beam.git +refs/heads/*:refs/remotes/origin/* +refs/pull/${ghprbPullId}/*:refs/remotes/origin/pr/${ghprbPullId}/* # timeout=10
> git rev-parse origin/master^{commit} # timeout=10
Checking out Revision 2ad459113134dfffd3caeeb15e821bb644e08663 (origin/master)
> git config core.sparsecheckout # timeout=10
> git checkout -f 2ad459113134dfffd3caeeb15e821bb644e08663 # timeout=10
Commit message: "[YAML] - Kafka Read and Write proto (#29368)"
> git rev-list --no-walk 39986e60ea367566da1f4a49d34a53f7ba75cf98 # timeout=10
First time build. Skipping changelog.
No emails were triggered.
[EnvInject] - Executing scripts and injecting environment variables after the SCM step.
[EnvInject] - Injecting as environment variables the properties content
SETUPTOOLS_USE_DISTUTILS=stdlib
SPARK_LOCAL_IP=127.0.0.1
[EnvInject] - Variables injected successfully.
[Gradle] - Launching build.
[src] $ <https://ci-beam.apache.org/job/beam_PreCommit_PythonDocker_Cron/ws/src/gradlew> --info --continue --max-workers=8 -Dorg.gradle.jvmargs=-Xms2g -Dorg.gradle.jvmargs=-Xmx6g -Dorg.gradle.vfs.watch=false -Pdocker-pull-licenses :pythonDockerBuildPreCommit
Initialized native services in: /home/jenkins/.gradle/native
Initialized jansi services in: /home/jenkins/.gradle/native
Received JVM installation metadata from '/usr/lib/jvm/java-8-openjdk-amd64': {JAVA_HOME=/usr/lib/jvm/java-8-openjdk-amd64/jre, JAVA_VERSION=1.8.0_382, JAVA_VENDOR=Private Build, RUNTIME_NAME=OpenJDK Runtime Environment, RUNTIME_VERSION=1.8.0_382-8u382-ga-1~20.04.1-b05, VM_NAME=OpenJDK 64-Bit Server VM, VM_VERSION=25.382-b05, VM_VENDOR=Private Build, OS_ARCH=amd64}
Checking if the launcher JVM can be re-used for build. To be re-used, the launcher JVM needs to match the parameters required for the build process: -Xmx6g -Dfile.encoding=UTF-8 -Duser.country=US -Duser.language=en -Duser.variant
To honour the JVM settings for this build a single-use Daemon process will be forked. For more on this, please refer to https://docs.gradle.org/8.4/userguide/gradle_daemon.html#sec:disabling_the_daemon in the Gradle documentation.
Starting process 'Gradle build daemon'. Working directory: /home/jenkins/.gradle/daemon/8.4 Command: /usr/lib/jvm/java-8-openjdk-amd64/bin/java -Xmx6g -Dfile.encoding=UTF-8 -Duser.country=US -Duser.language=en -Duser.variant -cp /home/jenkins/.gradle/wrapper/dists/gradle-8.4-bin/1w5dpkrfk8irigvoxmyhowfim/gradle-8.4/lib/gradle-launcher-8.4.jar -javaagent:/home/jenkins/.gradle/wrapper/dists/gradle-8.4-bin/1w5dpkrfk8irigvoxmyhowfim/gradle-8.4/lib/agents/gradle-instrumentation-agent-8.4.jar org.gradle.launcher.daemon.bootstrap.GradleDaemon 8.4
Successfully started process 'Gradle build daemon'
An attempt to start the daemon took 1.267 secs.
The client will now receive all logging from the daemon (pid: 627621). The daemon log file: /home/jenkins/.gradle/daemon/8.4/daemon-627621.out.log
Closing daemon's stdin at end of input.
The daemon will no longer process any standard input.
Daemon will be stopped at the end of the build
Using 8 worker leases.
Configuration on demand is an incubating feature.
Received JVM installation metadata from '/usr/lib/jvm/java-8-openjdk-amd64': {JAVA_HOME=/usr/lib/jvm/java-8-openjdk-amd64/jre, JAVA_VERSION=1.8.0_382, JAVA_VENDOR=Private Build, RUNTIME_NAME=OpenJDK Runtime Environment, RUNTIME_VERSION=1.8.0_382-8u382-ga-1~20.04.1-b05, VM_NAME=OpenJDK 64-Bit Server VM, VM_VERSION=25.382-b05, VM_VENDOR=Private Build, OS_ARCH=amd64}
Watching the file system is configured to be disabled
File system watching is inactive
Gradle Enterprise plugins resolution: https://plugins.gradle.org/m2
Starting Build
Skipping Kotlin DSL script compilation (Settings/TopLevel/stage1) as it is up-to-date.
Skipping Kotlin DSL script compilation (Settings/TopLevel/stage2) as it is up-to-date.
Settings evaluated using settings file '<https://ci-beam.apache.org/job/beam_PreCommit_PythonDocker_Cron/ws/src/settings.gradle.kts'.>
Enforcing Gradle Enterprise: https://ge.apache.org, allowUntrustedServer: false
Using local directory build cache for the root build (location = /home/jenkins/.gradle/caches/build-cache-1, removeUnusedEntriesAfter = 7 days).
Using remote HTTP build cache for the root build (allowInsecureProtocol = false, allowUntrustedServer = false, authenticated = true, url = https://beam-cache.apache.org/cache/, useExpectContinue = false).
Projects loaded. Root project using build file '<https://ci-beam.apache.org/job/beam_PreCommit_PythonDocker_Cron/ws/src/build.gradle.kts'.>
Included projects: [root project 'beam', project ':beam-test-gha', project ':beam-test-infra-metrics', project ':beam-test-infra-mock-apis', project ':beam-test-infra-pipelines', project ':beam-test-jenkins', project ':beam-test-tools', project ':beam-validate-runner', project ':com.google.api.gax.batching', project ':examples', project ':it', project ':learning', project ':model', project ':playground', project ':release', project ':runners', project ':sdks', project ':vendor', project ':website', project ':examples:java', project ':examples:kotlin', project ':examples:multi-language', project ':it:cassandra', project ':it:common', project ':it:conditions', project ':it:elasticsearch', project ':it:google-cloud-platform', project ':it:jdbc', project ':it:kafka', project ':it:mongodb', project ':it:neo4j', project ':it:splunk', project ':it:testcontainers', project ':it:truthmatchers', project ':learning:tour-of-beam', project ':model:fn-execution', project ':model:job-management', project ':model:pipeline', project ':playground:backend', project ':playground:frontend', project ':playground:kafka-emulator', project ':playground:terraform', project ':release:go-licenses', project ':runners:core-construction-java', project ':runners:core-java', project ':runners:direct-java', project ':runners:extensions-java', project ':runners:flink', project ':runners:google-cloud-dataflow-java', project ':runners:java-fn-execution', project ':runners:java-job-service', project ':runners:jet', project ':runners:local-java', project ':runners:portability', project ':runners:samza', project ':runners:spark', project ':runners:twister2', project ':sdks:go', project ':sdks:java', project ':sdks:python', project ':sdks:typescript', project ':vendor:bytebuddy-1_12_8', project ':vendor:calcite-1_28_0', project ':vendor:grpc-1_54_0', project ':vendor:guava-32_1_2-jre', project ':examples:java:cdap', project ':examples:java:twitter', project ':learning:tour-of-beam:frontend', project ':learning:tour-of-beam:terraform', project ':playground:backend:containers', project ':playground:frontend:playground_components', project ':release:go-licenses:go', project ':release:go-licenses:java', project ':release:go-licenses:py', project ':runners:extensions-java:metrics', project ':runners:flink:1.12', project ':runners:flink:1.13', project ':runners:flink:1.14', project ':runners:flink:1.15', project ':runners:flink:1.16', project ':runners:google-cloud-dataflow-java:arm', project ':runners:google-cloud-dataflow-java:examples', project ':runners:google-cloud-dataflow-java:examples-streaming', project ':runners:google-cloud-dataflow-java:worker', project ':runners:portability:java', project ':runners:samza:job-server', project ':runners:spark:3', project ':sdks:go:container', project ':sdks:go:examples', project ':sdks:go:test', project ':sdks:java:bom', project ':sdks:java:build-tools', project ':sdks:java:container', project ':sdks:java:core', project ':sdks:java:expansion-service', project ':sdks:java:extensions', project ':sdks:java:fn-execution', project ':sdks:java:harness', project ':sdks:java:io', project ':sdks:java:javadoc', project ':sdks:java:maven-archetypes', project ':sdks:java:testing', project ':sdks:java:transform-service', project ':sdks:python:apache_beam', project ':sdks:python:container', project ':sdks:python:expansion-service-container', project ':sdks:python:test-suites', project ':sdks:typescript:container', project ':examples:java:cdap:hubspot', project ':examples:java:cdap:salesforce', project ':examples:java:cdap:servicenow', project ':examples:java:cdap:zendesk', project ':playground:backend:containers:go', project ':playground:backend:containers:java', project ':playground:backend:containers:python', project ':playground:backend:containers:router', project ':playground:backend:containers:scio', project ':playground:frontend:playground_components:tools', project ':runners:flink:1.12:job-server', project ':runners:flink:1.12:job-server-container', project ':runners:flink:1.13:job-server', project ':runners:flink:1.13:job-server-container', project ':runners:flink:1.14:job-server', project ':runners:flink:1.14:job-server-container', project ':runners:flink:1.15:job-server', project ':runners:flink:1.15:job-server-container', project ':runners:flink:1.16:job-server', project ':runners:flink:1.16:job-server-container', project ':runners:google-cloud-dataflow-java:worker:windmill', project ':runners:spark:3:job-server', project ':sdks:go:test:load', project ':sdks:java:bom:gcp', project ':sdks:java:container:agent', project ':sdks:java:container:java11', project ':sdks:java:container:java17', project ':sdks:java:container:java21', project ':sdks:java:container:java8', project ':sdks:java:core:jmh', project ':sdks:java:expansion-service:app', project ':sdks:java:expansion-service:container', project ':sdks:java:extensions:arrow', project ':sdks:java:extensions:avro', project ':sdks:java:extensions:euphoria', project ':sdks:java:extensions:google-cloud-platform-core', project ':sdks:java:extensions:jackson', project ':sdks:java:extensions:join-library', project ':sdks:java:extensions:kryo', project ':sdks:java:extensions:ml', project ':sdks:java:extensions:protobuf', project ':sdks:java:extensions:python', project ':sdks:java:extensions:sbe', project ':sdks:java:extensions:schemaio-expansion-service', project ':sdks:java:extensions:sketching', project ':sdks:java:extensions:sorter', project ':sdks:java:extensions:sql', project ':sdks:java:extensions:timeseries', project ':sdks:java:extensions:zetasketch', project ':sdks:java:harness:jmh', project ':sdks:java:io:amazon-web-services', project ':sdks:java:io:amazon-web-services2', project ':sdks:java:io:amqp', project ':sdks:java:io:azure', project ':sdks:java:io:azure-cosmos', project ':sdks:java:io:bigquery-io-perf-tests', project ':sdks:java:io:cassandra', project ':sdks:java:io:cdap', project ':sdks:java:io:clickhouse', project ':sdks:java:io:common', project ':sdks:java:io:contextualtextio', project ':sdks:java:io:csv', project ':sdks:java:io:debezium', project ':sdks:java:io:elasticsearch', project ':sdks:java:io:elasticsearch-tests', project ':sdks:java:io:expansion-service', project ':sdks:java:io:file-based-io-tests', project ':sdks:java:io:file-schema-transform', project ':sdks:java:io:google-ads', project ':sdks:java:io:google-cloud-platform', project ':sdks:java:io:hadoop-common', project ':sdks:java:io:hadoop-file-system', project ':sdks:java:io:hadoop-format', project ':sdks:java:io:hbase', project ':sdks:java:io:hcatalog', project ':sdks:java:io:influxdb', project ':sdks:java:io:jdbc', project ':sdks:java:io:jms', project ':sdks:java:io:json', project ':sdks:java:io:kafka', project ':sdks:java:io:kinesis', project ':sdks:java:io:kudu', project ':sdks:java:io:mongodb', project ':sdks:java:io:mqtt', project ':sdks:java:io:neo4j', project ':sdks:java:io:parquet', project ':sdks:java:io:pulsar', project ':sdks:java:io:rabbitmq', project ':sdks:java:io:redis', project ':sdks:java:io:rrio', project ':sdks:java:io:singlestore', project ':sdks:java:io:snowflake', project ':sdks:java:io:solr', project ':sdks:java:io:sparkreceiver', project ':sdks:java:io:splunk', project ':sdks:java:io:synthetic', project ':sdks:java:io:thrift', project ':sdks:java:io:tika', project ':sdks:java:io:xml', project ':sdks:java:maven-archetypes:examples', project ':sdks:java:maven-archetypes:gcp-bom-examples', project ':sdks:java:maven-archetypes:starter', project ':sdks:java:testing:expansion-service', project ':sdks:java:testing:jpms-tests', project ':sdks:java:testing:kafka-service', project ':sdks:java:testing:load-tests', project ':sdks:java:testing:nexmark', project ':sdks:java:testing:test-utils', project ':sdks:java:testing:tpcds', project ':sdks:java:testing:watermarks', project ':sdks:java:transform-service:controller-container', project ':sdks:java:transform-service:launcher', project ':sdks:python:apache_beam:testing', project ':sdks:python:container:py310', project ':sdks:python:container:py311', project ':sdks:python:container:py38', project ':sdks:python:container:py39', project ':sdks:python:test-suites:dataflow', project ':sdks:python:test-suites:direct', project ':sdks:python:test-suites:portable', project ':sdks:python:test-suites:tox', project ':sdks:python:test-suites:xlang', project ':playground:frontend:playground_components:tools:extract_symbols_java', project ':runners:spark:3:job-server:container', project ':sdks:java:extensions:sql:datacatalog', project ':sdks:java:extensions:sql:expansion-service', project ':sdks:java:extensions:sql:hcatalog', project ':sdks:java:extensions:sql:jdbc', project ':sdks:java:extensions:sql:payloads', project ':sdks:java:extensions:sql:perf-tests', project ':sdks:java:extensions:sql:shell', project ':sdks:java:extensions:sql:udf', project ':sdks:java:extensions:sql:udf-test-provider', project ':sdks:java:extensions:sql:zetasql', project ':sdks:java:io:debezium:expansion-service', project ':sdks:java:io:elasticsearch-tests:elasticsearch-tests-2', project ':sdks:java:io:elasticsearch-tests:elasticsearch-tests-5', project ':sdks:java:io:elasticsearch-tests:elasticsearch-tests-6', project ':sdks:java:io:elasticsearch-tests:elasticsearch-tests-7', project ':sdks:java:io:elasticsearch-tests:elasticsearch-tests-8', project ':sdks:java:io:elasticsearch-tests:elasticsearch-tests-common', project ':sdks:java:io:google-cloud-platform:expansion-service', project ':sdks:java:io:kafka:kafka-01103', project ':sdks:java:io:kafka:kafka-100', project ':sdks:java:io:kafka:kafka-111', project ':sdks:java:io:kafka:kafka-201', project ':sdks:java:io:kafka:kafka-211', project ':sdks:java:io:kafka:kafka-222', project ':sdks:java:io:kafka:kafka-231', project ':sdks:java:io:kafka:kafka-241', project ':sdks:java:io:kafka:kafka-251', project ':sdks:java:io:kinesis:expansion-service', project ':sdks:java:io:snowflake:expansion-service', project ':sdks:java:io:sparkreceiver:2', project ':sdks:python:apache_beam:testing:benchmarks', project ':sdks:python:apache_beam:testing:load_tests', project ':sdks:python:test-suites:dataflow:py310', project ':sdks:python:test-suites:dataflow:py311', project ':sdks:python:test-suites:dataflow:py38', project ':sdks:python:test-suites:dataflow:py39', project ':sdks:python:test-suites:direct:py310', project ':sdks:python:test-suites:direct:py311', project ':sdks:python:test-suites:direct:py38', project ':sdks:python:test-suites:direct:py39', project ':sdks:python:test-suites:direct:xlang', project ':sdks:python:test-suites:portable:py310', project ':sdks:python:test-suites:portable:py311', project ':sdks:python:test-suites:portable:py38', project ':sdks:python:test-suites:portable:py39', project ':sdks:python:test-suites:tox:py310', project ':sdks:python:test-suites:tox:py311', project ':sdks:python:test-suites:tox:py38', project ':sdks:python:test-suites:tox:py39', project ':sdks:python:test-suites:tox:pycommon', project ':sdks:python:apache_beam:testing:benchmarks:nexmark']
> Configure project :buildSrc
Evaluating project ':buildSrc' using build file '<https://ci-beam.apache.org/job/beam_PreCommit_PythonDocker_Cron/ws/src/buildSrc/build.gradle.kts'.>
Build cache key for Kotlin DSL plugin specs accessors for classpath 'b12336cc1efc81b6889c17b00eb5e022' is 439034dc1255cd96d5b3be3be4a5fb7f
Skipping Kotlin DSL plugin specs accessors for classpath 'b12336cc1efc81b6889c17b00eb5e022' as it is up-to-date.
Build cache key for Kotlin DSL script compilation (Project/TopLevel/stage1) is b66cb5f5aa7fa9717c9c48018d7b9a1c
Skipping Kotlin DSL script compilation (Project/TopLevel/stage1) as it is up-to-date.
Build cache key for Kotlin DSL accessors for project ':buildSrc' is e906902012c4cc701c4f4ad95f517f2d
Skipping Kotlin DSL accessors for project ':buildSrc' as it is up-to-date.
Build cache key for Kotlin DSL script compilation (Project/TopLevel/stage2) is 67a3fe2cdf3b90ec221f209d06f308c4
Skipping Kotlin DSL script compilation (Project/TopLevel/stage2) as it is up-to-date.
Resolve mutations for :buildSrc:compileJava (Thread[Execution worker,5,main]) started.
:buildSrc:compileJava (Thread[Execution worker,5,main]) started.
> Task :buildSrc:compileJava NO-SOURCE
Skipping task ':buildSrc:compileJava' as it has no source files and no previous output files.
Resolve mutations for :buildSrc:compileGroovy (Thread[Execution worker,5,main]) started.
:buildSrc:compileGroovy (Thread[Execution worker,5,main]) started.
> Task :buildSrc:compileGroovy FROM-CACHE
Build cache key for task ':buildSrc:compileGroovy' is 26c29984037acc4bf8e9fa647d8f1375
Task ':buildSrc:compileGroovy' is not up-to-date because:
No history is available.
Loaded cache entry for task ':buildSrc:compileGroovy' with cache key 26c29984037acc4bf8e9fa647d8f1375
Resolve mutations for :buildSrc:pluginDescriptors (Thread[Execution worker,5,main]) started.
:buildSrc:pluginDescriptors (Thread[Execution worker,5,main]) started.
> Task :buildSrc:pluginDescriptors
Caching disabled for task ':buildSrc:pluginDescriptors' because:
Not worth caching
Task ':buildSrc:pluginDescriptors' is not up-to-date because:
No history is available.
Resolve mutations for :buildSrc:processResources (Thread[Execution worker,5,main]) started.
:buildSrc:processResources (Thread[Execution worker,5,main]) started.
> Task :buildSrc:processResources
Caching disabled for task ':buildSrc:processResources' because:
Not worth caching
Task ':buildSrc:processResources' is not up-to-date because:
No history is available.
file or directory '<https://ci-beam.apache.org/job/beam_PreCommit_PythonDocker_Cron/ws/src/buildSrc/src/main/resources',> not found
Resolve mutations for :buildSrc:classes (Thread[Execution worker,5,main]) started.
:buildSrc:classes (Thread[Execution worker,5,main]) started.
> Task :buildSrc:classes
Skipping task ':buildSrc:classes' as it has no actions.
Resolve mutations for :buildSrc:jar (Thread[Execution worker,5,main]) started.
:buildSrc:jar (Thread[Execution worker,5,main]) started.
> Task :buildSrc:jar
Caching disabled for task ':buildSrc:jar' because:
Not worth caching
Task ':buildSrc:jar' is not up-to-date because:
No history is available.
file or directory '<https://ci-beam.apache.org/job/beam_PreCommit_PythonDocker_Cron/ws/src/buildSrc/build/classes/java/main',> not found
Task path ':pythonDockerBuildPreCommit' matched project ':'
> Configure project :
Evaluating root project 'beam' using build file '<https://ci-beam.apache.org/job/beam_PreCommit_PythonDocker_Cron/ws/src/build.gradle.kts'.>
Build cache key for Kotlin DSL plugin specs accessors for classpath 'a2e9226b33d4a8bd0eef1b447f4abea7' is cb0c05ef87f7b76ec94f231ae59017e0
Skipping Kotlin DSL plugin specs accessors for classpath 'a2e9226b33d4a8bd0eef1b447f4abea7' as it is up-to-date.
Build cache key for Kotlin DSL script compilation (Project/TopLevel/stage1) is 1135f9ba7bff1a77233a0a4c87424d74
Skipping Kotlin DSL script compilation (Project/TopLevel/stage1) as it is up-to-date.
Offline dependencies root configured at 'offline-repository'
Build cache key for Kotlin DSL accessors for root project 'beam' is 050f1ed4b1aade9c4d0e270f9b8999c9
Skipping Kotlin DSL accessors for root project 'beam' as it is up-to-date.
Build cache key for Kotlin DSL script compilation (Project/TopLevel/stage2) is 66ecb0aed2e30c4f8f2a7df66a4206ec
Skipping Kotlin DSL script compilation (Project/TopLevel/stage2) as it is up-to-date.
Task name matched 'pythonDockerBuildPreCommit'
Selected primary task 'pythonDockerBuildPreCommit' from project :
> Configure project :sdks:python:container:py39
Evaluating project ':sdks:python:container:py39' using build file '<https://ci-beam.apache.org/job/beam_PreCommit_PythonDocker_Cron/ws/src/sdks/python/container/py39/build.gradle'.>
Offline dependencies root configured at 'offline-repository'
> Configure project :sdks:python:container:py38
Evaluating project ':sdks:python:container:py38' using build file '<https://ci-beam.apache.org/job/beam_PreCommit_PythonDocker_Cron/ws/src/sdks/python/container/py38/build.gradle'.>
Offline dependencies root configured at 'offline-repository'
> Configure project :sdks:python:container:py310
Evaluating project ':sdks:python:container:py310' using build file '<https://ci-beam.apache.org/job/beam_PreCommit_PythonDocker_Cron/ws/src/sdks/python/container/py310/build.gradle'.>
Offline dependencies root configured at 'offline-repository'
> Configure project :sdks:python:container:py311
Evaluating project ':sdks:python:container:py311' using build file '<https://ci-beam.apache.org/job/beam_PreCommit_PythonDocker_Cron/ws/src/sdks/python/container/py311/build.gradle'.>
Offline dependencies root configured at 'offline-repository'
> Configure project :sdks
Evaluating project ':sdks' using build file '<https://ci-beam.apache.org/job/beam_PreCommit_PythonDocker_Cron/ws/src/sdks/build.gradle'.>
> Configure project :sdks:python
Evaluating project ':sdks:python' using build file '<https://ci-beam.apache.org/job/beam_PreCommit_PythonDocker_Cron/ws/src/sdks/python/build.gradle'.>
Offline dependencies root configured at 'offline-repository'
> Configure project :sdks:python:container
Evaluating project ':sdks:python:container' using build file '<https://ci-beam.apache.org/job/beam_PreCommit_PythonDocker_Cron/ws/src/sdks/python/container/build.gradle'.>
Offline dependencies root configured at 'offline-repository'
> Configure project :release:go-licenses:py
Evaluating project ':release:go-licenses:py' using build file '<https://ci-beam.apache.org/job/beam_PreCommit_PythonDocker_Cron/ws/src/release/go-licenses/py/build.gradle'.>
Offline dependencies root configured at 'offline-repository'
Starting process 'command 'sh''. Working directory: <https://ci-beam.apache.org/job/beam_PreCommit_PythonDocker_Cron/ws/src/sdks/python/container> Command: sh -c <https://ci-beam.apache.org/job/beam_PreCommit_PythonDocker_Cron/ws/src/sdks/go/prepare_go_version.sh> --version go1.21.4
Successfully started process 'command 'sh''
System Go installation: /snap/bin/go is go version go1.16.15 linux/amd64; Preparing to use /home/jenkins/go/bin/go1.21.4
/home/jenkins/go/pkg/mod/golang.org/dl@v0.0.0-20231107201224-8165dcd93058/go1.21.4/main.go:20:8: //go:build comment without // +build comment
FAILURE: Build failed with an exception.
* What went wrong:
Could not determine the dependencies of task ':sdks:python:container:goBuild'.
> Could not create task ':sdks:python:container:goPrepare'.
> Process 'command 'sh'' finished with non-zero exit value 1
* Try:
> Run with --stacktrace option to get the stack trace.
> Run with --debug option to get more log output.
> Get more help at https://help.gradle.org.
Deprecated Gradle features were used in this build, making it incompatible with Gradle 9.0.
You can use '--warning-mode all' to show the individual deprecation warnings and determine if they come from your own scripts or plugins.
For more on this, please refer to https://docs.gradle.org/8.4/userguide/command_line_interface.html#sec:command_line_warnings in the Gradle documentation.
BUILD FAILED in 15s
4 actionable tasks: 3 executed, 1 from cache
Publishing build scan...
https://ge.apache.org/s/uxipukiqcbv6m
Build step 'Invoke Gradle script' changed build result to FAILURE
Build step 'Invoke Gradle script' marked build as failure
---------------------------------------------------------------------
To unsubscribe, e-mail: builds-unsubscribe@beam.apache.org
For additional commands, e-mail: builds-help@beam.apache.org
Jenkins build is back to normal : beam_PreCommit_PythonDocker_Cron #5211
Posted by Apache Jenkins Server <je...@builds.apache.org>.
See <https://ci-beam.apache.org/job/beam_PreCommit_PythonDocker_Cron/5211/display/redirect>
---------------------------------------------------------------------
To unsubscribe, e-mail: builds-unsubscribe@beam.apache.org
For additional commands, e-mail: builds-help@beam.apache.org
Build failed in Jenkins: beam_PreCommit_PythonDocker_Cron #5210
Posted by Apache Jenkins Server <je...@builds.apache.org>.
See <https://ci-beam.apache.org/job/beam_PreCommit_PythonDocker_Cron/5210/display/redirect?page=changes>
Changes:
[noreply] Add getters to CheckResult in IT framework (#29411)
------------------------------------------
Started by timer
Running as SYSTEM
[EnvInject] - Loading node environment variables.
Building remotely on apache-beam-jenkins-2 (beam) in workspace <https://ci-beam.apache.org/job/beam_PreCommit_PythonDocker_Cron/ws/>
The recommended git tool is: NONE
No credentials specified
Wiping out workspace first.
Cloning the remote Git repository
Using shallow clone with depth 1
Avoid fetching tags
Cloning repository https://github.com/apache/beam.git
> git init <https://ci-beam.apache.org/job/beam_PreCommit_PythonDocker_Cron/ws/src> # timeout=10
Fetching upstream changes from https://github.com/apache/beam.git
> git --version # timeout=10
> git --version # 'git version 2.25.1'
> git fetch --no-tags --force --progress --depth=1 -- https://github.com/apache/beam.git +refs/heads/*:refs/remotes/origin/* # timeout=10
> git config remote.origin.url https://github.com/apache/beam.git # timeout=10
> git config --add remote.origin.fetch +refs/heads/*:refs/remotes/origin/* # timeout=10
> git config remote.origin.url https://github.com/apache/beam.git # timeout=10
Using shallow fetch with depth 1
Fetching upstream changes from https://github.com/apache/beam.git
> git fetch --no-tags --force --progress --depth=1 -- https://github.com/apache/beam.git +refs/heads/*:refs/remotes/origin/* +refs/pull/${ghprbPullId}/*:refs/remotes/origin/pr/${ghprbPullId}/* # timeout=10
> git rev-parse origin/master^{commit} # timeout=10
Checking out Revision 8fa5b19f5468c716e16c688994b538cc2abd3811 (origin/master)
> git config core.sparsecheckout # timeout=10
> git checkout -f 8fa5b19f5468c716e16c688994b538cc2abd3811 # timeout=10
Commit message: "Add getters to CheckResult in IT framework (#29411)"
> git rev-list --no-walk 2ad459113134dfffd3caeeb15e821bb644e08663 # timeout=10
No emails were triggered.
[EnvInject] - Executing scripts and injecting environment variables after the SCM step.
[EnvInject] - Injecting as environment variables the properties content
SETUPTOOLS_USE_DISTUTILS=stdlib
SPARK_LOCAL_IP=127.0.0.1
[EnvInject] - Variables injected successfully.
[Gradle] - Launching build.
[src] $ <https://ci-beam.apache.org/job/beam_PreCommit_PythonDocker_Cron/ws/src/gradlew> --info --continue --max-workers=8 -Dorg.gradle.jvmargs=-Xms2g -Dorg.gradle.jvmargs=-Xmx6g -Dorg.gradle.vfs.watch=false -Pdocker-pull-licenses :pythonDockerBuildPreCommit
Initialized native services in: /home/jenkins/.gradle/native
Initialized jansi services in: /home/jenkins/.gradle/native
Received JVM installation metadata from '/usr/lib/jvm/java-8-openjdk-amd64': {JAVA_HOME=/usr/lib/jvm/java-8-openjdk-amd64/jre, JAVA_VERSION=1.8.0_382, JAVA_VENDOR=Private Build, RUNTIME_NAME=OpenJDK Runtime Environment, RUNTIME_VERSION=1.8.0_382-8u382-ga-1~20.04.1-b05, VM_NAME=OpenJDK 64-Bit Server VM, VM_VERSION=25.382-b05, VM_VENDOR=Private Build, OS_ARCH=amd64}
Checking if the launcher JVM can be re-used for build. To be re-used, the launcher JVM needs to match the parameters required for the build process: -Xmx6g -Dfile.encoding=UTF-8 -Duser.country=US -Duser.language=en -Duser.variant
To honour the JVM settings for this build a single-use Daemon process will be forked. For more on this, please refer to https://docs.gradle.org/8.4/userguide/gradle_daemon.html#sec:disabling_the_daemon in the Gradle documentation.
Starting process 'Gradle build daemon'. Working directory: /home/jenkins/.gradle/daemon/8.4 Command: /usr/lib/jvm/java-8-openjdk-amd64/bin/java -Xmx6g -Dfile.encoding=UTF-8 -Duser.country=US -Duser.language=en -Duser.variant -cp /home/jenkins/.gradle/wrapper/dists/gradle-8.4-bin/1w5dpkrfk8irigvoxmyhowfim/gradle-8.4/lib/gradle-launcher-8.4.jar -javaagent:/home/jenkins/.gradle/wrapper/dists/gradle-8.4-bin/1w5dpkrfk8irigvoxmyhowfim/gradle-8.4/lib/agents/gradle-instrumentation-agent-8.4.jar org.gradle.launcher.daemon.bootstrap.GradleDaemon 8.4
Successfully started process 'Gradle build daemon'
An attempt to start the daemon took 1.017 secs.
The client will now receive all logging from the daemon (pid: 670331). The daemon log file: /home/jenkins/.gradle/daemon/8.4/daemon-670331.out.log
Closing daemon's stdin at end of input.
The daemon will no longer process any standard input.
Daemon will be stopped at the end of the build
Using 8 worker leases.
Configuration on demand is an incubating feature.
Received JVM installation metadata from '/usr/lib/jvm/java-8-openjdk-amd64': {JAVA_HOME=/usr/lib/jvm/java-8-openjdk-amd64/jre, JAVA_VERSION=1.8.0_382, JAVA_VENDOR=Private Build, RUNTIME_NAME=OpenJDK Runtime Environment, RUNTIME_VERSION=1.8.0_382-8u382-ga-1~20.04.1-b05, VM_NAME=OpenJDK 64-Bit Server VM, VM_VERSION=25.382-b05, VM_VENDOR=Private Build, OS_ARCH=amd64}
Watching the file system is configured to be disabled
File system watching is inactive
Gradle Enterprise plugins resolution: https://plugins.gradle.org/m2
Starting Build
Skipping Kotlin DSL script compilation (Settings/TopLevel/stage1) as it is up-to-date.
Skipping Kotlin DSL script compilation (Settings/TopLevel/stage2) as it is up-to-date.
Settings evaluated using settings file '<https://ci-beam.apache.org/job/beam_PreCommit_PythonDocker_Cron/ws/src/settings.gradle.kts'.>
Enforcing Gradle Enterprise: https://ge.apache.org, allowUntrustedServer: false
Using local directory build cache for the root build (location = /home/jenkins/.gradle/caches/build-cache-1, removeUnusedEntriesAfter = 7 days).
Using remote HTTP build cache for the root build (allowInsecureProtocol = false, allowUntrustedServer = false, authenticated = true, url = https://beam-cache.apache.org/cache/, useExpectContinue = false).
Projects loaded. Root project using build file '<https://ci-beam.apache.org/job/beam_PreCommit_PythonDocker_Cron/ws/src/build.gradle.kts'.>
Included projects: [root project 'beam', project ':beam-test-gha', project ':beam-test-infra-metrics', project ':beam-test-infra-mock-apis', project ':beam-test-infra-pipelines', project ':beam-test-jenkins', project ':beam-test-tools', project ':beam-validate-runner', project ':com.google.api.gax.batching', project ':examples', project ':it', project ':learning', project ':model', project ':playground', project ':release', project ':runners', project ':sdks', project ':vendor', project ':website', project ':examples:java', project ':examples:kotlin', project ':examples:multi-language', project ':it:cassandra', project ':it:common', project ':it:conditions', project ':it:elasticsearch', project ':it:google-cloud-platform', project ':it:jdbc', project ':it:kafka', project ':it:mongodb', project ':it:neo4j', project ':it:splunk', project ':it:testcontainers', project ':it:truthmatchers', project ':learning:tour-of-beam', project ':model:fn-execution', project ':model:job-management', project ':model:pipeline', project ':playground:backend', project ':playground:frontend', project ':playground:kafka-emulator', project ':playground:terraform', project ':release:go-licenses', project ':runners:core-construction-java', project ':runners:core-java', project ':runners:direct-java', project ':runners:extensions-java', project ':runners:flink', project ':runners:google-cloud-dataflow-java', project ':runners:java-fn-execution', project ':runners:java-job-service', project ':runners:jet', project ':runners:local-java', project ':runners:portability', project ':runners:samza', project ':runners:spark', project ':runners:twister2', project ':sdks:go', project ':sdks:java', project ':sdks:python', project ':sdks:typescript', project ':vendor:bytebuddy-1_12_8', project ':vendor:calcite-1_28_0', project ':vendor:grpc-1_54_0', project ':vendor:guava-32_1_2-jre', project ':examples:java:cdap', project ':examples:java:twitter', project ':learning:tour-of-beam:frontend', project ':learning:tour-of-beam:terraform', project ':playground:backend:containers', project ':playground:frontend:playground_components', project ':release:go-licenses:go', project ':release:go-licenses:java', project ':release:go-licenses:py', project ':runners:extensions-java:metrics', project ':runners:flink:1.12', project ':runners:flink:1.13', project ':runners:flink:1.14', project ':runners:flink:1.15', project ':runners:flink:1.16', project ':runners:google-cloud-dataflow-java:arm', project ':runners:google-cloud-dataflow-java:examples', project ':runners:google-cloud-dataflow-java:examples-streaming', project ':runners:google-cloud-dataflow-java:worker', project ':runners:portability:java', project ':runners:samza:job-server', project ':runners:spark:3', project ':sdks:go:container', project ':sdks:go:examples', project ':sdks:go:test', project ':sdks:java:bom', project ':sdks:java:build-tools', project ':sdks:java:container', project ':sdks:java:core', project ':sdks:java:expansion-service', project ':sdks:java:extensions', project ':sdks:java:fn-execution', project ':sdks:java:harness', project ':sdks:java:io', project ':sdks:java:javadoc', project ':sdks:java:maven-archetypes', project ':sdks:java:testing', project ':sdks:java:transform-service', project ':sdks:python:apache_beam', project ':sdks:python:container', project ':sdks:python:expansion-service-container', project ':sdks:python:test-suites', project ':sdks:typescript:container', project ':examples:java:cdap:hubspot', project ':examples:java:cdap:salesforce', project ':examples:java:cdap:servicenow', project ':examples:java:cdap:zendesk', project ':playground:backend:containers:go', project ':playground:backend:containers:java', project ':playground:backend:containers:python', project ':playground:backend:containers:router', project ':playground:backend:containers:scio', project ':playground:frontend:playground_components:tools', project ':runners:flink:1.12:job-server', project ':runners:flink:1.12:job-server-container', project ':runners:flink:1.13:job-server', project ':runners:flink:1.13:job-server-container', project ':runners:flink:1.14:job-server', project ':runners:flink:1.14:job-server-container', project ':runners:flink:1.15:job-server', project ':runners:flink:1.15:job-server-container', project ':runners:flink:1.16:job-server', project ':runners:flink:1.16:job-server-container', project ':runners:google-cloud-dataflow-java:worker:windmill', project ':runners:spark:3:job-server', project ':sdks:go:test:load', project ':sdks:java:bom:gcp', project ':sdks:java:container:agent', project ':sdks:java:container:java11', project ':sdks:java:container:java17', project ':sdks:java:container:java21', project ':sdks:java:container:java8', project ':sdks:java:core:jmh', project ':sdks:java:expansion-service:app', project ':sdks:java:expansion-service:container', project ':sdks:java:extensions:arrow', project ':sdks:java:extensions:avro', project ':sdks:java:extensions:euphoria', project ':sdks:java:extensions:google-cloud-platform-core', project ':sdks:java:extensions:jackson', project ':sdks:java:extensions:join-library', project ':sdks:java:extensions:kryo', project ':sdks:java:extensions:ml', project ':sdks:java:extensions:protobuf', project ':sdks:java:extensions:python', project ':sdks:java:extensions:sbe', project ':sdks:java:extensions:schemaio-expansion-service', project ':sdks:java:extensions:sketching', project ':sdks:java:extensions:sorter', project ':sdks:java:extensions:sql', project ':sdks:java:extensions:timeseries', project ':sdks:java:extensions:zetasketch', project ':sdks:java:harness:jmh', project ':sdks:java:io:amazon-web-services', project ':sdks:java:io:amazon-web-services2', project ':sdks:java:io:amqp', project ':sdks:java:io:azure', project ':sdks:java:io:azure-cosmos', project ':sdks:java:io:bigquery-io-perf-tests', project ':sdks:java:io:cassandra', project ':sdks:java:io:cdap', project ':sdks:java:io:clickhouse', project ':sdks:java:io:common', project ':sdks:java:io:contextualtextio', project ':sdks:java:io:csv', project ':sdks:java:io:debezium', project ':sdks:java:io:elasticsearch', project ':sdks:java:io:elasticsearch-tests', project ':sdks:java:io:expansion-service', project ':sdks:java:io:file-based-io-tests', project ':sdks:java:io:file-schema-transform', project ':sdks:java:io:google-ads', project ':sdks:java:io:google-cloud-platform', project ':sdks:java:io:hadoop-common', project ':sdks:java:io:hadoop-file-system', project ':sdks:java:io:hadoop-format', project ':sdks:java:io:hbase', project ':sdks:java:io:hcatalog', project ':sdks:java:io:influxdb', project ':sdks:java:io:jdbc', project ':sdks:java:io:jms', project ':sdks:java:io:json', project ':sdks:java:io:kafka', project ':sdks:java:io:kinesis', project ':sdks:java:io:kudu', project ':sdks:java:io:mongodb', project ':sdks:java:io:mqtt', project ':sdks:java:io:neo4j', project ':sdks:java:io:parquet', project ':sdks:java:io:pulsar', project ':sdks:java:io:rabbitmq', project ':sdks:java:io:redis', project ':sdks:java:io:rrio', project ':sdks:java:io:singlestore', project ':sdks:java:io:snowflake', project ':sdks:java:io:solr', project ':sdks:java:io:sparkreceiver', project ':sdks:java:io:splunk', project ':sdks:java:io:synthetic', project ':sdks:java:io:thrift', project ':sdks:java:io:tika', project ':sdks:java:io:xml', project ':sdks:java:maven-archetypes:examples', project ':sdks:java:maven-archetypes:gcp-bom-examples', project ':sdks:java:maven-archetypes:starter', project ':sdks:java:testing:expansion-service', project ':sdks:java:testing:jpms-tests', project ':sdks:java:testing:kafka-service', project ':sdks:java:testing:load-tests', project ':sdks:java:testing:nexmark', project ':sdks:java:testing:test-utils', project ':sdks:java:testing:tpcds', project ':sdks:java:testing:watermarks', project ':sdks:java:transform-service:controller-container', project ':sdks:java:transform-service:launcher', project ':sdks:python:apache_beam:testing', project ':sdks:python:container:py310', project ':sdks:python:container:py311', project ':sdks:python:container:py38', project ':sdks:python:container:py39', project ':sdks:python:test-suites:dataflow', project ':sdks:python:test-suites:direct', project ':sdks:python:test-suites:portable', project ':sdks:python:test-suites:tox', project ':sdks:python:test-suites:xlang', project ':playground:frontend:playground_components:tools:extract_symbols_java', project ':runners:spark:3:job-server:container', project ':sdks:java:extensions:sql:datacatalog', project ':sdks:java:extensions:sql:expansion-service', project ':sdks:java:extensions:sql:hcatalog', project ':sdks:java:extensions:sql:jdbc', project ':sdks:java:extensions:sql:payloads', project ':sdks:java:extensions:sql:perf-tests', project ':sdks:java:extensions:sql:shell', project ':sdks:java:extensions:sql:udf', project ':sdks:java:extensions:sql:udf-test-provider', project ':sdks:java:extensions:sql:zetasql', project ':sdks:java:io:debezium:expansion-service', project ':sdks:java:io:elasticsearch-tests:elasticsearch-tests-2', project ':sdks:java:io:elasticsearch-tests:elasticsearch-tests-5', project ':sdks:java:io:elasticsearch-tests:elasticsearch-tests-6', project ':sdks:java:io:elasticsearch-tests:elasticsearch-tests-7', project ':sdks:java:io:elasticsearch-tests:elasticsearch-tests-8', project ':sdks:java:io:elasticsearch-tests:elasticsearch-tests-common', project ':sdks:java:io:google-cloud-platform:expansion-service', project ':sdks:java:io:kafka:kafka-01103', project ':sdks:java:io:kafka:kafka-100', project ':sdks:java:io:kafka:kafka-111', project ':sdks:java:io:kafka:kafka-201', project ':sdks:java:io:kafka:kafka-211', project ':sdks:java:io:kafka:kafka-222', project ':sdks:java:io:kafka:kafka-231', project ':sdks:java:io:kafka:kafka-241', project ':sdks:java:io:kafka:kafka-251', project ':sdks:java:io:kinesis:expansion-service', project ':sdks:java:io:snowflake:expansion-service', project ':sdks:java:io:sparkreceiver:2', project ':sdks:python:apache_beam:testing:benchmarks', project ':sdks:python:apache_beam:testing:load_tests', project ':sdks:python:test-suites:dataflow:py310', project ':sdks:python:test-suites:dataflow:py311', project ':sdks:python:test-suites:dataflow:py38', project ':sdks:python:test-suites:dataflow:py39', project ':sdks:python:test-suites:direct:py310', project ':sdks:python:test-suites:direct:py311', project ':sdks:python:test-suites:direct:py38', project ':sdks:python:test-suites:direct:py39', project ':sdks:python:test-suites:direct:xlang', project ':sdks:python:test-suites:portable:py310', project ':sdks:python:test-suites:portable:py311', project ':sdks:python:test-suites:portable:py38', project ':sdks:python:test-suites:portable:py39', project ':sdks:python:test-suites:tox:py310', project ':sdks:python:test-suites:tox:py311', project ':sdks:python:test-suites:tox:py38', project ':sdks:python:test-suites:tox:py39', project ':sdks:python:test-suites:tox:pycommon', project ':sdks:python:apache_beam:testing:benchmarks:nexmark']
> Configure project :buildSrc
Evaluating project ':buildSrc' using build file '<https://ci-beam.apache.org/job/beam_PreCommit_PythonDocker_Cron/ws/src/buildSrc/build.gradle.kts'.>
Build cache key for Kotlin DSL plugin specs accessors for classpath 'b12336cc1efc81b6889c17b00eb5e022' is 439034dc1255cd96d5b3be3be4a5fb7f
Skipping Kotlin DSL plugin specs accessors for classpath 'b12336cc1efc81b6889c17b00eb5e022' as it is up-to-date.
Build cache key for Kotlin DSL script compilation (Project/TopLevel/stage1) is b66cb5f5aa7fa9717c9c48018d7b9a1c
Skipping Kotlin DSL script compilation (Project/TopLevel/stage1) as it is up-to-date.
Build cache key for Kotlin DSL accessors for project ':buildSrc' is e906902012c4cc701c4f4ad95f517f2d
Skipping Kotlin DSL accessors for project ':buildSrc' as it is up-to-date.
Build cache key for Kotlin DSL script compilation (Project/TopLevel/stage2) is 67a3fe2cdf3b90ec221f209d06f308c4
Skipping Kotlin DSL script compilation (Project/TopLevel/stage2) as it is up-to-date.
Resolve mutations for :buildSrc:compileJava (Thread[Execution worker,5,main]) started.
:buildSrc:compileJava (Thread[Execution worker,5,main]) started.
> Task :buildSrc:compileJava NO-SOURCE
Skipping task ':buildSrc:compileJava' as it has no source files and no previous output files.
Resolve mutations for :buildSrc:compileGroovy (Thread[Execution worker,5,main]) started.
:buildSrc:compileGroovy (Thread[Execution worker,5,main]) started.
> Task :buildSrc:compileGroovy FROM-CACHE
Build cache key for task ':buildSrc:compileGroovy' is 26c29984037acc4bf8e9fa647d8f1375
Task ':buildSrc:compileGroovy' is not up-to-date because:
No history is available.
Loaded cache entry for task ':buildSrc:compileGroovy' with cache key 26c29984037acc4bf8e9fa647d8f1375
Resolve mutations for :buildSrc:pluginDescriptors (Thread[Execution worker,5,main]) started.
:buildSrc:pluginDescriptors (Thread[Execution worker,5,main]) started.
> Task :buildSrc:pluginDescriptors
Caching disabled for task ':buildSrc:pluginDescriptors' because:
Not worth caching
Task ':buildSrc:pluginDescriptors' is not up-to-date because:
No history is available.
Resolve mutations for :buildSrc:processResources (Thread[Execution worker,5,main]) started.
:buildSrc:processResources (Thread[Execution worker,5,main]) started.
> Task :buildSrc:processResources
Caching disabled for task ':buildSrc:processResources' because:
Not worth caching
Task ':buildSrc:processResources' is not up-to-date because:
No history is available.
file or directory '<https://ci-beam.apache.org/job/beam_PreCommit_PythonDocker_Cron/ws/src/buildSrc/src/main/resources',> not found
Resolve mutations for :buildSrc:classes (Thread[Execution worker,5,main]) started.
:buildSrc:classes (Thread[Execution worker,5,main]) started.
> Task :buildSrc:classes
Skipping task ':buildSrc:classes' as it has no actions.
Resolve mutations for :buildSrc:jar (Thread[Execution worker,5,main]) started.
:buildSrc:jar (Thread[Execution worker,5,main]) started.
> Task :buildSrc:jar
Caching disabled for task ':buildSrc:jar' because:
Not worth caching
Task ':buildSrc:jar' is not up-to-date because:
No history is available.
file or directory '<https://ci-beam.apache.org/job/beam_PreCommit_PythonDocker_Cron/ws/src/buildSrc/build/classes/java/main',> not found
Task path ':pythonDockerBuildPreCommit' matched project ':'
> Configure project :
Evaluating root project 'beam' using build file '<https://ci-beam.apache.org/job/beam_PreCommit_PythonDocker_Cron/ws/src/build.gradle.kts'.>
Build cache key for Kotlin DSL plugin specs accessors for classpath 'a2e9226b33d4a8bd0eef1b447f4abea7' is cb0c05ef87f7b76ec94f231ae59017e0
Skipping Kotlin DSL plugin specs accessors for classpath 'a2e9226b33d4a8bd0eef1b447f4abea7' as it is up-to-date.
Build cache key for Kotlin DSL script compilation (Project/TopLevel/stage1) is 1135f9ba7bff1a77233a0a4c87424d74
Skipping Kotlin DSL script compilation (Project/TopLevel/stage1) as it is up-to-date.
Offline dependencies root configured at 'offline-repository'
Build cache key for Kotlin DSL accessors for root project 'beam' is 050f1ed4b1aade9c4d0e270f9b8999c9
Skipping Kotlin DSL accessors for root project 'beam' as it is up-to-date.
Build cache key for Kotlin DSL script compilation (Project/TopLevel/stage2) is 66ecb0aed2e30c4f8f2a7df66a4206ec
Skipping Kotlin DSL script compilation (Project/TopLevel/stage2) as it is up-to-date.
Task name matched 'pythonDockerBuildPreCommit'
Selected primary task 'pythonDockerBuildPreCommit' from project :
> Configure project :sdks:python:container:py39
Evaluating project ':sdks:python:container:py39' using build file '<https://ci-beam.apache.org/job/beam_PreCommit_PythonDocker_Cron/ws/src/sdks/python/container/py39/build.gradle'.>
Offline dependencies root configured at 'offline-repository'
> Configure project :sdks:python:container:py38
Evaluating project ':sdks:python:container:py38' using build file '<https://ci-beam.apache.org/job/beam_PreCommit_PythonDocker_Cron/ws/src/sdks/python/container/py38/build.gradle'.>
Offline dependencies root configured at 'offline-repository'
> Configure project :sdks:python:container:py310
Evaluating project ':sdks:python:container:py310' using build file '<https://ci-beam.apache.org/job/beam_PreCommit_PythonDocker_Cron/ws/src/sdks/python/container/py310/build.gradle'.>
Offline dependencies root configured at 'offline-repository'
> Configure project :sdks:python:container:py311
Evaluating project ':sdks:python:container:py311' using build file '<https://ci-beam.apache.org/job/beam_PreCommit_PythonDocker_Cron/ws/src/sdks/python/container/py311/build.gradle'.>
Offline dependencies root configured at 'offline-repository'
> Configure project :sdks
Evaluating project ':sdks' using build file '<https://ci-beam.apache.org/job/beam_PreCommit_PythonDocker_Cron/ws/src/sdks/build.gradle'.>
> Configure project :sdks:python
Evaluating project ':sdks:python' using build file '<https://ci-beam.apache.org/job/beam_PreCommit_PythonDocker_Cron/ws/src/sdks/python/build.gradle'.>
Offline dependencies root configured at 'offline-repository'
> Configure project :sdks:python:container
Evaluating project ':sdks:python:container' using build file '<https://ci-beam.apache.org/job/beam_PreCommit_PythonDocker_Cron/ws/src/sdks/python/container/build.gradle'.>
Offline dependencies root configured at 'offline-repository'
> Configure project :release:go-licenses:py
Evaluating project ':release:go-licenses:py' using build file '<https://ci-beam.apache.org/job/beam_PreCommit_PythonDocker_Cron/ws/src/release/go-licenses/py/build.gradle'.>
Offline dependencies root configured at 'offline-repository'
Starting process 'command 'sh''. Working directory: <https://ci-beam.apache.org/job/beam_PreCommit_PythonDocker_Cron/ws/src/sdks/python/container> Command: sh -c <https://ci-beam.apache.org/job/beam_PreCommit_PythonDocker_Cron/ws/src/sdks/go/prepare_go_version.sh> --version go1.21.4
Successfully started process 'command 'sh''
System Go installation: /snap/bin/go is go version go1.16.15 linux/amd64; Preparing to use /home/jenkins/go/bin/go1.21.4
/home/jenkins/go/pkg/mod/golang.org/dl@v0.0.0-20231107201224-8165dcd93058/go1.21.4/main.go:20:8: //go:build comment without // +build comment
FAILURE: Build failed with an exception.
* What went wrong:
Could not determine the dependencies of task ':sdks:python:container:goBuild'.
> Could not create task ':sdks:python:container:goPrepare'.
> Process 'command 'sh'' finished with non-zero exit value 1
* Try:
> Run with --stacktrace option to get the stack trace.
> Run with --debug option to get more log output.
> Get more help at https://help.gradle.org.
Deprecated Gradle features were used in this build, making it incompatible with Gradle 9.0.
You can use '--warning-mode all' to show the individual deprecation warnings and determine if they come from your own scripts or plugins.
For more on this, please refer to https://docs.gradle.org/8.4/userguide/command_line_interface.html#sec:command_line_warnings in the Gradle documentation.
BUILD FAILED in 12s
4 actionable tasks: 3 executed, 1 from cache
Publishing build scan...
https://ge.apache.org/s/5qg3cubdebwza
Build step 'Invoke Gradle script' changed build result to FAILURE
Build step 'Invoke Gradle script' marked build as failure
---------------------------------------------------------------------
To unsubscribe, e-mail: builds-unsubscribe@beam.apache.org
For additional commands, e-mail: builds-help@beam.apache.org
Build failed in Jenkins: beam_PreCommit_PythonDocker_Cron #5209
Posted by Apache Jenkins Server <je...@builds.apache.org>.
See <https://ci-beam.apache.org/job/beam_PreCommit_PythonDocker_Cron/5209/display/redirect>
Changes:
------------------------------------------
Started by timer
Running as SYSTEM
[EnvInject] - Loading node environment variables.
Building remotely on apache-beam-jenkins-2 (beam) in workspace <https://ci-beam.apache.org/job/beam_PreCommit_PythonDocker_Cron/ws/>
The recommended git tool is: NONE
No credentials specified
Wiping out workspace first.
Cloning the remote Git repository
Using shallow clone with depth 1
Avoid fetching tags
Cloning repository https://github.com/apache/beam.git
> git init <https://ci-beam.apache.org/job/beam_PreCommit_PythonDocker_Cron/ws/src> # timeout=10
Fetching upstream changes from https://github.com/apache/beam.git
> git --version # timeout=10
> git --version # 'git version 2.25.1'
> git fetch --no-tags --force --progress --depth=1 -- https://github.com/apache/beam.git +refs/heads/*:refs/remotes/origin/* # timeout=10
> git config remote.origin.url https://github.com/apache/beam.git # timeout=10
> git config --add remote.origin.fetch +refs/heads/*:refs/remotes/origin/* # timeout=10
> git config remote.origin.url https://github.com/apache/beam.git # timeout=10
Using shallow fetch with depth 1
Fetching upstream changes from https://github.com/apache/beam.git
> git fetch --no-tags --force --progress --depth=1 -- https://github.com/apache/beam.git +refs/heads/*:refs/remotes/origin/* +refs/pull/${ghprbPullId}/*:refs/remotes/origin/pr/${ghprbPullId}/* # timeout=10
> git rev-parse origin/master^{commit} # timeout=10
Checking out Revision 2ad459113134dfffd3caeeb15e821bb644e08663 (origin/master)
> git config core.sparsecheckout # timeout=10
> git checkout -f 2ad459113134dfffd3caeeb15e821bb644e08663 # timeout=10
Commit message: "[YAML] - Kafka Read and Write proto (#29368)"
> git rev-list --no-walk 2ad459113134dfffd3caeeb15e821bb644e08663 # timeout=10
No emails were triggered.
[EnvInject] - Executing scripts and injecting environment variables after the SCM step.
[EnvInject] - Injecting as environment variables the properties content
SETUPTOOLS_USE_DISTUTILS=stdlib
SPARK_LOCAL_IP=127.0.0.1
[EnvInject] - Variables injected successfully.
[Gradle] - Launching build.
[src] $ <https://ci-beam.apache.org/job/beam_PreCommit_PythonDocker_Cron/ws/src/gradlew> --info --continue --max-workers=8 -Dorg.gradle.jvmargs=-Xms2g -Dorg.gradle.jvmargs=-Xmx6g -Dorg.gradle.vfs.watch=false -Pdocker-pull-licenses :pythonDockerBuildPreCommit
Initialized native services in: /home/jenkins/.gradle/native
Initialized jansi services in: /home/jenkins/.gradle/native
Received JVM installation metadata from '/usr/lib/jvm/java-8-openjdk-amd64': {JAVA_HOME=/usr/lib/jvm/java-8-openjdk-amd64/jre, JAVA_VERSION=1.8.0_382, JAVA_VENDOR=Private Build, RUNTIME_NAME=OpenJDK Runtime Environment, RUNTIME_VERSION=1.8.0_382-8u382-ga-1~20.04.1-b05, VM_NAME=OpenJDK 64-Bit Server VM, VM_VERSION=25.382-b05, VM_VENDOR=Private Build, OS_ARCH=amd64}
Checking if the launcher JVM can be re-used for build. To be re-used, the launcher JVM needs to match the parameters required for the build process: -Xmx6g -Dfile.encoding=UTF-8 -Duser.country=US -Duser.language=en -Duser.variant
To honour the JVM settings for this build a single-use Daemon process will be forked. For more on this, please refer to https://docs.gradle.org/8.4/userguide/gradle_daemon.html#sec:disabling_the_daemon in the Gradle documentation.
Starting process 'Gradle build daemon'. Working directory: /home/jenkins/.gradle/daemon/8.4 Command: /usr/lib/jvm/java-8-openjdk-amd64/bin/java -Xmx6g -Dfile.encoding=UTF-8 -Duser.country=US -Duser.language=en -Duser.variant -cp /home/jenkins/.gradle/wrapper/dists/gradle-8.4-bin/1w5dpkrfk8irigvoxmyhowfim/gradle-8.4/lib/gradle-launcher-8.4.jar -javaagent:/home/jenkins/.gradle/wrapper/dists/gradle-8.4-bin/1w5dpkrfk8irigvoxmyhowfim/gradle-8.4/lib/agents/gradle-instrumentation-agent-8.4.jar org.gradle.launcher.daemon.bootstrap.GradleDaemon 8.4
Successfully started process 'Gradle build daemon'
An attempt to start the daemon took 1.009 secs.
The client will now receive all logging from the daemon (pid: 664656). The daemon log file: /home/jenkins/.gradle/daemon/8.4/daemon-664656.out.log
Closing daemon's stdin at end of input.
The daemon will no longer process any standard input.
Daemon will be stopped at the end of the build
Using 8 worker leases.
Configuration on demand is an incubating feature.
Received JVM installation metadata from '/usr/lib/jvm/java-8-openjdk-amd64': {JAVA_HOME=/usr/lib/jvm/java-8-openjdk-amd64/jre, JAVA_VERSION=1.8.0_382, JAVA_VENDOR=Private Build, RUNTIME_NAME=OpenJDK Runtime Environment, RUNTIME_VERSION=1.8.0_382-8u382-ga-1~20.04.1-b05, VM_NAME=OpenJDK 64-Bit Server VM, VM_VERSION=25.382-b05, VM_VENDOR=Private Build, OS_ARCH=amd64}
Watching the file system is configured to be disabled
File system watching is inactive
Gradle Enterprise plugins resolution: https://plugins.gradle.org/m2
Starting Build
Skipping Kotlin DSL script compilation (Settings/TopLevel/stage1) as it is up-to-date.
Skipping Kotlin DSL script compilation (Settings/TopLevel/stage2) as it is up-to-date.
Settings evaluated using settings file '<https://ci-beam.apache.org/job/beam_PreCommit_PythonDocker_Cron/ws/src/settings.gradle.kts'.>
Enforcing Gradle Enterprise: https://ge.apache.org, allowUntrustedServer: false
Using local directory build cache for the root build (location = /home/jenkins/.gradle/caches/build-cache-1, removeUnusedEntriesAfter = 7 days).
Using remote HTTP build cache for the root build (allowInsecureProtocol = false, allowUntrustedServer = false, authenticated = true, url = https://beam-cache.apache.org/cache/, useExpectContinue = false).
Projects loaded. Root project using build file '<https://ci-beam.apache.org/job/beam_PreCommit_PythonDocker_Cron/ws/src/build.gradle.kts'.>
Included projects: [root project 'beam', project ':beam-test-gha', project ':beam-test-infra-metrics', project ':beam-test-infra-mock-apis', project ':beam-test-infra-pipelines', project ':beam-test-jenkins', project ':beam-test-tools', project ':beam-validate-runner', project ':com.google.api.gax.batching', project ':examples', project ':it', project ':learning', project ':model', project ':playground', project ':release', project ':runners', project ':sdks', project ':vendor', project ':website', project ':examples:java', project ':examples:kotlin', project ':examples:multi-language', project ':it:cassandra', project ':it:common', project ':it:conditions', project ':it:elasticsearch', project ':it:google-cloud-platform', project ':it:jdbc', project ':it:kafka', project ':it:mongodb', project ':it:neo4j', project ':it:splunk', project ':it:testcontainers', project ':it:truthmatchers', project ':learning:tour-of-beam', project ':model:fn-execution', project ':model:job-management', project ':model:pipeline', project ':playground:backend', project ':playground:frontend', project ':playground:kafka-emulator', project ':playground:terraform', project ':release:go-licenses', project ':runners:core-construction-java', project ':runners:core-java', project ':runners:direct-java', project ':runners:extensions-java', project ':runners:flink', project ':runners:google-cloud-dataflow-java', project ':runners:java-fn-execution', project ':runners:java-job-service', project ':runners:jet', project ':runners:local-java', project ':runners:portability', project ':runners:samza', project ':runners:spark', project ':runners:twister2', project ':sdks:go', project ':sdks:java', project ':sdks:python', project ':sdks:typescript', project ':vendor:bytebuddy-1_12_8', project ':vendor:calcite-1_28_0', project ':vendor:grpc-1_54_0', project ':vendor:guava-32_1_2-jre', project ':examples:java:cdap', project ':examples:java:twitter', project ':learning:tour-of-beam:frontend', project ':learning:tour-of-beam:terraform', project ':playground:backend:containers', project ':playground:frontend:playground_components', project ':release:go-licenses:go', project ':release:go-licenses:java', project ':release:go-licenses:py', project ':runners:extensions-java:metrics', project ':runners:flink:1.12', project ':runners:flink:1.13', project ':runners:flink:1.14', project ':runners:flink:1.15', project ':runners:flink:1.16', project ':runners:google-cloud-dataflow-java:arm', project ':runners:google-cloud-dataflow-java:examples', project ':runners:google-cloud-dataflow-java:examples-streaming', project ':runners:google-cloud-dataflow-java:worker', project ':runners:portability:java', project ':runners:samza:job-server', project ':runners:spark:3', project ':sdks:go:container', project ':sdks:go:examples', project ':sdks:go:test', project ':sdks:java:bom', project ':sdks:java:build-tools', project ':sdks:java:container', project ':sdks:java:core', project ':sdks:java:expansion-service', project ':sdks:java:extensions', project ':sdks:java:fn-execution', project ':sdks:java:harness', project ':sdks:java:io', project ':sdks:java:javadoc', project ':sdks:java:maven-archetypes', project ':sdks:java:testing', project ':sdks:java:transform-service', project ':sdks:python:apache_beam', project ':sdks:python:container', project ':sdks:python:expansion-service-container', project ':sdks:python:test-suites', project ':sdks:typescript:container', project ':examples:java:cdap:hubspot', project ':examples:java:cdap:salesforce', project ':examples:java:cdap:servicenow', project ':examples:java:cdap:zendesk', project ':playground:backend:containers:go', project ':playground:backend:containers:java', project ':playground:backend:containers:python', project ':playground:backend:containers:router', project ':playground:backend:containers:scio', project ':playground:frontend:playground_components:tools', project ':runners:flink:1.12:job-server', project ':runners:flink:1.12:job-server-container', project ':runners:flink:1.13:job-server', project ':runners:flink:1.13:job-server-container', project ':runners:flink:1.14:job-server', project ':runners:flink:1.14:job-server-container', project ':runners:flink:1.15:job-server', project ':runners:flink:1.15:job-server-container', project ':runners:flink:1.16:job-server', project ':runners:flink:1.16:job-server-container', project ':runners:google-cloud-dataflow-java:worker:windmill', project ':runners:spark:3:job-server', project ':sdks:go:test:load', project ':sdks:java:bom:gcp', project ':sdks:java:container:agent', project ':sdks:java:container:java11', project ':sdks:java:container:java17', project ':sdks:java:container:java21', project ':sdks:java:container:java8', project ':sdks:java:core:jmh', project ':sdks:java:expansion-service:app', project ':sdks:java:expansion-service:container', project ':sdks:java:extensions:arrow', project ':sdks:java:extensions:avro', project ':sdks:java:extensions:euphoria', project ':sdks:java:extensions:google-cloud-platform-core', project ':sdks:java:extensions:jackson', project ':sdks:java:extensions:join-library', project ':sdks:java:extensions:kryo', project ':sdks:java:extensions:ml', project ':sdks:java:extensions:protobuf', project ':sdks:java:extensions:python', project ':sdks:java:extensions:sbe', project ':sdks:java:extensions:schemaio-expansion-service', project ':sdks:java:extensions:sketching', project ':sdks:java:extensions:sorter', project ':sdks:java:extensions:sql', project ':sdks:java:extensions:timeseries', project ':sdks:java:extensions:zetasketch', project ':sdks:java:harness:jmh', project ':sdks:java:io:amazon-web-services', project ':sdks:java:io:amazon-web-services2', project ':sdks:java:io:amqp', project ':sdks:java:io:azure', project ':sdks:java:io:azure-cosmos', project ':sdks:java:io:bigquery-io-perf-tests', project ':sdks:java:io:cassandra', project ':sdks:java:io:cdap', project ':sdks:java:io:clickhouse', project ':sdks:java:io:common', project ':sdks:java:io:contextualtextio', project ':sdks:java:io:csv', project ':sdks:java:io:debezium', project ':sdks:java:io:elasticsearch', project ':sdks:java:io:elasticsearch-tests', project ':sdks:java:io:expansion-service', project ':sdks:java:io:file-based-io-tests', project ':sdks:java:io:file-schema-transform', project ':sdks:java:io:google-ads', project ':sdks:java:io:google-cloud-platform', project ':sdks:java:io:hadoop-common', project ':sdks:java:io:hadoop-file-system', project ':sdks:java:io:hadoop-format', project ':sdks:java:io:hbase', project ':sdks:java:io:hcatalog', project ':sdks:java:io:influxdb', project ':sdks:java:io:jdbc', project ':sdks:java:io:jms', project ':sdks:java:io:json', project ':sdks:java:io:kafka', project ':sdks:java:io:kinesis', project ':sdks:java:io:kudu', project ':sdks:java:io:mongodb', project ':sdks:java:io:mqtt', project ':sdks:java:io:neo4j', project ':sdks:java:io:parquet', project ':sdks:java:io:pulsar', project ':sdks:java:io:rabbitmq', project ':sdks:java:io:redis', project ':sdks:java:io:rrio', project ':sdks:java:io:singlestore', project ':sdks:java:io:snowflake', project ':sdks:java:io:solr', project ':sdks:java:io:sparkreceiver', project ':sdks:java:io:splunk', project ':sdks:java:io:synthetic', project ':sdks:java:io:thrift', project ':sdks:java:io:tika', project ':sdks:java:io:xml', project ':sdks:java:maven-archetypes:examples', project ':sdks:java:maven-archetypes:gcp-bom-examples', project ':sdks:java:maven-archetypes:starter', project ':sdks:java:testing:expansion-service', project ':sdks:java:testing:jpms-tests', project ':sdks:java:testing:kafka-service', project ':sdks:java:testing:load-tests', project ':sdks:java:testing:nexmark', project ':sdks:java:testing:test-utils', project ':sdks:java:testing:tpcds', project ':sdks:java:testing:watermarks', project ':sdks:java:transform-service:controller-container', project ':sdks:java:transform-service:launcher', project ':sdks:python:apache_beam:testing', project ':sdks:python:container:py310', project ':sdks:python:container:py311', project ':sdks:python:container:py38', project ':sdks:python:container:py39', project ':sdks:python:test-suites:dataflow', project ':sdks:python:test-suites:direct', project ':sdks:python:test-suites:portable', project ':sdks:python:test-suites:tox', project ':sdks:python:test-suites:xlang', project ':playground:frontend:playground_components:tools:extract_symbols_java', project ':runners:spark:3:job-server:container', project ':sdks:java:extensions:sql:datacatalog', project ':sdks:java:extensions:sql:expansion-service', project ':sdks:java:extensions:sql:hcatalog', project ':sdks:java:extensions:sql:jdbc', project ':sdks:java:extensions:sql:payloads', project ':sdks:java:extensions:sql:perf-tests', project ':sdks:java:extensions:sql:shell', project ':sdks:java:extensions:sql:udf', project ':sdks:java:extensions:sql:udf-test-provider', project ':sdks:java:extensions:sql:zetasql', project ':sdks:java:io:debezium:expansion-service', project ':sdks:java:io:elasticsearch-tests:elasticsearch-tests-2', project ':sdks:java:io:elasticsearch-tests:elasticsearch-tests-5', project ':sdks:java:io:elasticsearch-tests:elasticsearch-tests-6', project ':sdks:java:io:elasticsearch-tests:elasticsearch-tests-7', project ':sdks:java:io:elasticsearch-tests:elasticsearch-tests-8', project ':sdks:java:io:elasticsearch-tests:elasticsearch-tests-common', project ':sdks:java:io:google-cloud-platform:expansion-service', project ':sdks:java:io:kafka:kafka-01103', project ':sdks:java:io:kafka:kafka-100', project ':sdks:java:io:kafka:kafka-111', project ':sdks:java:io:kafka:kafka-201', project ':sdks:java:io:kafka:kafka-211', project ':sdks:java:io:kafka:kafka-222', project ':sdks:java:io:kafka:kafka-231', project ':sdks:java:io:kafka:kafka-241', project ':sdks:java:io:kafka:kafka-251', project ':sdks:java:io:kinesis:expansion-service', project ':sdks:java:io:snowflake:expansion-service', project ':sdks:java:io:sparkreceiver:2', project ':sdks:python:apache_beam:testing:benchmarks', project ':sdks:python:apache_beam:testing:load_tests', project ':sdks:python:test-suites:dataflow:py310', project ':sdks:python:test-suites:dataflow:py311', project ':sdks:python:test-suites:dataflow:py38', project ':sdks:python:test-suites:dataflow:py39', project ':sdks:python:test-suites:direct:py310', project ':sdks:python:test-suites:direct:py311', project ':sdks:python:test-suites:direct:py38', project ':sdks:python:test-suites:direct:py39', project ':sdks:python:test-suites:direct:xlang', project ':sdks:python:test-suites:portable:py310', project ':sdks:python:test-suites:portable:py311', project ':sdks:python:test-suites:portable:py38', project ':sdks:python:test-suites:portable:py39', project ':sdks:python:test-suites:tox:py310', project ':sdks:python:test-suites:tox:py311', project ':sdks:python:test-suites:tox:py38', project ':sdks:python:test-suites:tox:py39', project ':sdks:python:test-suites:tox:pycommon', project ':sdks:python:apache_beam:testing:benchmarks:nexmark']
> Configure project :buildSrc
Evaluating project ':buildSrc' using build file '<https://ci-beam.apache.org/job/beam_PreCommit_PythonDocker_Cron/ws/src/buildSrc/build.gradle.kts'.>
Build cache key for Kotlin DSL plugin specs accessors for classpath 'b12336cc1efc81b6889c17b00eb5e022' is 439034dc1255cd96d5b3be3be4a5fb7f
Skipping Kotlin DSL plugin specs accessors for classpath 'b12336cc1efc81b6889c17b00eb5e022' as it is up-to-date.
Build cache key for Kotlin DSL script compilation (Project/TopLevel/stage1) is b66cb5f5aa7fa9717c9c48018d7b9a1c
Skipping Kotlin DSL script compilation (Project/TopLevel/stage1) as it is up-to-date.
Build cache key for Kotlin DSL accessors for project ':buildSrc' is e906902012c4cc701c4f4ad95f517f2d
Skipping Kotlin DSL accessors for project ':buildSrc' as it is up-to-date.
Build cache key for Kotlin DSL script compilation (Project/TopLevel/stage2) is 67a3fe2cdf3b90ec221f209d06f308c4
Skipping Kotlin DSL script compilation (Project/TopLevel/stage2) as it is up-to-date.
Resolve mutations for :buildSrc:compileJava (Thread[Execution worker,5,main]) started.
:buildSrc:compileJava (Thread[Execution worker,5,main]) started.
> Task :buildSrc:compileJava NO-SOURCE
Skipping task ':buildSrc:compileJava' as it has no source files and no previous output files.
Resolve mutations for :buildSrc:compileGroovy (Thread[Execution worker,5,main]) started.
:buildSrc:compileGroovy (Thread[Execution worker,5,main]) started.
> Task :buildSrc:compileGroovy FROM-CACHE
Build cache key for task ':buildSrc:compileGroovy' is 26c29984037acc4bf8e9fa647d8f1375
Task ':buildSrc:compileGroovy' is not up-to-date because:
No history is available.
Loaded cache entry for task ':buildSrc:compileGroovy' with cache key 26c29984037acc4bf8e9fa647d8f1375
Resolve mutations for :buildSrc:pluginDescriptors (Thread[Execution worker,5,main]) started.
:buildSrc:pluginDescriptors (Thread[Execution worker,5,main]) started.
> Task :buildSrc:pluginDescriptors
Caching disabled for task ':buildSrc:pluginDescriptors' because:
Not worth caching
Task ':buildSrc:pluginDescriptors' is not up-to-date because:
No history is available.
Resolve mutations for :buildSrc:processResources (Thread[Execution worker,5,main]) started.
:buildSrc:processResources (Thread[Execution worker,5,main]) started.
> Task :buildSrc:processResources
Caching disabled for task ':buildSrc:processResources' because:
Not worth caching
Task ':buildSrc:processResources' is not up-to-date because:
No history is available.
file or directory '<https://ci-beam.apache.org/job/beam_PreCommit_PythonDocker_Cron/ws/src/buildSrc/src/main/resources',> not found
Resolve mutations for :buildSrc:classes (Thread[Execution worker,5,main]) started.
:buildSrc:classes (Thread[Execution worker,5,main]) started.
> Task :buildSrc:classes
Skipping task ':buildSrc:classes' as it has no actions.
Resolve mutations for :buildSrc:jar (Thread[Execution worker,5,main]) started.
:buildSrc:jar (Thread[Execution worker,5,main]) started.
> Task :buildSrc:jar
Caching disabled for task ':buildSrc:jar' because:
Not worth caching
Task ':buildSrc:jar' is not up-to-date because:
No history is available.
file or directory '<https://ci-beam.apache.org/job/beam_PreCommit_PythonDocker_Cron/ws/src/buildSrc/build/classes/java/main',> not found
Task path ':pythonDockerBuildPreCommit' matched project ':'
> Configure project :
Evaluating root project 'beam' using build file '<https://ci-beam.apache.org/job/beam_PreCommit_PythonDocker_Cron/ws/src/build.gradle.kts'.>
Build cache key for Kotlin DSL plugin specs accessors for classpath 'a2e9226b33d4a8bd0eef1b447f4abea7' is cb0c05ef87f7b76ec94f231ae59017e0
Skipping Kotlin DSL plugin specs accessors for classpath 'a2e9226b33d4a8bd0eef1b447f4abea7' as it is up-to-date.
Build cache key for Kotlin DSL script compilation (Project/TopLevel/stage1) is 1135f9ba7bff1a77233a0a4c87424d74
Skipping Kotlin DSL script compilation (Project/TopLevel/stage1) as it is up-to-date.
Offline dependencies root configured at 'offline-repository'
Build cache key for Kotlin DSL accessors for root project 'beam' is 050f1ed4b1aade9c4d0e270f9b8999c9
Skipping Kotlin DSL accessors for root project 'beam' as it is up-to-date.
Build cache key for Kotlin DSL script compilation (Project/TopLevel/stage2) is 66ecb0aed2e30c4f8f2a7df66a4206ec
Skipping Kotlin DSL script compilation (Project/TopLevel/stage2) as it is up-to-date.
Task name matched 'pythonDockerBuildPreCommit'
Selected primary task 'pythonDockerBuildPreCommit' from project :
> Configure project :sdks:python:container:py39
Evaluating project ':sdks:python:container:py39' using build file '<https://ci-beam.apache.org/job/beam_PreCommit_PythonDocker_Cron/ws/src/sdks/python/container/py39/build.gradle'.>
Offline dependencies root configured at 'offline-repository'
> Configure project :sdks:python:container:py38
Evaluating project ':sdks:python:container:py38' using build file '<https://ci-beam.apache.org/job/beam_PreCommit_PythonDocker_Cron/ws/src/sdks/python/container/py38/build.gradle'.>
Offline dependencies root configured at 'offline-repository'
> Configure project :sdks:python:container:py310
Evaluating project ':sdks:python:container:py310' using build file '<https://ci-beam.apache.org/job/beam_PreCommit_PythonDocker_Cron/ws/src/sdks/python/container/py310/build.gradle'.>
Offline dependencies root configured at 'offline-repository'
> Configure project :sdks:python:container:py311
Evaluating project ':sdks:python:container:py311' using build file '<https://ci-beam.apache.org/job/beam_PreCommit_PythonDocker_Cron/ws/src/sdks/python/container/py311/build.gradle'.>
Offline dependencies root configured at 'offline-repository'
> Configure project :sdks
Evaluating project ':sdks' using build file '<https://ci-beam.apache.org/job/beam_PreCommit_PythonDocker_Cron/ws/src/sdks/build.gradle'.>
> Configure project :sdks:python
Evaluating project ':sdks:python' using build file '<https://ci-beam.apache.org/job/beam_PreCommit_PythonDocker_Cron/ws/src/sdks/python/build.gradle'.>
Offline dependencies root configured at 'offline-repository'
> Configure project :sdks:python:container
Evaluating project ':sdks:python:container' using build file '<https://ci-beam.apache.org/job/beam_PreCommit_PythonDocker_Cron/ws/src/sdks/python/container/build.gradle'.>
Offline dependencies root configured at 'offline-repository'
> Configure project :release:go-licenses:py
Evaluating project ':release:go-licenses:py' using build file '<https://ci-beam.apache.org/job/beam_PreCommit_PythonDocker_Cron/ws/src/release/go-licenses/py/build.gradle'.>
Offline dependencies root configured at 'offline-repository'
Starting process 'command 'sh''. Working directory: <https://ci-beam.apache.org/job/beam_PreCommit_PythonDocker_Cron/ws/src/sdks/python/container> Command: sh -c <https://ci-beam.apache.org/job/beam_PreCommit_PythonDocker_Cron/ws/src/sdks/go/prepare_go_version.sh> --version go1.21.4
Successfully started process 'command 'sh''
System Go installation: /snap/bin/go is go version go1.16.15 linux/amd64; Preparing to use /home/jenkins/go/bin/go1.21.4
/home/jenkins/go/pkg/mod/golang.org/dl@v0.0.0-20231107201224-8165dcd93058/go1.21.4/main.go:20:8: //go:build comment without // +build comment
FAILURE: Build failed with an exception.
* What went wrong:
Could not determine the dependencies of task ':sdks:python:container:goBuild'.
> Could not create task ':sdks:python:container:goPrepare'.
> Process 'command 'sh'' finished with non-zero exit value 1
* Try:
> Run with --stacktrace option to get the stack trace.
> Run with --debug option to get more log output.
> Get more help at https://help.gradle.org.
Deprecated Gradle features were used in this build, making it incompatible with Gradle 9.0.
You can use '--warning-mode all' to show the individual deprecation warnings and determine if they come from your own scripts or plugins.
For more on this, please refer to https://docs.gradle.org/8.4/userguide/command_line_interface.html#sec:command_line_warnings in the Gradle documentation.
BUILD FAILED in 11s
4 actionable tasks: 3 executed, 1 from cache
Publishing build scan...
https://ge.apache.org/s/67wtwtgr7b6hq
Build step 'Invoke Gradle script' changed build result to FAILURE
Build step 'Invoke Gradle script' marked build as failure
---------------------------------------------------------------------
To unsubscribe, e-mail: builds-unsubscribe@beam.apache.org
For additional commands, e-mail: builds-help@beam.apache.org
Build failed in Jenkins: beam_PreCommit_PythonDocker_Cron #5208
Posted by Apache Jenkins Server <je...@builds.apache.org>.
See <https://ci-beam.apache.org/job/beam_PreCommit_PythonDocker_Cron/5208/display/redirect>
Changes:
------------------------------------------
Started by timer
Running as SYSTEM
[EnvInject] - Loading node environment variables.
Building remotely on apache-beam-jenkins-2 (beam) in workspace <https://ci-beam.apache.org/job/beam_PreCommit_PythonDocker_Cron/ws/>
The recommended git tool is: NONE
No credentials specified
Wiping out workspace first.
Cloning the remote Git repository
Using shallow clone with depth 1
Avoid fetching tags
Cloning repository https://github.com/apache/beam.git
> git init <https://ci-beam.apache.org/job/beam_PreCommit_PythonDocker_Cron/ws/src> # timeout=10
Fetching upstream changes from https://github.com/apache/beam.git
> git --version # timeout=10
> git --version # 'git version 2.25.1'
> git fetch --no-tags --force --progress --depth=1 -- https://github.com/apache/beam.git +refs/heads/*:refs/remotes/origin/* # timeout=10
> git config remote.origin.url https://github.com/apache/beam.git # timeout=10
> git config --add remote.origin.fetch +refs/heads/*:refs/remotes/origin/* # timeout=10
> git config remote.origin.url https://github.com/apache/beam.git # timeout=10
Using shallow fetch with depth 1
Fetching upstream changes from https://github.com/apache/beam.git
> git fetch --no-tags --force --progress --depth=1 -- https://github.com/apache/beam.git +refs/heads/*:refs/remotes/origin/* +refs/pull/${ghprbPullId}/*:refs/remotes/origin/pr/${ghprbPullId}/* # timeout=10
> git rev-parse origin/master^{commit} # timeout=10
Checking out Revision 2ad459113134dfffd3caeeb15e821bb644e08663 (origin/master)
> git config core.sparsecheckout # timeout=10
> git checkout -f 2ad459113134dfffd3caeeb15e821bb644e08663 # timeout=10
Commit message: "[YAML] - Kafka Read and Write proto (#29368)"
> git rev-list --no-walk 2ad459113134dfffd3caeeb15e821bb644e08663 # timeout=10
No emails were triggered.
[EnvInject] - Executing scripts and injecting environment variables after the SCM step.
[EnvInject] - Injecting as environment variables the properties content
SETUPTOOLS_USE_DISTUTILS=stdlib
SPARK_LOCAL_IP=127.0.0.1
[EnvInject] - Variables injected successfully.
[Gradle] - Launching build.
[src] $ <https://ci-beam.apache.org/job/beam_PreCommit_PythonDocker_Cron/ws/src/gradlew> --info --continue --max-workers=8 -Dorg.gradle.jvmargs=-Xms2g -Dorg.gradle.jvmargs=-Xmx6g -Dorg.gradle.vfs.watch=false -Pdocker-pull-licenses :pythonDockerBuildPreCommit
Initialized native services in: /home/jenkins/.gradle/native
Initialized jansi services in: /home/jenkins/.gradle/native
Received JVM installation metadata from '/usr/lib/jvm/java-8-openjdk-amd64': {JAVA_HOME=/usr/lib/jvm/java-8-openjdk-amd64/jre, JAVA_VERSION=1.8.0_382, JAVA_VENDOR=Private Build, RUNTIME_NAME=OpenJDK Runtime Environment, RUNTIME_VERSION=1.8.0_382-8u382-ga-1~20.04.1-b05, VM_NAME=OpenJDK 64-Bit Server VM, VM_VERSION=25.382-b05, VM_VENDOR=Private Build, OS_ARCH=amd64}
Checking if the launcher JVM can be re-used for build. To be re-used, the launcher JVM needs to match the parameters required for the build process: -Xmx6g -Dfile.encoding=UTF-8 -Duser.country=US -Duser.language=en -Duser.variant
To honour the JVM settings for this build a single-use Daemon process will be forked. For more on this, please refer to https://docs.gradle.org/8.4/userguide/gradle_daemon.html#sec:disabling_the_daemon in the Gradle documentation.
Starting process 'Gradle build daemon'. Working directory: /home/jenkins/.gradle/daemon/8.4 Command: /usr/lib/jvm/java-8-openjdk-amd64/bin/java -Xmx6g -Dfile.encoding=UTF-8 -Duser.country=US -Duser.language=en -Duser.variant -cp /home/jenkins/.gradle/wrapper/dists/gradle-8.4-bin/1w5dpkrfk8irigvoxmyhowfim/gradle-8.4/lib/gradle-launcher-8.4.jar -javaagent:/home/jenkins/.gradle/wrapper/dists/gradle-8.4-bin/1w5dpkrfk8irigvoxmyhowfim/gradle-8.4/lib/agents/gradle-instrumentation-agent-8.4.jar org.gradle.launcher.daemon.bootstrap.GradleDaemon 8.4
Successfully started process 'Gradle build daemon'
An attempt to start the daemon took 1.489 secs.
The client will now receive all logging from the daemon (pid: 656353). The daemon log file: /home/jenkins/.gradle/daemon/8.4/daemon-656353.out.log
Closing daemon's stdin at end of input.
The daemon will no longer process any standard input.
Daemon will be stopped at the end of the build
Using 8 worker leases.
Configuration on demand is an incubating feature.
Received JVM installation metadata from '/usr/lib/jvm/java-8-openjdk-amd64': {JAVA_HOME=/usr/lib/jvm/java-8-openjdk-amd64/jre, JAVA_VERSION=1.8.0_382, JAVA_VENDOR=Private Build, RUNTIME_NAME=OpenJDK Runtime Environment, RUNTIME_VERSION=1.8.0_382-8u382-ga-1~20.04.1-b05, VM_NAME=OpenJDK 64-Bit Server VM, VM_VERSION=25.382-b05, VM_VENDOR=Private Build, OS_ARCH=amd64}
Watching the file system is configured to be disabled
File system watching is inactive
Gradle Enterprise plugins resolution: https://plugins.gradle.org/m2
Starting Build
Skipping Kotlin DSL script compilation (Settings/TopLevel/stage1) as it is up-to-date.
Skipping Kotlin DSL script compilation (Settings/TopLevel/stage2) as it is up-to-date.
Settings evaluated using settings file '<https://ci-beam.apache.org/job/beam_PreCommit_PythonDocker_Cron/ws/src/settings.gradle.kts'.>
Enforcing Gradle Enterprise: https://ge.apache.org, allowUntrustedServer: false
Using local directory build cache for the root build (location = /home/jenkins/.gradle/caches/build-cache-1, removeUnusedEntriesAfter = 7 days).
Using remote HTTP build cache for the root build (allowInsecureProtocol = false, allowUntrustedServer = false, authenticated = true, url = https://beam-cache.apache.org/cache/, useExpectContinue = false).
Projects loaded. Root project using build file '<https://ci-beam.apache.org/job/beam_PreCommit_PythonDocker_Cron/ws/src/build.gradle.kts'.>
Included projects: [root project 'beam', project ':beam-test-gha', project ':beam-test-infra-metrics', project ':beam-test-infra-mock-apis', project ':beam-test-infra-pipelines', project ':beam-test-jenkins', project ':beam-test-tools', project ':beam-validate-runner', project ':com.google.api.gax.batching', project ':examples', project ':it', project ':learning', project ':model', project ':playground', project ':release', project ':runners', project ':sdks', project ':vendor', project ':website', project ':examples:java', project ':examples:kotlin', project ':examples:multi-language', project ':it:cassandra', project ':it:common', project ':it:conditions', project ':it:elasticsearch', project ':it:google-cloud-platform', project ':it:jdbc', project ':it:kafka', project ':it:mongodb', project ':it:neo4j', project ':it:splunk', project ':it:testcontainers', project ':it:truthmatchers', project ':learning:tour-of-beam', project ':model:fn-execution', project ':model:job-management', project ':model:pipeline', project ':playground:backend', project ':playground:frontend', project ':playground:kafka-emulator', project ':playground:terraform', project ':release:go-licenses', project ':runners:core-construction-java', project ':runners:core-java', project ':runners:direct-java', project ':runners:extensions-java', project ':runners:flink', project ':runners:google-cloud-dataflow-java', project ':runners:java-fn-execution', project ':runners:java-job-service', project ':runners:jet', project ':runners:local-java', project ':runners:portability', project ':runners:samza', project ':runners:spark', project ':runners:twister2', project ':sdks:go', project ':sdks:java', project ':sdks:python', project ':sdks:typescript', project ':vendor:bytebuddy-1_12_8', project ':vendor:calcite-1_28_0', project ':vendor:grpc-1_54_0', project ':vendor:guava-32_1_2-jre', project ':examples:java:cdap', project ':examples:java:twitter', project ':learning:tour-of-beam:frontend', project ':learning:tour-of-beam:terraform', project ':playground:backend:containers', project ':playground:frontend:playground_components', project ':release:go-licenses:go', project ':release:go-licenses:java', project ':release:go-licenses:py', project ':runners:extensions-java:metrics', project ':runners:flink:1.12', project ':runners:flink:1.13', project ':runners:flink:1.14', project ':runners:flink:1.15', project ':runners:flink:1.16', project ':runners:google-cloud-dataflow-java:arm', project ':runners:google-cloud-dataflow-java:examples', project ':runners:google-cloud-dataflow-java:examples-streaming', project ':runners:google-cloud-dataflow-java:worker', project ':runners:portability:java', project ':runners:samza:job-server', project ':runners:spark:3', project ':sdks:go:container', project ':sdks:go:examples', project ':sdks:go:test', project ':sdks:java:bom', project ':sdks:java:build-tools', project ':sdks:java:container', project ':sdks:java:core', project ':sdks:java:expansion-service', project ':sdks:java:extensions', project ':sdks:java:fn-execution', project ':sdks:java:harness', project ':sdks:java:io', project ':sdks:java:javadoc', project ':sdks:java:maven-archetypes', project ':sdks:java:testing', project ':sdks:java:transform-service', project ':sdks:python:apache_beam', project ':sdks:python:container', project ':sdks:python:expansion-service-container', project ':sdks:python:test-suites', project ':sdks:typescript:container', project ':examples:java:cdap:hubspot', project ':examples:java:cdap:salesforce', project ':examples:java:cdap:servicenow', project ':examples:java:cdap:zendesk', project ':playground:backend:containers:go', project ':playground:backend:containers:java', project ':playground:backend:containers:python', project ':playground:backend:containers:router', project ':playground:backend:containers:scio', project ':playground:frontend:playground_components:tools', project ':runners:flink:1.12:job-server', project ':runners:flink:1.12:job-server-container', project ':runners:flink:1.13:job-server', project ':runners:flink:1.13:job-server-container', project ':runners:flink:1.14:job-server', project ':runners:flink:1.14:job-server-container', project ':runners:flink:1.15:job-server', project ':runners:flink:1.15:job-server-container', project ':runners:flink:1.16:job-server', project ':runners:flink:1.16:job-server-container', project ':runners:google-cloud-dataflow-java:worker:windmill', project ':runners:spark:3:job-server', project ':sdks:go:test:load', project ':sdks:java:bom:gcp', project ':sdks:java:container:agent', project ':sdks:java:container:java11', project ':sdks:java:container:java17', project ':sdks:java:container:java21', project ':sdks:java:container:java8', project ':sdks:java:core:jmh', project ':sdks:java:expansion-service:app', project ':sdks:java:expansion-service:container', project ':sdks:java:extensions:arrow', project ':sdks:java:extensions:avro', project ':sdks:java:extensions:euphoria', project ':sdks:java:extensions:google-cloud-platform-core', project ':sdks:java:extensions:jackson', project ':sdks:java:extensions:join-library', project ':sdks:java:extensions:kryo', project ':sdks:java:extensions:ml', project ':sdks:java:extensions:protobuf', project ':sdks:java:extensions:python', project ':sdks:java:extensions:sbe', project ':sdks:java:extensions:schemaio-expansion-service', project ':sdks:java:extensions:sketching', project ':sdks:java:extensions:sorter', project ':sdks:java:extensions:sql', project ':sdks:java:extensions:timeseries', project ':sdks:java:extensions:zetasketch', project ':sdks:java:harness:jmh', project ':sdks:java:io:amazon-web-services', project ':sdks:java:io:amazon-web-services2', project ':sdks:java:io:amqp', project ':sdks:java:io:azure', project ':sdks:java:io:azure-cosmos', project ':sdks:java:io:bigquery-io-perf-tests', project ':sdks:java:io:cassandra', project ':sdks:java:io:cdap', project ':sdks:java:io:clickhouse', project ':sdks:java:io:common', project ':sdks:java:io:contextualtextio', project ':sdks:java:io:csv', project ':sdks:java:io:debezium', project ':sdks:java:io:elasticsearch', project ':sdks:java:io:elasticsearch-tests', project ':sdks:java:io:expansion-service', project ':sdks:java:io:file-based-io-tests', project ':sdks:java:io:file-schema-transform', project ':sdks:java:io:google-ads', project ':sdks:java:io:google-cloud-platform', project ':sdks:java:io:hadoop-common', project ':sdks:java:io:hadoop-file-system', project ':sdks:java:io:hadoop-format', project ':sdks:java:io:hbase', project ':sdks:java:io:hcatalog', project ':sdks:java:io:influxdb', project ':sdks:java:io:jdbc', project ':sdks:java:io:jms', project ':sdks:java:io:json', project ':sdks:java:io:kafka', project ':sdks:java:io:kinesis', project ':sdks:java:io:kudu', project ':sdks:java:io:mongodb', project ':sdks:java:io:mqtt', project ':sdks:java:io:neo4j', project ':sdks:java:io:parquet', project ':sdks:java:io:pulsar', project ':sdks:java:io:rabbitmq', project ':sdks:java:io:redis', project ':sdks:java:io:rrio', project ':sdks:java:io:singlestore', project ':sdks:java:io:snowflake', project ':sdks:java:io:solr', project ':sdks:java:io:sparkreceiver', project ':sdks:java:io:splunk', project ':sdks:java:io:synthetic', project ':sdks:java:io:thrift', project ':sdks:java:io:tika', project ':sdks:java:io:xml', project ':sdks:java:maven-archetypes:examples', project ':sdks:java:maven-archetypes:gcp-bom-examples', project ':sdks:java:maven-archetypes:starter', project ':sdks:java:testing:expansion-service', project ':sdks:java:testing:jpms-tests', project ':sdks:java:testing:kafka-service', project ':sdks:java:testing:load-tests', project ':sdks:java:testing:nexmark', project ':sdks:java:testing:test-utils', project ':sdks:java:testing:tpcds', project ':sdks:java:testing:watermarks', project ':sdks:java:transform-service:controller-container', project ':sdks:java:transform-service:launcher', project ':sdks:python:apache_beam:testing', project ':sdks:python:container:py310', project ':sdks:python:container:py311', project ':sdks:python:container:py38', project ':sdks:python:container:py39', project ':sdks:python:test-suites:dataflow', project ':sdks:python:test-suites:direct', project ':sdks:python:test-suites:portable', project ':sdks:python:test-suites:tox', project ':sdks:python:test-suites:xlang', project ':playground:frontend:playground_components:tools:extract_symbols_java', project ':runners:spark:3:job-server:container', project ':sdks:java:extensions:sql:datacatalog', project ':sdks:java:extensions:sql:expansion-service', project ':sdks:java:extensions:sql:hcatalog', project ':sdks:java:extensions:sql:jdbc', project ':sdks:java:extensions:sql:payloads', project ':sdks:java:extensions:sql:perf-tests', project ':sdks:java:extensions:sql:shell', project ':sdks:java:extensions:sql:udf', project ':sdks:java:extensions:sql:udf-test-provider', project ':sdks:java:extensions:sql:zetasql', project ':sdks:java:io:debezium:expansion-service', project ':sdks:java:io:elasticsearch-tests:elasticsearch-tests-2', project ':sdks:java:io:elasticsearch-tests:elasticsearch-tests-5', project ':sdks:java:io:elasticsearch-tests:elasticsearch-tests-6', project ':sdks:java:io:elasticsearch-tests:elasticsearch-tests-7', project ':sdks:java:io:elasticsearch-tests:elasticsearch-tests-8', project ':sdks:java:io:elasticsearch-tests:elasticsearch-tests-common', project ':sdks:java:io:google-cloud-platform:expansion-service', project ':sdks:java:io:kafka:kafka-01103', project ':sdks:java:io:kafka:kafka-100', project ':sdks:java:io:kafka:kafka-111', project ':sdks:java:io:kafka:kafka-201', project ':sdks:java:io:kafka:kafka-211', project ':sdks:java:io:kafka:kafka-222', project ':sdks:java:io:kafka:kafka-231', project ':sdks:java:io:kafka:kafka-241', project ':sdks:java:io:kafka:kafka-251', project ':sdks:java:io:kinesis:expansion-service', project ':sdks:java:io:snowflake:expansion-service', project ':sdks:java:io:sparkreceiver:2', project ':sdks:python:apache_beam:testing:benchmarks', project ':sdks:python:apache_beam:testing:load_tests', project ':sdks:python:test-suites:dataflow:py310', project ':sdks:python:test-suites:dataflow:py311', project ':sdks:python:test-suites:dataflow:py38', project ':sdks:python:test-suites:dataflow:py39', project ':sdks:python:test-suites:direct:py310', project ':sdks:python:test-suites:direct:py311', project ':sdks:python:test-suites:direct:py38', project ':sdks:python:test-suites:direct:py39', project ':sdks:python:test-suites:direct:xlang', project ':sdks:python:test-suites:portable:py310', project ':sdks:python:test-suites:portable:py311', project ':sdks:python:test-suites:portable:py38', project ':sdks:python:test-suites:portable:py39', project ':sdks:python:test-suites:tox:py310', project ':sdks:python:test-suites:tox:py311', project ':sdks:python:test-suites:tox:py38', project ':sdks:python:test-suites:tox:py39', project ':sdks:python:test-suites:tox:pycommon', project ':sdks:python:apache_beam:testing:benchmarks:nexmark']
> Configure project :buildSrc
Evaluating project ':buildSrc' using build file '<https://ci-beam.apache.org/job/beam_PreCommit_PythonDocker_Cron/ws/src/buildSrc/build.gradle.kts'.>
Build cache key for Kotlin DSL plugin specs accessors for classpath 'b12336cc1efc81b6889c17b00eb5e022' is 439034dc1255cd96d5b3be3be4a5fb7f
Skipping Kotlin DSL plugin specs accessors for classpath 'b12336cc1efc81b6889c17b00eb5e022' as it is up-to-date.
Build cache key for Kotlin DSL script compilation (Project/TopLevel/stage1) is b66cb5f5aa7fa9717c9c48018d7b9a1c
Skipping Kotlin DSL script compilation (Project/TopLevel/stage1) as it is up-to-date.
Build cache key for Kotlin DSL accessors for project ':buildSrc' is e906902012c4cc701c4f4ad95f517f2d
Skipping Kotlin DSL accessors for project ':buildSrc' as it is up-to-date.
Build cache key for Kotlin DSL script compilation (Project/TopLevel/stage2) is 67a3fe2cdf3b90ec221f209d06f308c4
Skipping Kotlin DSL script compilation (Project/TopLevel/stage2) as it is up-to-date.
Resolve mutations for :buildSrc:compileJava (Thread[Execution worker Thread 2,5,main]) started.
:buildSrc:compileJava (Thread[Execution worker Thread 2,5,main]) started.
> Task :buildSrc:compileJava NO-SOURCE
Skipping task ':buildSrc:compileJava' as it has no source files and no previous output files.
Resolve mutations for :buildSrc:compileGroovy (Thread[Execution worker Thread 2,5,main]) started.
:buildSrc:compileGroovy (Thread[Execution worker Thread 2,5,main]) started.
> Task :buildSrc:compileGroovy FROM-CACHE
Build cache key for task ':buildSrc:compileGroovy' is 26c29984037acc4bf8e9fa647d8f1375
Task ':buildSrc:compileGroovy' is not up-to-date because:
No history is available.
Loaded cache entry for task ':buildSrc:compileGroovy' with cache key 26c29984037acc4bf8e9fa647d8f1375
Resolve mutations for :buildSrc:pluginDescriptors (Thread[Execution worker Thread 2,5,main]) started.
:buildSrc:pluginDescriptors (Thread[Execution worker Thread 2,5,main]) started.
> Task :buildSrc:pluginDescriptors
Caching disabled for task ':buildSrc:pluginDescriptors' because:
Not worth caching
Task ':buildSrc:pluginDescriptors' is not up-to-date because:
No history is available.
Resolve mutations for :buildSrc:processResources (Thread[Execution worker Thread 2,5,main]) started.
:buildSrc:processResources (Thread[Execution worker Thread 2,5,main]) started.
> Task :buildSrc:processResources
Caching disabled for task ':buildSrc:processResources' because:
Not worth caching
Task ':buildSrc:processResources' is not up-to-date because:
No history is available.
file or directory '<https://ci-beam.apache.org/job/beam_PreCommit_PythonDocker_Cron/ws/src/buildSrc/src/main/resources',> not found
Resolve mutations for :buildSrc:classes (Thread[Execution worker Thread 2,5,main]) started.
:buildSrc:classes (Thread[Execution worker Thread 2,5,main]) started.
> Task :buildSrc:classes
Skipping task ':buildSrc:classes' as it has no actions.
Resolve mutations for :buildSrc:jar (Thread[Execution worker Thread 2,5,main]) started.
:buildSrc:jar (Thread[Execution worker Thread 2,5,main]) started.
> Task :buildSrc:jar
Caching disabled for task ':buildSrc:jar' because:
Not worth caching
Task ':buildSrc:jar' is not up-to-date because:
No history is available.
file or directory '<https://ci-beam.apache.org/job/beam_PreCommit_PythonDocker_Cron/ws/src/buildSrc/build/classes/java/main',> not found
Task path ':pythonDockerBuildPreCommit' matched project ':'
> Configure project :
Evaluating root project 'beam' using build file '<https://ci-beam.apache.org/job/beam_PreCommit_PythonDocker_Cron/ws/src/build.gradle.kts'.>
Build cache key for Kotlin DSL plugin specs accessors for classpath 'a2e9226b33d4a8bd0eef1b447f4abea7' is cb0c05ef87f7b76ec94f231ae59017e0
Skipping Kotlin DSL plugin specs accessors for classpath 'a2e9226b33d4a8bd0eef1b447f4abea7' as it is up-to-date.
Build cache key for Kotlin DSL script compilation (Project/TopLevel/stage1) is 1135f9ba7bff1a77233a0a4c87424d74
Skipping Kotlin DSL script compilation (Project/TopLevel/stage1) as it is up-to-date.
Offline dependencies root configured at 'offline-repository'
Build cache key for Kotlin DSL accessors for root project 'beam' is 050f1ed4b1aade9c4d0e270f9b8999c9
Skipping Kotlin DSL accessors for root project 'beam' as it is up-to-date.
Build cache key for Kotlin DSL script compilation (Project/TopLevel/stage2) is 66ecb0aed2e30c4f8f2a7df66a4206ec
Skipping Kotlin DSL script compilation (Project/TopLevel/stage2) as it is up-to-date.
Task name matched 'pythonDockerBuildPreCommit'
Selected primary task 'pythonDockerBuildPreCommit' from project :
> Configure project :sdks:python:container:py39
Evaluating project ':sdks:python:container:py39' using build file '<https://ci-beam.apache.org/job/beam_PreCommit_PythonDocker_Cron/ws/src/sdks/python/container/py39/build.gradle'.>
Offline dependencies root configured at 'offline-repository'
> Configure project :sdks:python:container:py38
Evaluating project ':sdks:python:container:py38' using build file '<https://ci-beam.apache.org/job/beam_PreCommit_PythonDocker_Cron/ws/src/sdks/python/container/py38/build.gradle'.>
Offline dependencies root configured at 'offline-repository'
> Configure project :sdks:python:container:py310
Evaluating project ':sdks:python:container:py310' using build file '<https://ci-beam.apache.org/job/beam_PreCommit_PythonDocker_Cron/ws/src/sdks/python/container/py310/build.gradle'.>
Offline dependencies root configured at 'offline-repository'
> Configure project :sdks:python:container:py311
Evaluating project ':sdks:python:container:py311' using build file '<https://ci-beam.apache.org/job/beam_PreCommit_PythonDocker_Cron/ws/src/sdks/python/container/py311/build.gradle'.>
Offline dependencies root configured at 'offline-repository'
> Configure project :sdks
Evaluating project ':sdks' using build file '<https://ci-beam.apache.org/job/beam_PreCommit_PythonDocker_Cron/ws/src/sdks/build.gradle'.>
> Configure project :sdks:python
Evaluating project ':sdks:python' using build file '<https://ci-beam.apache.org/job/beam_PreCommit_PythonDocker_Cron/ws/src/sdks/python/build.gradle'.>
Offline dependencies root configured at 'offline-repository'
> Configure project :sdks:python:container
Evaluating project ':sdks:python:container' using build file '<https://ci-beam.apache.org/job/beam_PreCommit_PythonDocker_Cron/ws/src/sdks/python/container/build.gradle'.>
Offline dependencies root configured at 'offline-repository'
> Configure project :release:go-licenses:py
Evaluating project ':release:go-licenses:py' using build file '<https://ci-beam.apache.org/job/beam_PreCommit_PythonDocker_Cron/ws/src/release/go-licenses/py/build.gradle'.>
Offline dependencies root configured at 'offline-repository'
Starting process 'command 'sh''. Working directory: <https://ci-beam.apache.org/job/beam_PreCommit_PythonDocker_Cron/ws/src/sdks/python/container> Command: sh -c <https://ci-beam.apache.org/job/beam_PreCommit_PythonDocker_Cron/ws/src/sdks/go/prepare_go_version.sh> --version go1.21.4
Successfully started process 'command 'sh''
System Go installation: /snap/bin/go is go version go1.16.15 linux/amd64; Preparing to use /home/jenkins/go/bin/go1.21.4
/home/jenkins/go/pkg/mod/golang.org/dl@v0.0.0-20231107201224-8165dcd93058/go1.21.4/main.go:20:8: //go:build comment without // +build comment
FAILURE: Build failed with an exception.
* What went wrong:
Could not determine the dependencies of task ':sdks:python:container:goBuild'.
> Could not create task ':sdks:python:container:goPrepare'.
> Process 'command 'sh'' finished with non-zero exit value 1
* Try:
> Run with --stacktrace option to get the stack trace.
> Run with --debug option to get more log output.
> Get more help at https://help.gradle.org.
Deprecated Gradle features were used in this build, making it incompatible with Gradle 9.0.
You can use '--warning-mode all' to show the individual deprecation warnings and determine if they come from your own scripts or plugins.
For more on this, please refer to https://docs.gradle.org/8.4/userguide/command_line_interface.html#sec:command_line_warnings in the Gradle documentation.
BUILD FAILED in 16s
4 actionable tasks: 3 executed, 1 from cache
Publishing build scan...
https://ge.apache.org/s/zqp7tohpqxnhi
Build step 'Invoke Gradle script' changed build result to FAILURE
Build step 'Invoke Gradle script' marked build as failure
---------------------------------------------------------------------
To unsubscribe, e-mail: builds-unsubscribe@beam.apache.org
For additional commands, e-mail: builds-help@beam.apache.org
Build failed in Jenkins: beam_PreCommit_PythonDocker_Cron #5207
Posted by Apache Jenkins Server <je...@builds.apache.org>.
See <https://ci-beam.apache.org/job/beam_PreCommit_PythonDocker_Cron/5207/display/redirect>
Changes:
------------------------------------------
Started by timer
Running as SYSTEM
[EnvInject] - Loading node environment variables.
Building remotely on apache-beam-jenkins-2 (beam) in workspace <https://ci-beam.apache.org/job/beam_PreCommit_PythonDocker_Cron/ws/>
The recommended git tool is: NONE
No credentials specified
Wiping out workspace first.
Cloning the remote Git repository
Using shallow clone with depth 1
Avoid fetching tags
Cloning repository https://github.com/apache/beam.git
> git init <https://ci-beam.apache.org/job/beam_PreCommit_PythonDocker_Cron/ws/src> # timeout=10
Fetching upstream changes from https://github.com/apache/beam.git
> git --version # timeout=10
> git --version # 'git version 2.25.1'
> git fetch --no-tags --force --progress --depth=1 -- https://github.com/apache/beam.git +refs/heads/*:refs/remotes/origin/* # timeout=10
> git config remote.origin.url https://github.com/apache/beam.git # timeout=10
> git config --add remote.origin.fetch +refs/heads/*:refs/remotes/origin/* # timeout=10
> git config remote.origin.url https://github.com/apache/beam.git # timeout=10
Using shallow fetch with depth 1
Fetching upstream changes from https://github.com/apache/beam.git
> git fetch --no-tags --force --progress --depth=1 -- https://github.com/apache/beam.git +refs/heads/*:refs/remotes/origin/* +refs/pull/${ghprbPullId}/*:refs/remotes/origin/pr/${ghprbPullId}/* # timeout=10
> git rev-parse origin/master^{commit} # timeout=10
Checking out Revision 2ad459113134dfffd3caeeb15e821bb644e08663 (origin/master)
> git config core.sparsecheckout # timeout=10
> git checkout -f 2ad459113134dfffd3caeeb15e821bb644e08663 # timeout=10
Commit message: "[YAML] - Kafka Read and Write proto (#29368)"
> git rev-list --no-walk 2ad459113134dfffd3caeeb15e821bb644e08663 # timeout=10
No emails were triggered.
[EnvInject] - Executing scripts and injecting environment variables after the SCM step.
[EnvInject] - Injecting as environment variables the properties content
SETUPTOOLS_USE_DISTUTILS=stdlib
SPARK_LOCAL_IP=127.0.0.1
[EnvInject] - Variables injected successfully.
[Gradle] - Launching build.
[src] $ <https://ci-beam.apache.org/job/beam_PreCommit_PythonDocker_Cron/ws/src/gradlew> --info --continue --max-workers=8 -Dorg.gradle.jvmargs=-Xms2g -Dorg.gradle.jvmargs=-Xmx6g -Dorg.gradle.vfs.watch=false -Pdocker-pull-licenses :pythonDockerBuildPreCommit
Initialized native services in: /home/jenkins/.gradle/native
Initialized jansi services in: /home/jenkins/.gradle/native
Received JVM installation metadata from '/usr/lib/jvm/java-8-openjdk-amd64': {JAVA_HOME=/usr/lib/jvm/java-8-openjdk-amd64/jre, JAVA_VERSION=1.8.0_382, JAVA_VENDOR=Private Build, RUNTIME_NAME=OpenJDK Runtime Environment, RUNTIME_VERSION=1.8.0_382-8u382-ga-1~20.04.1-b05, VM_NAME=OpenJDK 64-Bit Server VM, VM_VERSION=25.382-b05, VM_VENDOR=Private Build, OS_ARCH=amd64}
Checking if the launcher JVM can be re-used for build. To be re-used, the launcher JVM needs to match the parameters required for the build process: -Xmx6g -Dfile.encoding=UTF-8 -Duser.country=US -Duser.language=en -Duser.variant
To honour the JVM settings for this build a single-use Daemon process will be forked. For more on this, please refer to https://docs.gradle.org/8.4/userguide/gradle_daemon.html#sec:disabling_the_daemon in the Gradle documentation.
Starting process 'Gradle build daemon'. Working directory: /home/jenkins/.gradle/daemon/8.4 Command: /usr/lib/jvm/java-8-openjdk-amd64/bin/java -Xmx6g -Dfile.encoding=UTF-8 -Duser.country=US -Duser.language=en -Duser.variant -cp /home/jenkins/.gradle/wrapper/dists/gradle-8.4-bin/1w5dpkrfk8irigvoxmyhowfim/gradle-8.4/lib/gradle-launcher-8.4.jar -javaagent:/home/jenkins/.gradle/wrapper/dists/gradle-8.4-bin/1w5dpkrfk8irigvoxmyhowfim/gradle-8.4/lib/agents/gradle-instrumentation-agent-8.4.jar org.gradle.launcher.daemon.bootstrap.GradleDaemon 8.4
Successfully started process 'Gradle build daemon'
An attempt to start the daemon took 1.166 secs.
The client will now receive all logging from the daemon (pid: 649434). The daemon log file: /home/jenkins/.gradle/daemon/8.4/daemon-649434.out.log
Closing daemon's stdin at end of input.
The daemon will no longer process any standard input.
Daemon will be stopped at the end of the build
Using 8 worker leases.
Configuration on demand is an incubating feature.
Received JVM installation metadata from '/usr/lib/jvm/java-8-openjdk-amd64': {JAVA_HOME=/usr/lib/jvm/java-8-openjdk-amd64/jre, JAVA_VERSION=1.8.0_382, JAVA_VENDOR=Private Build, RUNTIME_NAME=OpenJDK Runtime Environment, RUNTIME_VERSION=1.8.0_382-8u382-ga-1~20.04.1-b05, VM_NAME=OpenJDK 64-Bit Server VM, VM_VERSION=25.382-b05, VM_VENDOR=Private Build, OS_ARCH=amd64}
Watching the file system is configured to be disabled
File system watching is inactive
Gradle Enterprise plugins resolution: https://plugins.gradle.org/m2
Starting Build
Skipping Kotlin DSL script compilation (Settings/TopLevel/stage1) as it is up-to-date.
Skipping Kotlin DSL script compilation (Settings/TopLevel/stage2) as it is up-to-date.
Settings evaluated using settings file '<https://ci-beam.apache.org/job/beam_PreCommit_PythonDocker_Cron/ws/src/settings.gradle.kts'.>
Enforcing Gradle Enterprise: https://ge.apache.org, allowUntrustedServer: false
Using local directory build cache for the root build (location = /home/jenkins/.gradle/caches/build-cache-1, removeUnusedEntriesAfter = 7 days).
Using remote HTTP build cache for the root build (allowInsecureProtocol = false, allowUntrustedServer = false, authenticated = true, url = https://beam-cache.apache.org/cache/, useExpectContinue = false).
Projects loaded. Root project using build file '<https://ci-beam.apache.org/job/beam_PreCommit_PythonDocker_Cron/ws/src/build.gradle.kts'.>
Included projects: [root project 'beam', project ':beam-test-gha', project ':beam-test-infra-metrics', project ':beam-test-infra-mock-apis', project ':beam-test-infra-pipelines', project ':beam-test-jenkins', project ':beam-test-tools', project ':beam-validate-runner', project ':com.google.api.gax.batching', project ':examples', project ':it', project ':learning', project ':model', project ':playground', project ':release', project ':runners', project ':sdks', project ':vendor', project ':website', project ':examples:java', project ':examples:kotlin', project ':examples:multi-language', project ':it:cassandra', project ':it:common', project ':it:conditions', project ':it:elasticsearch', project ':it:google-cloud-platform', project ':it:jdbc', project ':it:kafka', project ':it:mongodb', project ':it:neo4j', project ':it:splunk', project ':it:testcontainers', project ':it:truthmatchers', project ':learning:tour-of-beam', project ':model:fn-execution', project ':model:job-management', project ':model:pipeline', project ':playground:backend', project ':playground:frontend', project ':playground:kafka-emulator', project ':playground:terraform', project ':release:go-licenses', project ':runners:core-construction-java', project ':runners:core-java', project ':runners:direct-java', project ':runners:extensions-java', project ':runners:flink', project ':runners:google-cloud-dataflow-java', project ':runners:java-fn-execution', project ':runners:java-job-service', project ':runners:jet', project ':runners:local-java', project ':runners:portability', project ':runners:samza', project ':runners:spark', project ':runners:twister2', project ':sdks:go', project ':sdks:java', project ':sdks:python', project ':sdks:typescript', project ':vendor:bytebuddy-1_12_8', project ':vendor:calcite-1_28_0', project ':vendor:grpc-1_54_0', project ':vendor:guava-32_1_2-jre', project ':examples:java:cdap', project ':examples:java:twitter', project ':learning:tour-of-beam:frontend', project ':learning:tour-of-beam:terraform', project ':playground:backend:containers', project ':playground:frontend:playground_components', project ':release:go-licenses:go', project ':release:go-licenses:java', project ':release:go-licenses:py', project ':runners:extensions-java:metrics', project ':runners:flink:1.12', project ':runners:flink:1.13', project ':runners:flink:1.14', project ':runners:flink:1.15', project ':runners:flink:1.16', project ':runners:google-cloud-dataflow-java:arm', project ':runners:google-cloud-dataflow-java:examples', project ':runners:google-cloud-dataflow-java:examples-streaming', project ':runners:google-cloud-dataflow-java:worker', project ':runners:portability:java', project ':runners:samza:job-server', project ':runners:spark:3', project ':sdks:go:container', project ':sdks:go:examples', project ':sdks:go:test', project ':sdks:java:bom', project ':sdks:java:build-tools', project ':sdks:java:container', project ':sdks:java:core', project ':sdks:java:expansion-service', project ':sdks:java:extensions', project ':sdks:java:fn-execution', project ':sdks:java:harness', project ':sdks:java:io', project ':sdks:java:javadoc', project ':sdks:java:maven-archetypes', project ':sdks:java:testing', project ':sdks:java:transform-service', project ':sdks:python:apache_beam', project ':sdks:python:container', project ':sdks:python:expansion-service-container', project ':sdks:python:test-suites', project ':sdks:typescript:container', project ':examples:java:cdap:hubspot', project ':examples:java:cdap:salesforce', project ':examples:java:cdap:servicenow', project ':examples:java:cdap:zendesk', project ':playground:backend:containers:go', project ':playground:backend:containers:java', project ':playground:backend:containers:python', project ':playground:backend:containers:router', project ':playground:backend:containers:scio', project ':playground:frontend:playground_components:tools', project ':runners:flink:1.12:job-server', project ':runners:flink:1.12:job-server-container', project ':runners:flink:1.13:job-server', project ':runners:flink:1.13:job-server-container', project ':runners:flink:1.14:job-server', project ':runners:flink:1.14:job-server-container', project ':runners:flink:1.15:job-server', project ':runners:flink:1.15:job-server-container', project ':runners:flink:1.16:job-server', project ':runners:flink:1.16:job-server-container', project ':runners:google-cloud-dataflow-java:worker:windmill', project ':runners:spark:3:job-server', project ':sdks:go:test:load', project ':sdks:java:bom:gcp', project ':sdks:java:container:agent', project ':sdks:java:container:java11', project ':sdks:java:container:java17', project ':sdks:java:container:java21', project ':sdks:java:container:java8', project ':sdks:java:core:jmh', project ':sdks:java:expansion-service:app', project ':sdks:java:expansion-service:container', project ':sdks:java:extensions:arrow', project ':sdks:java:extensions:avro', project ':sdks:java:extensions:euphoria', project ':sdks:java:extensions:google-cloud-platform-core', project ':sdks:java:extensions:jackson', project ':sdks:java:extensions:join-library', project ':sdks:java:extensions:kryo', project ':sdks:java:extensions:ml', project ':sdks:java:extensions:protobuf', project ':sdks:java:extensions:python', project ':sdks:java:extensions:sbe', project ':sdks:java:extensions:schemaio-expansion-service', project ':sdks:java:extensions:sketching', project ':sdks:java:extensions:sorter', project ':sdks:java:extensions:sql', project ':sdks:java:extensions:timeseries', project ':sdks:java:extensions:zetasketch', project ':sdks:java:harness:jmh', project ':sdks:java:io:amazon-web-services', project ':sdks:java:io:amazon-web-services2', project ':sdks:java:io:amqp', project ':sdks:java:io:azure', project ':sdks:java:io:azure-cosmos', project ':sdks:java:io:bigquery-io-perf-tests', project ':sdks:java:io:cassandra', project ':sdks:java:io:cdap', project ':sdks:java:io:clickhouse', project ':sdks:java:io:common', project ':sdks:java:io:contextualtextio', project ':sdks:java:io:csv', project ':sdks:java:io:debezium', project ':sdks:java:io:elasticsearch', project ':sdks:java:io:elasticsearch-tests', project ':sdks:java:io:expansion-service', project ':sdks:java:io:file-based-io-tests', project ':sdks:java:io:file-schema-transform', project ':sdks:java:io:google-ads', project ':sdks:java:io:google-cloud-platform', project ':sdks:java:io:hadoop-common', project ':sdks:java:io:hadoop-file-system', project ':sdks:java:io:hadoop-format', project ':sdks:java:io:hbase', project ':sdks:java:io:hcatalog', project ':sdks:java:io:influxdb', project ':sdks:java:io:jdbc', project ':sdks:java:io:jms', project ':sdks:java:io:json', project ':sdks:java:io:kafka', project ':sdks:java:io:kinesis', project ':sdks:java:io:kudu', project ':sdks:java:io:mongodb', project ':sdks:java:io:mqtt', project ':sdks:java:io:neo4j', project ':sdks:java:io:parquet', project ':sdks:java:io:pulsar', project ':sdks:java:io:rabbitmq', project ':sdks:java:io:redis', project ':sdks:java:io:rrio', project ':sdks:java:io:singlestore', project ':sdks:java:io:snowflake', project ':sdks:java:io:solr', project ':sdks:java:io:sparkreceiver', project ':sdks:java:io:splunk', project ':sdks:java:io:synthetic', project ':sdks:java:io:thrift', project ':sdks:java:io:tika', project ':sdks:java:io:xml', project ':sdks:java:maven-archetypes:examples', project ':sdks:java:maven-archetypes:gcp-bom-examples', project ':sdks:java:maven-archetypes:starter', project ':sdks:java:testing:expansion-service', project ':sdks:java:testing:jpms-tests', project ':sdks:java:testing:kafka-service', project ':sdks:java:testing:load-tests', project ':sdks:java:testing:nexmark', project ':sdks:java:testing:test-utils', project ':sdks:java:testing:tpcds', project ':sdks:java:testing:watermarks', project ':sdks:java:transform-service:controller-container', project ':sdks:java:transform-service:launcher', project ':sdks:python:apache_beam:testing', project ':sdks:python:container:py310', project ':sdks:python:container:py311', project ':sdks:python:container:py38', project ':sdks:python:container:py39', project ':sdks:python:test-suites:dataflow', project ':sdks:python:test-suites:direct', project ':sdks:python:test-suites:portable', project ':sdks:python:test-suites:tox', project ':sdks:python:test-suites:xlang', project ':playground:frontend:playground_components:tools:extract_symbols_java', project ':runners:spark:3:job-server:container', project ':sdks:java:extensions:sql:datacatalog', project ':sdks:java:extensions:sql:expansion-service', project ':sdks:java:extensions:sql:hcatalog', project ':sdks:java:extensions:sql:jdbc', project ':sdks:java:extensions:sql:payloads', project ':sdks:java:extensions:sql:perf-tests', project ':sdks:java:extensions:sql:shell', project ':sdks:java:extensions:sql:udf', project ':sdks:java:extensions:sql:udf-test-provider', project ':sdks:java:extensions:sql:zetasql', project ':sdks:java:io:debezium:expansion-service', project ':sdks:java:io:elasticsearch-tests:elasticsearch-tests-2', project ':sdks:java:io:elasticsearch-tests:elasticsearch-tests-5', project ':sdks:java:io:elasticsearch-tests:elasticsearch-tests-6', project ':sdks:java:io:elasticsearch-tests:elasticsearch-tests-7', project ':sdks:java:io:elasticsearch-tests:elasticsearch-tests-8', project ':sdks:java:io:elasticsearch-tests:elasticsearch-tests-common', project ':sdks:java:io:google-cloud-platform:expansion-service', project ':sdks:java:io:kafka:kafka-01103', project ':sdks:java:io:kafka:kafka-100', project ':sdks:java:io:kafka:kafka-111', project ':sdks:java:io:kafka:kafka-201', project ':sdks:java:io:kafka:kafka-211', project ':sdks:java:io:kafka:kafka-222', project ':sdks:java:io:kafka:kafka-231', project ':sdks:java:io:kafka:kafka-241', project ':sdks:java:io:kafka:kafka-251', project ':sdks:java:io:kinesis:expansion-service', project ':sdks:java:io:snowflake:expansion-service', project ':sdks:java:io:sparkreceiver:2', project ':sdks:python:apache_beam:testing:benchmarks', project ':sdks:python:apache_beam:testing:load_tests', project ':sdks:python:test-suites:dataflow:py310', project ':sdks:python:test-suites:dataflow:py311', project ':sdks:python:test-suites:dataflow:py38', project ':sdks:python:test-suites:dataflow:py39', project ':sdks:python:test-suites:direct:py310', project ':sdks:python:test-suites:direct:py311', project ':sdks:python:test-suites:direct:py38', project ':sdks:python:test-suites:direct:py39', project ':sdks:python:test-suites:direct:xlang', project ':sdks:python:test-suites:portable:py310', project ':sdks:python:test-suites:portable:py311', project ':sdks:python:test-suites:portable:py38', project ':sdks:python:test-suites:portable:py39', project ':sdks:python:test-suites:tox:py310', project ':sdks:python:test-suites:tox:py311', project ':sdks:python:test-suites:tox:py38', project ':sdks:python:test-suites:tox:py39', project ':sdks:python:test-suites:tox:pycommon', project ':sdks:python:apache_beam:testing:benchmarks:nexmark']
> Configure project :buildSrc
Evaluating project ':buildSrc' using build file '<https://ci-beam.apache.org/job/beam_PreCommit_PythonDocker_Cron/ws/src/buildSrc/build.gradle.kts'.>
Build cache key for Kotlin DSL plugin specs accessors for classpath 'b12336cc1efc81b6889c17b00eb5e022' is 439034dc1255cd96d5b3be3be4a5fb7f
Skipping Kotlin DSL plugin specs accessors for classpath 'b12336cc1efc81b6889c17b00eb5e022' as it is up-to-date.
Build cache key for Kotlin DSL script compilation (Project/TopLevel/stage1) is b66cb5f5aa7fa9717c9c48018d7b9a1c
Skipping Kotlin DSL script compilation (Project/TopLevel/stage1) as it is up-to-date.
Build cache key for Kotlin DSL accessors for project ':buildSrc' is e906902012c4cc701c4f4ad95f517f2d
Skipping Kotlin DSL accessors for project ':buildSrc' as it is up-to-date.
Build cache key for Kotlin DSL script compilation (Project/TopLevel/stage2) is 67a3fe2cdf3b90ec221f209d06f308c4
Skipping Kotlin DSL script compilation (Project/TopLevel/stage2) as it is up-to-date.
Resolve mutations for :buildSrc:compileJava (Thread[Execution worker,5,main]) started.
:buildSrc:compileJava (Thread[Execution worker,5,main]) started.
> Task :buildSrc:compileJava NO-SOURCE
Skipping task ':buildSrc:compileJava' as it has no source files and no previous output files.
Resolve mutations for :buildSrc:compileGroovy (Thread[Execution worker,5,main]) started.
:buildSrc:compileGroovy (Thread[Execution worker,5,main]) started.
> Task :buildSrc:compileGroovy FROM-CACHE
Build cache key for task ':buildSrc:compileGroovy' is 26c29984037acc4bf8e9fa647d8f1375
Task ':buildSrc:compileGroovy' is not up-to-date because:
No history is available.
Loaded cache entry for task ':buildSrc:compileGroovy' with cache key 26c29984037acc4bf8e9fa647d8f1375
Resolve mutations for :buildSrc:pluginDescriptors (Thread[Execution worker,5,main]) started.
:buildSrc:pluginDescriptors (Thread[Execution worker,5,main]) started.
> Task :buildSrc:pluginDescriptors
Caching disabled for task ':buildSrc:pluginDescriptors' because:
Not worth caching
Task ':buildSrc:pluginDescriptors' is not up-to-date because:
No history is available.
Resolve mutations for :buildSrc:processResources (Thread[Execution worker,5,main]) started.
:buildSrc:processResources (Thread[Execution worker,5,main]) started.
> Task :buildSrc:processResources
Caching disabled for task ':buildSrc:processResources' because:
Not worth caching
Task ':buildSrc:processResources' is not up-to-date because:
No history is available.
file or directory '<https://ci-beam.apache.org/job/beam_PreCommit_PythonDocker_Cron/ws/src/buildSrc/src/main/resources',> not found
Resolve mutations for :buildSrc:classes (Thread[Execution worker,5,main]) started.
:buildSrc:classes (Thread[Execution worker,5,main]) started.
> Task :buildSrc:classes
Skipping task ':buildSrc:classes' as it has no actions.
Resolve mutations for :buildSrc:jar (Thread[Execution worker,5,main]) started.
:buildSrc:jar (Thread[Execution worker,5,main]) started.
> Task :buildSrc:jar
Caching disabled for task ':buildSrc:jar' because:
Not worth caching
Task ':buildSrc:jar' is not up-to-date because:
No history is available.
file or directory '<https://ci-beam.apache.org/job/beam_PreCommit_PythonDocker_Cron/ws/src/buildSrc/build/classes/java/main',> not found
Task path ':pythonDockerBuildPreCommit' matched project ':'
> Configure project :
Evaluating root project 'beam' using build file '<https://ci-beam.apache.org/job/beam_PreCommit_PythonDocker_Cron/ws/src/build.gradle.kts'.>
Build cache key for Kotlin DSL plugin specs accessors for classpath 'a2e9226b33d4a8bd0eef1b447f4abea7' is cb0c05ef87f7b76ec94f231ae59017e0
Skipping Kotlin DSL plugin specs accessors for classpath 'a2e9226b33d4a8bd0eef1b447f4abea7' as it is up-to-date.
Build cache key for Kotlin DSL script compilation (Project/TopLevel/stage1) is 1135f9ba7bff1a77233a0a4c87424d74
Skipping Kotlin DSL script compilation (Project/TopLevel/stage1) as it is up-to-date.
Offline dependencies root configured at 'offline-repository'
Build cache key for Kotlin DSL accessors for root project 'beam' is 050f1ed4b1aade9c4d0e270f9b8999c9
Skipping Kotlin DSL accessors for root project 'beam' as it is up-to-date.
Build cache key for Kotlin DSL script compilation (Project/TopLevel/stage2) is 66ecb0aed2e30c4f8f2a7df66a4206ec
Skipping Kotlin DSL script compilation (Project/TopLevel/stage2) as it is up-to-date.
Task name matched 'pythonDockerBuildPreCommit'
Selected primary task 'pythonDockerBuildPreCommit' from project :
> Configure project :sdks:python:container:py39
Evaluating project ':sdks:python:container:py39' using build file '<https://ci-beam.apache.org/job/beam_PreCommit_PythonDocker_Cron/ws/src/sdks/python/container/py39/build.gradle'.>
Offline dependencies root configured at 'offline-repository'
> Configure project :sdks:python:container:py38
Evaluating project ':sdks:python:container:py38' using build file '<https://ci-beam.apache.org/job/beam_PreCommit_PythonDocker_Cron/ws/src/sdks/python/container/py38/build.gradle'.>
Offline dependencies root configured at 'offline-repository'
> Configure project :sdks:python:container:py310
Evaluating project ':sdks:python:container:py310' using build file '<https://ci-beam.apache.org/job/beam_PreCommit_PythonDocker_Cron/ws/src/sdks/python/container/py310/build.gradle'.>
Offline dependencies root configured at 'offline-repository'
> Configure project :sdks:python:container:py311
Evaluating project ':sdks:python:container:py311' using build file '<https://ci-beam.apache.org/job/beam_PreCommit_PythonDocker_Cron/ws/src/sdks/python/container/py311/build.gradle'.>
Offline dependencies root configured at 'offline-repository'
> Configure project :sdks
Evaluating project ':sdks' using build file '<https://ci-beam.apache.org/job/beam_PreCommit_PythonDocker_Cron/ws/src/sdks/build.gradle'.>
> Configure project :sdks:python
Evaluating project ':sdks:python' using build file '<https://ci-beam.apache.org/job/beam_PreCommit_PythonDocker_Cron/ws/src/sdks/python/build.gradle'.>
Offline dependencies root configured at 'offline-repository'
> Configure project :sdks:python:container
Evaluating project ':sdks:python:container' using build file '<https://ci-beam.apache.org/job/beam_PreCommit_PythonDocker_Cron/ws/src/sdks/python/container/build.gradle'.>
Offline dependencies root configured at 'offline-repository'
> Configure project :release:go-licenses:py
Evaluating project ':release:go-licenses:py' using build file '<https://ci-beam.apache.org/job/beam_PreCommit_PythonDocker_Cron/ws/src/release/go-licenses/py/build.gradle'.>
Offline dependencies root configured at 'offline-repository'
Starting process 'command 'sh''. Working directory: <https://ci-beam.apache.org/job/beam_PreCommit_PythonDocker_Cron/ws/src/sdks/python/container> Command: sh -c <https://ci-beam.apache.org/job/beam_PreCommit_PythonDocker_Cron/ws/src/sdks/go/prepare_go_version.sh> --version go1.21.4
Successfully started process 'command 'sh''
System Go installation: /snap/bin/go is go version go1.16.15 linux/amd64; Preparing to use /home/jenkins/go/bin/go1.21.4
/home/jenkins/go/pkg/mod/golang.org/dl@v0.0.0-20231107201224-8165dcd93058/go1.21.4/main.go:20:8: //go:build comment without // +build comment
FAILURE: Build failed with an exception.
* What went wrong:
Could not determine the dependencies of task ':sdks:python:container:goBuild'.
> Could not create task ':sdks:python:container:goPrepare'.
> Process 'command 'sh'' finished with non-zero exit value 1
* Try:
> Run with --stacktrace option to get the stack trace.
> Run with --debug option to get more log output.
> Get more help at https://help.gradle.org.
Deprecated Gradle features were used in this build, making it incompatible with Gradle 9.0.
You can use '--warning-mode all' to show the individual deprecation warnings and determine if they come from your own scripts or plugins.
For more on this, please refer to https://docs.gradle.org/8.4/userguide/command_line_interface.html#sec:command_line_warnings in the Gradle documentation.
BUILD FAILED in 16s
4 actionable tasks: 3 executed, 1 from cache
Publishing build scan...
https://ge.apache.org/s/zhhsyizaiyqfw
Build step 'Invoke Gradle script' changed build result to FAILURE
Build step 'Invoke Gradle script' marked build as failure
---------------------------------------------------------------------
To unsubscribe, e-mail: builds-unsubscribe@beam.apache.org
For additional commands, e-mail: builds-help@beam.apache.org
Build failed in Jenkins: beam_PreCommit_PythonDocker_Cron #5206
Posted by Apache Jenkins Server <je...@builds.apache.org>.
See <https://ci-beam.apache.org/job/beam_PreCommit_PythonDocker_Cron/5206/display/redirect>
Changes:
------------------------------------------
Started by timer
Running as SYSTEM
[EnvInject] - Loading node environment variables.
Building remotely on apache-beam-jenkins-2 (beam) in workspace <https://ci-beam.apache.org/job/beam_PreCommit_PythonDocker_Cron/ws/>
The recommended git tool is: NONE
No credentials specified
Wiping out workspace first.
Cloning the remote Git repository
Using shallow clone with depth 1
Avoid fetching tags
Cloning repository https://github.com/apache/beam.git
> git init <https://ci-beam.apache.org/job/beam_PreCommit_PythonDocker_Cron/ws/src> # timeout=10
Fetching upstream changes from https://github.com/apache/beam.git
> git --version # timeout=10
> git --version # 'git version 2.25.1'
> git fetch --no-tags --force --progress --depth=1 -- https://github.com/apache/beam.git +refs/heads/*:refs/remotes/origin/* # timeout=10
> git config remote.origin.url https://github.com/apache/beam.git # timeout=10
> git config --add remote.origin.fetch +refs/heads/*:refs/remotes/origin/* # timeout=10
> git config remote.origin.url https://github.com/apache/beam.git # timeout=10
Using shallow fetch with depth 1
Fetching upstream changes from https://github.com/apache/beam.git
> git fetch --no-tags --force --progress --depth=1 -- https://github.com/apache/beam.git +refs/heads/*:refs/remotes/origin/* +refs/pull/${ghprbPullId}/*:refs/remotes/origin/pr/${ghprbPullId}/* # timeout=10
> git rev-parse origin/master^{commit} # timeout=10
Checking out Revision 2ad459113134dfffd3caeeb15e821bb644e08663 (origin/master)
> git config core.sparsecheckout # timeout=10
> git checkout -f 2ad459113134dfffd3caeeb15e821bb644e08663 # timeout=10
Commit message: "[YAML] - Kafka Read and Write proto (#29368)"
> git rev-list --no-walk 2ad459113134dfffd3caeeb15e821bb644e08663 # timeout=10
No emails were triggered.
[EnvInject] - Executing scripts and injecting environment variables after the SCM step.
[EnvInject] - Injecting as environment variables the properties content
SETUPTOOLS_USE_DISTUTILS=stdlib
SPARK_LOCAL_IP=127.0.0.1
[EnvInject] - Variables injected successfully.
[Gradle] - Launching build.
[src] $ <https://ci-beam.apache.org/job/beam_PreCommit_PythonDocker_Cron/ws/src/gradlew> --info --continue --max-workers=8 -Dorg.gradle.jvmargs=-Xms2g -Dorg.gradle.jvmargs=-Xmx6g -Dorg.gradle.vfs.watch=false -Pdocker-pull-licenses :pythonDockerBuildPreCommit
Initialized native services in: /home/jenkins/.gradle/native
Initialized jansi services in: /home/jenkins/.gradle/native
Received JVM installation metadata from '/usr/lib/jvm/java-8-openjdk-amd64': {JAVA_HOME=/usr/lib/jvm/java-8-openjdk-amd64/jre, JAVA_VERSION=1.8.0_382, JAVA_VENDOR=Private Build, RUNTIME_NAME=OpenJDK Runtime Environment, RUNTIME_VERSION=1.8.0_382-8u382-ga-1~20.04.1-b05, VM_NAME=OpenJDK 64-Bit Server VM, VM_VERSION=25.382-b05, VM_VENDOR=Private Build, OS_ARCH=amd64}
Checking if the launcher JVM can be re-used for build. To be re-used, the launcher JVM needs to match the parameters required for the build process: -Xmx6g -Dfile.encoding=UTF-8 -Duser.country=US -Duser.language=en -Duser.variant
To honour the JVM settings for this build a single-use Daemon process will be forked. For more on this, please refer to https://docs.gradle.org/8.4/userguide/gradle_daemon.html#sec:disabling_the_daemon in the Gradle documentation.
Starting process 'Gradle build daemon'. Working directory: /home/jenkins/.gradle/daemon/8.4 Command: /usr/lib/jvm/java-8-openjdk-amd64/bin/java -Xmx6g -Dfile.encoding=UTF-8 -Duser.country=US -Duser.language=en -Duser.variant -cp /home/jenkins/.gradle/wrapper/dists/gradle-8.4-bin/1w5dpkrfk8irigvoxmyhowfim/gradle-8.4/lib/gradle-launcher-8.4.jar -javaagent:/home/jenkins/.gradle/wrapper/dists/gradle-8.4-bin/1w5dpkrfk8irigvoxmyhowfim/gradle-8.4/lib/agents/gradle-instrumentation-agent-8.4.jar org.gradle.launcher.daemon.bootstrap.GradleDaemon 8.4
Successfully started process 'Gradle build daemon'
An attempt to start the daemon took 0.939 secs.
The client will now receive all logging from the daemon (pid: 641396). The daemon log file: /home/jenkins/.gradle/daemon/8.4/daemon-641396.out.log
Closing daemon's stdin at end of input.
The daemon will no longer process any standard input.
Daemon will be stopped at the end of the build
Using 8 worker leases.
Configuration on demand is an incubating feature.
Received JVM installation metadata from '/usr/lib/jvm/java-8-openjdk-amd64': {JAVA_HOME=/usr/lib/jvm/java-8-openjdk-amd64/jre, JAVA_VERSION=1.8.0_382, JAVA_VENDOR=Private Build, RUNTIME_NAME=OpenJDK Runtime Environment, RUNTIME_VERSION=1.8.0_382-8u382-ga-1~20.04.1-b05, VM_NAME=OpenJDK 64-Bit Server VM, VM_VERSION=25.382-b05, VM_VENDOR=Private Build, OS_ARCH=amd64}
Watching the file system is configured to be disabled
File system watching is inactive
Gradle Enterprise plugins resolution: https://plugins.gradle.org/m2
Starting Build
Skipping Kotlin DSL script compilation (Settings/TopLevel/stage1) as it is up-to-date.
Skipping Kotlin DSL script compilation (Settings/TopLevel/stage2) as it is up-to-date.
Settings evaluated using settings file '<https://ci-beam.apache.org/job/beam_PreCommit_PythonDocker_Cron/ws/src/settings.gradle.kts'.>
Enforcing Gradle Enterprise: https://ge.apache.org, allowUntrustedServer: false
Using local directory build cache for the root build (location = /home/jenkins/.gradle/caches/build-cache-1, removeUnusedEntriesAfter = 7 days).
Using remote HTTP build cache for the root build (allowInsecureProtocol = false, allowUntrustedServer = false, authenticated = true, url = https://beam-cache.apache.org/cache/, useExpectContinue = false).
Projects loaded. Root project using build file '<https://ci-beam.apache.org/job/beam_PreCommit_PythonDocker_Cron/ws/src/build.gradle.kts'.>
Included projects: [root project 'beam', project ':beam-test-gha', project ':beam-test-infra-metrics', project ':beam-test-infra-mock-apis', project ':beam-test-infra-pipelines', project ':beam-test-jenkins', project ':beam-test-tools', project ':beam-validate-runner', project ':com.google.api.gax.batching', project ':examples', project ':it', project ':learning', project ':model', project ':playground', project ':release', project ':runners', project ':sdks', project ':vendor', project ':website', project ':examples:java', project ':examples:kotlin', project ':examples:multi-language', project ':it:cassandra', project ':it:common', project ':it:conditions', project ':it:elasticsearch', project ':it:google-cloud-platform', project ':it:jdbc', project ':it:kafka', project ':it:mongodb', project ':it:neo4j', project ':it:splunk', project ':it:testcontainers', project ':it:truthmatchers', project ':learning:tour-of-beam', project ':model:fn-execution', project ':model:job-management', project ':model:pipeline', project ':playground:backend', project ':playground:frontend', project ':playground:kafka-emulator', project ':playground:terraform', project ':release:go-licenses', project ':runners:core-construction-java', project ':runners:core-java', project ':runners:direct-java', project ':runners:extensions-java', project ':runners:flink', project ':runners:google-cloud-dataflow-java', project ':runners:java-fn-execution', project ':runners:java-job-service', project ':runners:jet', project ':runners:local-java', project ':runners:portability', project ':runners:samza', project ':runners:spark', project ':runners:twister2', project ':sdks:go', project ':sdks:java', project ':sdks:python', project ':sdks:typescript', project ':vendor:bytebuddy-1_12_8', project ':vendor:calcite-1_28_0', project ':vendor:grpc-1_54_0', project ':vendor:guava-32_1_2-jre', project ':examples:java:cdap', project ':examples:java:twitter', project ':learning:tour-of-beam:frontend', project ':learning:tour-of-beam:terraform', project ':playground:backend:containers', project ':playground:frontend:playground_components', project ':release:go-licenses:go', project ':release:go-licenses:java', project ':release:go-licenses:py', project ':runners:extensions-java:metrics', project ':runners:flink:1.12', project ':runners:flink:1.13', project ':runners:flink:1.14', project ':runners:flink:1.15', project ':runners:flink:1.16', project ':runners:google-cloud-dataflow-java:arm', project ':runners:google-cloud-dataflow-java:examples', project ':runners:google-cloud-dataflow-java:examples-streaming', project ':runners:google-cloud-dataflow-java:worker', project ':runners:portability:java', project ':runners:samza:job-server', project ':runners:spark:3', project ':sdks:go:container', project ':sdks:go:examples', project ':sdks:go:test', project ':sdks:java:bom', project ':sdks:java:build-tools', project ':sdks:java:container', project ':sdks:java:core', project ':sdks:java:expansion-service', project ':sdks:java:extensions', project ':sdks:java:fn-execution', project ':sdks:java:harness', project ':sdks:java:io', project ':sdks:java:javadoc', project ':sdks:java:maven-archetypes', project ':sdks:java:testing', project ':sdks:java:transform-service', project ':sdks:python:apache_beam', project ':sdks:python:container', project ':sdks:python:expansion-service-container', project ':sdks:python:test-suites', project ':sdks:typescript:container', project ':examples:java:cdap:hubspot', project ':examples:java:cdap:salesforce', project ':examples:java:cdap:servicenow', project ':examples:java:cdap:zendesk', project ':playground:backend:containers:go', project ':playground:backend:containers:java', project ':playground:backend:containers:python', project ':playground:backend:containers:router', project ':playground:backend:containers:scio', project ':playground:frontend:playground_components:tools', project ':runners:flink:1.12:job-server', project ':runners:flink:1.12:job-server-container', project ':runners:flink:1.13:job-server', project ':runners:flink:1.13:job-server-container', project ':runners:flink:1.14:job-server', project ':runners:flink:1.14:job-server-container', project ':runners:flink:1.15:job-server', project ':runners:flink:1.15:job-server-container', project ':runners:flink:1.16:job-server', project ':runners:flink:1.16:job-server-container', project ':runners:google-cloud-dataflow-java:worker:windmill', project ':runners:spark:3:job-server', project ':sdks:go:test:load', project ':sdks:java:bom:gcp', project ':sdks:java:container:agent', project ':sdks:java:container:java11', project ':sdks:java:container:java17', project ':sdks:java:container:java21', project ':sdks:java:container:java8', project ':sdks:java:core:jmh', project ':sdks:java:expansion-service:app', project ':sdks:java:expansion-service:container', project ':sdks:java:extensions:arrow', project ':sdks:java:extensions:avro', project ':sdks:java:extensions:euphoria', project ':sdks:java:extensions:google-cloud-platform-core', project ':sdks:java:extensions:jackson', project ':sdks:java:extensions:join-library', project ':sdks:java:extensions:kryo', project ':sdks:java:extensions:ml', project ':sdks:java:extensions:protobuf', project ':sdks:java:extensions:python', project ':sdks:java:extensions:sbe', project ':sdks:java:extensions:schemaio-expansion-service', project ':sdks:java:extensions:sketching', project ':sdks:java:extensions:sorter', project ':sdks:java:extensions:sql', project ':sdks:java:extensions:timeseries', project ':sdks:java:extensions:zetasketch', project ':sdks:java:harness:jmh', project ':sdks:java:io:amazon-web-services', project ':sdks:java:io:amazon-web-services2', project ':sdks:java:io:amqp', project ':sdks:java:io:azure', project ':sdks:java:io:azure-cosmos', project ':sdks:java:io:bigquery-io-perf-tests', project ':sdks:java:io:cassandra', project ':sdks:java:io:cdap', project ':sdks:java:io:clickhouse', project ':sdks:java:io:common', project ':sdks:java:io:contextualtextio', project ':sdks:java:io:csv', project ':sdks:java:io:debezium', project ':sdks:java:io:elasticsearch', project ':sdks:java:io:elasticsearch-tests', project ':sdks:java:io:expansion-service', project ':sdks:java:io:file-based-io-tests', project ':sdks:java:io:file-schema-transform', project ':sdks:java:io:google-ads', project ':sdks:java:io:google-cloud-platform', project ':sdks:java:io:hadoop-common', project ':sdks:java:io:hadoop-file-system', project ':sdks:java:io:hadoop-format', project ':sdks:java:io:hbase', project ':sdks:java:io:hcatalog', project ':sdks:java:io:influxdb', project ':sdks:java:io:jdbc', project ':sdks:java:io:jms', project ':sdks:java:io:json', project ':sdks:java:io:kafka', project ':sdks:java:io:kinesis', project ':sdks:java:io:kudu', project ':sdks:java:io:mongodb', project ':sdks:java:io:mqtt', project ':sdks:java:io:neo4j', project ':sdks:java:io:parquet', project ':sdks:java:io:pulsar', project ':sdks:java:io:rabbitmq', project ':sdks:java:io:redis', project ':sdks:java:io:rrio', project ':sdks:java:io:singlestore', project ':sdks:java:io:snowflake', project ':sdks:java:io:solr', project ':sdks:java:io:sparkreceiver', project ':sdks:java:io:splunk', project ':sdks:java:io:synthetic', project ':sdks:java:io:thrift', project ':sdks:java:io:tika', project ':sdks:java:io:xml', project ':sdks:java:maven-archetypes:examples', project ':sdks:java:maven-archetypes:gcp-bom-examples', project ':sdks:java:maven-archetypes:starter', project ':sdks:java:testing:expansion-service', project ':sdks:java:testing:jpms-tests', project ':sdks:java:testing:kafka-service', project ':sdks:java:testing:load-tests', project ':sdks:java:testing:nexmark', project ':sdks:java:testing:test-utils', project ':sdks:java:testing:tpcds', project ':sdks:java:testing:watermarks', project ':sdks:java:transform-service:controller-container', project ':sdks:java:transform-service:launcher', project ':sdks:python:apache_beam:testing', project ':sdks:python:container:py310', project ':sdks:python:container:py311', project ':sdks:python:container:py38', project ':sdks:python:container:py39', project ':sdks:python:test-suites:dataflow', project ':sdks:python:test-suites:direct', project ':sdks:python:test-suites:portable', project ':sdks:python:test-suites:tox', project ':sdks:python:test-suites:xlang', project ':playground:frontend:playground_components:tools:extract_symbols_java', project ':runners:spark:3:job-server:container', project ':sdks:java:extensions:sql:datacatalog', project ':sdks:java:extensions:sql:expansion-service', project ':sdks:java:extensions:sql:hcatalog', project ':sdks:java:extensions:sql:jdbc', project ':sdks:java:extensions:sql:payloads', project ':sdks:java:extensions:sql:perf-tests', project ':sdks:java:extensions:sql:shell', project ':sdks:java:extensions:sql:udf', project ':sdks:java:extensions:sql:udf-test-provider', project ':sdks:java:extensions:sql:zetasql', project ':sdks:java:io:debezium:expansion-service', project ':sdks:java:io:elasticsearch-tests:elasticsearch-tests-2', project ':sdks:java:io:elasticsearch-tests:elasticsearch-tests-5', project ':sdks:java:io:elasticsearch-tests:elasticsearch-tests-6', project ':sdks:java:io:elasticsearch-tests:elasticsearch-tests-7', project ':sdks:java:io:elasticsearch-tests:elasticsearch-tests-8', project ':sdks:java:io:elasticsearch-tests:elasticsearch-tests-common', project ':sdks:java:io:google-cloud-platform:expansion-service', project ':sdks:java:io:kafka:kafka-01103', project ':sdks:java:io:kafka:kafka-100', project ':sdks:java:io:kafka:kafka-111', project ':sdks:java:io:kafka:kafka-201', project ':sdks:java:io:kafka:kafka-211', project ':sdks:java:io:kafka:kafka-222', project ':sdks:java:io:kafka:kafka-231', project ':sdks:java:io:kafka:kafka-241', project ':sdks:java:io:kafka:kafka-251', project ':sdks:java:io:kinesis:expansion-service', project ':sdks:java:io:snowflake:expansion-service', project ':sdks:java:io:sparkreceiver:2', project ':sdks:python:apache_beam:testing:benchmarks', project ':sdks:python:apache_beam:testing:load_tests', project ':sdks:python:test-suites:dataflow:py310', project ':sdks:python:test-suites:dataflow:py311', project ':sdks:python:test-suites:dataflow:py38', project ':sdks:python:test-suites:dataflow:py39', project ':sdks:python:test-suites:direct:py310', project ':sdks:python:test-suites:direct:py311', project ':sdks:python:test-suites:direct:py38', project ':sdks:python:test-suites:direct:py39', project ':sdks:python:test-suites:direct:xlang', project ':sdks:python:test-suites:portable:py310', project ':sdks:python:test-suites:portable:py311', project ':sdks:python:test-suites:portable:py38', project ':sdks:python:test-suites:portable:py39', project ':sdks:python:test-suites:tox:py310', project ':sdks:python:test-suites:tox:py311', project ':sdks:python:test-suites:tox:py38', project ':sdks:python:test-suites:tox:py39', project ':sdks:python:test-suites:tox:pycommon', project ':sdks:python:apache_beam:testing:benchmarks:nexmark']
> Configure project :buildSrc
Evaluating project ':buildSrc' using build file '<https://ci-beam.apache.org/job/beam_PreCommit_PythonDocker_Cron/ws/src/buildSrc/build.gradle.kts'.>
Build cache key for Kotlin DSL plugin specs accessors for classpath 'b12336cc1efc81b6889c17b00eb5e022' is 439034dc1255cd96d5b3be3be4a5fb7f
Skipping Kotlin DSL plugin specs accessors for classpath 'b12336cc1efc81b6889c17b00eb5e022' as it is up-to-date.
Build cache key for Kotlin DSL script compilation (Project/TopLevel/stage1) is b66cb5f5aa7fa9717c9c48018d7b9a1c
Skipping Kotlin DSL script compilation (Project/TopLevel/stage1) as it is up-to-date.
Build cache key for Kotlin DSL accessors for project ':buildSrc' is e906902012c4cc701c4f4ad95f517f2d
Skipping Kotlin DSL accessors for project ':buildSrc' as it is up-to-date.
Build cache key for Kotlin DSL script compilation (Project/TopLevel/stage2) is 67a3fe2cdf3b90ec221f209d06f308c4
Skipping Kotlin DSL script compilation (Project/TopLevel/stage2) as it is up-to-date.
Resolve mutations for :buildSrc:compileJava (Thread[Execution worker,5,main]) started.
:buildSrc:compileJava (Thread[Execution worker,5,main]) started.
> Task :buildSrc:compileJava NO-SOURCE
Skipping task ':buildSrc:compileJava' as it has no source files and no previous output files.
Resolve mutations for :buildSrc:compileGroovy (Thread[Execution worker,5,main]) started.
:buildSrc:compileGroovy (Thread[Execution worker,5,main]) started.
> Task :buildSrc:compileGroovy FROM-CACHE
Build cache key for task ':buildSrc:compileGroovy' is 26c29984037acc4bf8e9fa647d8f1375
Task ':buildSrc:compileGroovy' is not up-to-date because:
No history is available.
Loaded cache entry for task ':buildSrc:compileGroovy' with cache key 26c29984037acc4bf8e9fa647d8f1375
Resolve mutations for :buildSrc:pluginDescriptors (Thread[Execution worker,5,main]) started.
:buildSrc:pluginDescriptors (Thread[Execution worker,5,main]) started.
> Task :buildSrc:pluginDescriptors
Caching disabled for task ':buildSrc:pluginDescriptors' because:
Not worth caching
Task ':buildSrc:pluginDescriptors' is not up-to-date because:
No history is available.
Resolve mutations for :buildSrc:processResources (Thread[Execution worker,5,main]) started.
:buildSrc:processResources (Thread[Execution worker,5,main]) started.
> Task :buildSrc:processResources
Caching disabled for task ':buildSrc:processResources' because:
Not worth caching
Task ':buildSrc:processResources' is not up-to-date because:
No history is available.
file or directory '<https://ci-beam.apache.org/job/beam_PreCommit_PythonDocker_Cron/ws/src/buildSrc/src/main/resources',> not found
Resolve mutations for :buildSrc:classes (Thread[Execution worker,5,main]) started.
:buildSrc:classes (Thread[Execution worker,5,main]) started.
> Task :buildSrc:classes
Skipping task ':buildSrc:classes' as it has no actions.
Resolve mutations for :buildSrc:jar (Thread[Execution worker,5,main]) started.
:buildSrc:jar (Thread[Execution worker,5,main]) started.
> Task :buildSrc:jar
Caching disabled for task ':buildSrc:jar' because:
Not worth caching
Task ':buildSrc:jar' is not up-to-date because:
No history is available.
file or directory '<https://ci-beam.apache.org/job/beam_PreCommit_PythonDocker_Cron/ws/src/buildSrc/build/classes/java/main',> not found
Task path ':pythonDockerBuildPreCommit' matched project ':'
> Configure project :
Evaluating root project 'beam' using build file '<https://ci-beam.apache.org/job/beam_PreCommit_PythonDocker_Cron/ws/src/build.gradle.kts'.>
Build cache key for Kotlin DSL plugin specs accessors for classpath 'a2e9226b33d4a8bd0eef1b447f4abea7' is cb0c05ef87f7b76ec94f231ae59017e0
Skipping Kotlin DSL plugin specs accessors for classpath 'a2e9226b33d4a8bd0eef1b447f4abea7' as it is up-to-date.
Build cache key for Kotlin DSL script compilation (Project/TopLevel/stage1) is 1135f9ba7bff1a77233a0a4c87424d74
Skipping Kotlin DSL script compilation (Project/TopLevel/stage1) as it is up-to-date.
Offline dependencies root configured at 'offline-repository'
Build cache key for Kotlin DSL accessors for root project 'beam' is 050f1ed4b1aade9c4d0e270f9b8999c9
Skipping Kotlin DSL accessors for root project 'beam' as it is up-to-date.
Build cache key for Kotlin DSL script compilation (Project/TopLevel/stage2) is 66ecb0aed2e30c4f8f2a7df66a4206ec
Skipping Kotlin DSL script compilation (Project/TopLevel/stage2) as it is up-to-date.
Task name matched 'pythonDockerBuildPreCommit'
Selected primary task 'pythonDockerBuildPreCommit' from project :
> Configure project :sdks:python:container:py39
Evaluating project ':sdks:python:container:py39' using build file '<https://ci-beam.apache.org/job/beam_PreCommit_PythonDocker_Cron/ws/src/sdks/python/container/py39/build.gradle'.>
Offline dependencies root configured at 'offline-repository'
> Configure project :sdks:python:container:py38
Evaluating project ':sdks:python:container:py38' using build file '<https://ci-beam.apache.org/job/beam_PreCommit_PythonDocker_Cron/ws/src/sdks/python/container/py38/build.gradle'.>
Offline dependencies root configured at 'offline-repository'
> Configure project :sdks:python:container:py310
Evaluating project ':sdks:python:container:py310' using build file '<https://ci-beam.apache.org/job/beam_PreCommit_PythonDocker_Cron/ws/src/sdks/python/container/py310/build.gradle'.>
Offline dependencies root configured at 'offline-repository'
> Configure project :sdks:python:container:py311
Evaluating project ':sdks:python:container:py311' using build file '<https://ci-beam.apache.org/job/beam_PreCommit_PythonDocker_Cron/ws/src/sdks/python/container/py311/build.gradle'.>
Offline dependencies root configured at 'offline-repository'
> Configure project :sdks
Evaluating project ':sdks' using build file '<https://ci-beam.apache.org/job/beam_PreCommit_PythonDocker_Cron/ws/src/sdks/build.gradle'.>
> Configure project :sdks:python
Evaluating project ':sdks:python' using build file '<https://ci-beam.apache.org/job/beam_PreCommit_PythonDocker_Cron/ws/src/sdks/python/build.gradle'.>
Offline dependencies root configured at 'offline-repository'
> Configure project :sdks:python:container
Evaluating project ':sdks:python:container' using build file '<https://ci-beam.apache.org/job/beam_PreCommit_PythonDocker_Cron/ws/src/sdks/python/container/build.gradle'.>
Offline dependencies root configured at 'offline-repository'
> Configure project :release:go-licenses:py
Evaluating project ':release:go-licenses:py' using build file '<https://ci-beam.apache.org/job/beam_PreCommit_PythonDocker_Cron/ws/src/release/go-licenses/py/build.gradle'.>
Offline dependencies root configured at 'offline-repository'
Starting process 'command 'sh''. Working directory: <https://ci-beam.apache.org/job/beam_PreCommit_PythonDocker_Cron/ws/src/sdks/python/container> Command: sh -c <https://ci-beam.apache.org/job/beam_PreCommit_PythonDocker_Cron/ws/src/sdks/go/prepare_go_version.sh> --version go1.21.4
Successfully started process 'command 'sh''
System Go installation: /snap/bin/go is go version go1.16.15 linux/amd64; Preparing to use /home/jenkins/go/bin/go1.21.4
/home/jenkins/go/pkg/mod/golang.org/dl@v0.0.0-20231107201224-8165dcd93058/go1.21.4/main.go:20:8: //go:build comment without // +build comment
FAILURE: Build failed with an exception.
* What went wrong:
Could not determine the dependencies of task ':sdks:python:container:goBuild'.
> Could not create task ':sdks:python:container:goPrepare'.
> Process 'command 'sh'' finished with non-zero exit value 1
* Try:
> Run with --stacktrace option to get the stack trace.
> Run with --debug option to get more log output.
> Get more help at https://help.gradle.org.
Deprecated Gradle features were used in this build, making it incompatible with Gradle 9.0.
You can use '--warning-mode all' to show the individual deprecation warnings and determine if they come from your own scripts or plugins.
For more on this, please refer to https://docs.gradle.org/8.4/userguide/command_line_interface.html#sec:command_line_warnings in the Gradle documentation.
BUILD FAILED in 11s
4 actionable tasks: 3 executed, 1 from cache
Publishing build scan...
https://ge.apache.org/s/cga5cx4wwcbiq
Build step 'Invoke Gradle script' changed build result to FAILURE
Build step 'Invoke Gradle script' marked build as failure
---------------------------------------------------------------------
To unsubscribe, e-mail: builds-unsubscribe@beam.apache.org
For additional commands, e-mail: builds-help@beam.apache.org