You are viewing a plain text version of this content. The canonical link for it is here.
Posted to notifications@directory.apache.org by Apache Jenkins Server <je...@builds.apache.org> on 2021/02/13 23:47:12 UTC

Build failed in Jenkins: Directory » dir-fortress-core-docker-apacheds-test #48

See <https://ci-builds.apache.org/job/Directory/job/dir-fortress-core-docker-apacheds-test/48/display/redirect>

Changes:


------------------------------------------
[...truncated 105.20 KB...]
2021-02-13 23:42:046 INFO  UserDAO:1790 - deleteResetFlag user [jtsTU5User6] no such attribute:pwdReset
2021-02-13 23:42:047 INFO  UserDAO:1790 - deleteResetFlag user [jtsTU5User6] no such attribute:pwdReset
2021-02-13 23:42:048 INFO  UserDAO:1790 - deleteResetFlag user [jtsTU5User6] no such attribute:pwdReset
2021-02-13 23:42:049 INFO  UserDAO:1790 - deleteResetFlag user [jtsTU5User6] no such attribute:pwdReset
2021-02-13 23:42:050 INFO  UserDAO:1790 - deleteResetFlag user [jtsTU5User6] no such attribute:pwdReset
2021-02-13 23:42:051 INFO  UserDAO:1790 - deleteResetFlag user [jtsTU5User6] no such attribute:pwdReset
2021-02-13 23:42:053 INFO  UserDAO:1790 - deleteResetFlag user [jtsTU5User6] no such attribute:pwdReset
2021-02-13 23:42:054 INFO  UserDAO:1790 - deleteResetFlag user [jtsTU5User6] no such attribute:pwdReset
2021-02-13 23:42:055 INFO  UserDAO:1790 - deleteResetFlag user [jtsTU5User6] no such attribute:pwdReset
2021-02-13 23:42:056 INFO  UserDAO:1790 - deleteResetFlag user [jtsTU5User6] no such attribute:pwdReset
2021-02-13 23:42:057 INFO  UserDAO:1790 - deleteResetFlag user [jtsTU5User6] no such attribute:pwdReset
2021-02-13 23:42:058 INFO  UserDAO:1790 - deleteResetFlag user [jtsTU5User6] no such attribute:pwdReset
2021-02-13 23:42:059 INFO  UserDAO:1790 - deleteResetFlag user [jtsTU5User6] no such attribute:pwdReset
2021-02-13 23:43:001 INFO  UserDAO:1790 - deleteResetFlag user [jtsTU5User6] no such attribute:pwdReset
2021-02-13 23:43:002 INFO  UserDAO:1790 - deleteResetFlag user [jtsTU5User6] no such attribute:pwdReset
2021-02-13 23:43:003 INFO  UserDAO:1790 - deleteResetFlag user [jtsTU5User6] no such attribute:pwdReset
2021-02-13 23:43:004 INFO  UserDAO:1790 - deleteResetFlag user [jtsTU5User6] no such attribute:pwdReset
2021-02-13 23:43:005 INFO  UserDAO:1790 - deleteResetFlag user [jtsTU5User6] no such attribute:pwdReset
2021-02-13 23:43:006 INFO  UserDAO:1790 - deleteResetFlag user [jtsTU5User6] no such attribute:pwdReset
2021-02-13 23:43:008 INFO  UserDAO:1790 - deleteResetFlag user [jtsTU5User6] no such attribute:pwdReset
2021-02-13 23:43:009 INFO  UserDAO:1790 - deleteResetFlag user [jtsTU5User6] no such attribute:pwdReset
2021-02-13 23:43:010 INFO  UserDAO:1790 - deleteResetFlag user [jtsTU5User6] no such attribute:pwdReset
2021-02-13 23:43:011 INFO  UserDAO:1790 - deleteResetFlag user [jtsTU5User6] no such attribute:pwdReset
2021-02-13 23:43:012 INFO  UserDAO:1790 - deleteResetFlag user [jtsTU5User6] no such attribute:pwdReset
2021-02-13 23:43:013 INFO  UserDAO:1790 - deleteResetFlag user [jtsTU5User6] no such attribute:pwdReset
2021-02-13 23:43:014 INFO  UserDAO:1790 - deleteResetFlag user [jtsTU5User6] no such attribute:pwdReset
2021-02-13 23:43:016 INFO  UserDAO:1790 - deleteResetFlag user [jtsTU5User6] no such attribute:pwdReset
2021-02-13 23:43:017 INFO  UserDAO:1790 - deleteResetFlag user [jtsTU5User6] no such attribute:pwdReset
2021-02-13 23:43:018 INFO  UserDAO:1790 - deleteResetFlag user [jtsTU5User6] no such attribute:pwdReset
2021-02-13 23:43:019 INFO  UserDAO:1790 - deleteResetFlag user [jtsTU5User6] no such attribute:pwdReset
2021-02-13 23:43:020 INFO  UserDAO:1790 - deleteResetFlag user [jtsTU5User6] no such attribute:pwdReset
2021-02-13 23:43:021 INFO  UserDAO:1790 - deleteResetFlag user [jtsTU5User6] no such attribute:pwdReset
2021-02-13 23:43:022 INFO  UserDAO:1790 - deleteResetFlag user [jtsTU5User6] no such attribute:pwdReset
2021-02-13 23:43:023 INFO  UserDAO:1790 - deleteResetFlag user [jtsTU5User6] no such attribute:pwdReset
2021-02-13 23:43:025 INFO  UserDAO:1790 - deleteResetFlag user [jtsTU5User6] no such attribute:pwdReset
2021-02-13 23:43:026 INFO  UserDAO:1790 - deleteResetFlag user [jtsTU5User6] no such attribute:pwdReset
2021-02-13 23:43:027 INFO  UserDAO:1790 - deleteResetFlag user [jtsTU5User6] no such attribute:pwdReset
2021-02-13 23:43:028 INFO  UserDAO:1790 - deleteResetFlag user [jtsTU5User6] no such attribute:pwdReset
2021-02-13 23:43:029 INFO  UserDAO:1790 - deleteResetFlag user [jtsTU5User6] no such attribute:pwdReset
2021-02-13 23:43:030 INFO  UserDAO:1790 - deleteResetFlag user [jtsTU5User6] no such attribute:pwdReset
2021-02-13 23:43:032 INFO  UserDAO:1790 - deleteResetFlag user [jtsTU5User6] no such attribute:pwdReset
2021-02-13 23:43:032 INFO  UserDAO:1790 - deleteResetFlag user [jtsTU5User6] no such attribute:pwdReset
2021-02-13 23:43:033 INFO  UserDAO:1790 - deleteResetFlag user [jtsTU5User6] no such attribute:pwdReset
2021-02-13 23:43:034 INFO  UserDAO:1790 - deleteResetFlag user [jtsTU5User6] no such attribute:pwdReset
2021-02-13 23:43:036 INFO  UserDAO:1790 - deleteResetFlag user [jtsTU5User6] no such attribute:pwdReset
2021-02-13 23:43:037 INFO  UserDAO:1790 - deleteResetFlag user [jtsTU5User6] no such attribute:pwdReset
2021-02-13 23:43:038 INFO  UserDAO:1790 - deleteResetFlag user [jtsTU5User6] no such attribute:pwdReset
2021-02-13 23:43:040 INFO  UserDAO:1790 - deleteResetFlag user [jtsTU5User6] no such attribute:pwdReset
2021-02-13 23:43:041 INFO  UserDAO:1790 - deleteResetFlag user [jtsTU5User6] no such attribute:pwdReset
2021-02-13 23:43:042 INFO  UserDAO:1790 - deleteResetFlag user [jtsTU5User6] no such attribute:pwdReset
2021-02-13 23:43:043 INFO  UserDAO:1790 - deleteResetFlag user [jtsTU5User6] no such attribute:pwdReset
2021-02-13 23:43:044 INFO  UserDAO:1790 - deleteResetFlag user [jtsTU5User6] no such attribute:pwdReset
2021-02-13 23:43:045 INFO  UserDAO:1790 - deleteResetFlag user [jtsTU5User6] no such attribute:pwdReset
2021-02-13 23:43:046 INFO  UserDAO:1790 - deleteResetFlag user [jtsTU5User6] no such attribute:pwdReset
2021-02-13 23:43:047 INFO  UserDAO:1790 - deleteResetFlag user [jtsTU5User6] no such attribute:pwdReset
2021-02-13 23:43:048 INFO  UserDAO:1790 - deleteResetFlag user [jtsTU5User6] no such attribute:pwdReset
2021-02-13 23:43:050 INFO  UserDAO:1790 - deleteResetFlag user [jtsTU5User6] no such attribute:pwdReset
2021-02-13 23:43:051 INFO  UserDAO:1790 - deleteResetFlag user [jtsTU5User6] no such attribute:pwdReset
2021-02-13 23:43:052 INFO  UserDAO:1790 - deleteResetFlag user [jtsTU5User6] no such attribute:pwdReset
2021-02-13 23:43:053 INFO  UserDAO:1790 - deleteResetFlag user [jtsTU5User6] no such attribute:pwdReset
2021-02-13 23:43:054 INFO  UserDAO:1790 - deleteResetFlag user [jtsTU5User6] no such attribute:pwdReset
2021-02-13 23:43:055 INFO  UserDAO:1790 - deleteResetFlag user [jtsTU5User6] no such attribute:pwdReset
2021-02-13 23:43:056 INFO  UserDAO:1790 - deleteResetFlag user [jtsTU5User6] no such attribute:pwdReset
2021-02-13 23:43:058 INFO  UserDAO:1790 - deleteResetFlag user [jtsTU5User6] no such attribute:pwdReset
2021-02-13 23:43:059 INFO  UserDAO:1790 - deleteResetFlag user [jtsTU5User6] no such attribute:pwdReset
2021-02-13 23:44:000 INFO  UserDAO:1790 - deleteResetFlag user [jtsTU5User6] no such attribute:pwdReset
2021-02-13 23:44:001 INFO  UserDAO:1790 - deleteResetFlag user [jtsTU5User6] no such attribute:pwdReset
2021-02-13 23:44:002 INFO  UserDAO:1790 - deleteResetFlag user [jtsTU5User6] no such attribute:pwdReset
2021-02-13 23:44:003 INFO  UserDAO:1790 - deleteResetFlag user [jtsTU5User6] no such attribute:pwdReset
2021-02-13 23:44:004 INFO  UserDAO:1790 - deleteResetFlag user [jtsTU5User6] no such attribute:pwdReset
2021-02-13 23:44:005 INFO  UserDAO:1790 - deleteResetFlag user [jtsTU5User6] no such attribute:pwdReset
2021-02-13 23:44:007 INFO  UserDAO:1790 - deleteResetFlag user [jtsTU5User6] no such attribute:pwdReset
2021-02-13 23:44:008 INFO  UserDAO:1790 - deleteResetFlag user [jtsTU5User6] no such attribute:pwdReset
2021-02-13 23:44:009 INFO  UserDAO:1790 - deleteResetFlag user [jtsTU5User6] no such attribute:pwdReset
2021-02-13 23:44:010 INFO  UserDAO:1790 - deleteResetFlag user [jtsTU5User6] no such attribute:pwdReset
2021-02-13 23:44:011 INFO  UserDAO:1790 - deleteResetFlag user [jtsTU5User6] no such attribute:pwdReset
2021-02-13 23:44:011 INFO  LogUtil:64 - PWLEN7 PLCY TP1 USR TU5
2021-02-13 23:44:012 INFO  LogUtil:64 - PWLEN8 PLCY TP1 USR TU5
2021-02-13 23:44:012 INFO  LogUtil:64 - PWEXP7 PLCY TP1 USR TU5
2021-02-13 23:44:015 INFO  UserDAO:1790 - deleteResetFlag user [jtsTU5User9] no such attribute:pwdReset
2021-02-13 23:44:015 INFO  LogUtil:64 - org.apache.directory.fortress.core.impl.TestUtils.sleep for len=2000
2021-02-13 23:44:017 INFO  LogUtil:64 - org.apache.directory.fortress.core.impl.TestUtils.sleep for len=1000
2021-02-13 23:44:018 ERROR PswdPolicyMgrImplTest:532 - expireWarning caught SecurityException rc=1017, msg=checkPwPolicies for userId [jtsTU5User9] PASSWORD HAS EXPIRED
org.apache.directory.fortress.core.PasswordException: checkPwPolicies for userId [jtsTU5User9] PASSWORD HAS EXPIRED
	at org.apache.directory.fortress.core.impl.UserDAO.checkPassword(UserDAO.java:845) ~[classes/:?]
	at org.apache.directory.fortress.core.impl.UserP.authenticate(UserP.java:419) ~[classes/:?]
	at org.apache.directory.fortress.core.impl.UserP.createSession(UserP.java:578) ~[classes/:?]
	at org.apache.directory.fortress.core.impl.UserP.createSession(UserP.java:497) ~[classes/:?]
	at org.apache.directory.fortress.core.impl.AccessMgrImpl.createSession(AccessMgrImpl.java:115) ~[classes/:?]
	at org.apache.directory.fortress.core.impl.PswdPolicyMgrImplTest.expireWarning(PswdPolicyMgrImplTest.java:513) [test-classes/:?]
	at org.apache.directory.fortress.core.impl.PswdPolicyMgrImplTest.testExpireWarning(PswdPolicyMgrImplTest.java:460) [test-classes/:?]
	at sun.reflect.NativeMethodAccessorImpl.invoke0(Native Method) ~[?:1.8.0_241]
	at sun.reflect.NativeMethodAccessorImpl.invoke(NativeMethodAccessorImpl.java:62) ~[?:1.8.0_241]
	at sun.reflect.DelegatingMethodAccessorImpl.invoke(DelegatingMethodAccessorImpl.java:43) ~[?:1.8.0_241]
	at java.lang.reflect.Method.invoke(Method.java:498) ~[?:1.8.0_241]
	at junit.framework.TestCase.runTest(TestCase.java:176) [junit-4.12.jar:4.12]
	at junit.framework.TestCase.runBare(TestCase.java:141) [junit-4.12.jar:4.12]
	at junit.framework.TestResult$1.protect(TestResult.java:122) [junit-4.12.jar:4.12]
	at junit.framework.TestResult.runProtected(TestResult.java:142) [junit-4.12.jar:4.12]
	at junit.framework.TestResult.run(TestResult.java:125) [junit-4.12.jar:4.12]
	at junit.framework.TestCase.run(TestCase.java:129) [junit-4.12.jar:4.12]
	at junit.framework.TestSuite.runTest(TestSuite.java:252) [junit-4.12.jar:4.12]
	at junit.framework.TestSuite.run(TestSuite.java:247) [junit-4.12.jar:4.12]
	at org.junit.internal.runners.JUnit38ClassRunner.run(JUnit38ClassRunner.java:86) [junit-4.12.jar:4.12]
	at org.apache.maven.surefire.junit4.JUnit4Provider.execute(JUnit4Provider.java:283) [surefire-junit4-2.18.1.jar:2.18.1]
	at org.apache.maven.surefire.junit4.JUnit4Provider.executeWithRerun(JUnit4Provider.java:173) [surefire-junit4-2.18.1.jar:2.18.1]
	at org.apache.maven.surefire.junit4.JUnit4Provider.executeTestSet(JUnit4Provider.java:153) [surefire-junit4-2.18.1.jar:2.18.1]
	at org.apache.maven.surefire.junit4.JUnit4Provider.invoke(JUnit4Provider.java:128) [surefire-junit4-2.18.1.jar:2.18.1]
	at org.apache.maven.surefire.booter.ForkedBooter.invokeProviderInSameClassLoader(ForkedBooter.java:203) [surefire-booter-2.18.1.jar:2.18.1]
	at org.apache.maven.surefire.booter.ForkedBooter.runSuitesInProcess(ForkedBooter.java:155) [surefire-booter-2.18.1.jar:2.18.1]
	at org.apache.maven.surefire.booter.ForkedBooter.main(ForkedBooter.java:103) [surefire-booter-2.18.1.jar:2.18.1]
2021-02-13 23:44:018 INFO  LogUtil:64 - PWGRACE9 PLCY TP1 USR TU5
2021-02-13 23:44:020 INFO  UserDAO:1790 - deleteResetFlag user [jtsTU5User11] no such attribute:pwdReset
2021-02-13 23:44:020 INFO  LogUtil:64 - org.apache.directory.fortress.core.impl.TestUtils.sleep for len=6000
2021-02-13 23:44:026 INFO  LogUtil:64 - org.apache.directory.fortress.core.impl.TestUtils.sleep for len=1000
2021-02-13 23:44:028 INFO  LogUtil:64 - org.apache.directory.fortress.core.impl.TestUtils.sleep for len=1000
2021-02-13 23:44:029 INFO  LogUtil:64 - org.apache.directory.fortress.core.impl.TestUtils.sleep for len=1000
2021-02-13 23:44:031 INFO  LogUtil:64 - org.apache.directory.fortress.core.impl.TestUtils.sleep for len=1000
2021-02-13 23:44:032 INFO  LogUtil:64 - org.apache.directory.fortress.core.impl.TestUtils.sleep for len=1000
2021-02-13 23:44:034 INFO  LogUtil:64 - org.apache.directory.fortress.core.impl.TestUtils.sleep for len=1000
2021-02-13 23:44:035 INFO  LogUtil:64 - org.apache.directory.fortress.core.impl.TestUtils.sleep for len=1000
2021-02-13 23:44:037 INFO  LogUtil:64 - org.apache.directory.fortress.core.impl.TestUtils.sleep for len=1000
2021-02-13 23:44:038 INFO  LogUtil:64 - org.apache.directory.fortress.core.impl.TestUtils.sleep for len=1000
2021-02-13 23:44:040 INFO  LogUtil:64 - org.apache.directory.fortress.core.impl.TestUtils.sleep for len=1000
2021-02-13 23:44:041 INFO  LogUtil:64 - org.apache.directory.fortress.core.impl.TestUtils.sleep for len=1000
2021-02-13 23:44:042 INFO  LogUtil:64 - PWGRACE10 PLCY TP1 USR TU5
2021-02-13 23:44:042 INFO  AdminRoleUtil:251 - loadGraph initializing ADMIN ROLE context [HOME]
2021-02-13 23:44:045 INFO  UserDAO:1790 - deleteResetFlag user [jtsTU5User12] no such attribute:pwdReset
2021-02-13 23:44:045 INFO  LogUtil:64 - org.apache.directory.fortress.core.impl.TestUtils.sleep for len=5000
2021-02-13 23:44:050 INFO  LogUtil:64 - org.apache.directory.fortress.core.impl.TestUtils.sleep for len=1000
2021-02-13 23:44:052 INFO  LogUtil:64 - org.apache.directory.fortress.core.impl.TestUtils.sleep for len=1000
2021-02-13 23:44:053 INFO  LogUtil:64 - org.apache.directory.fortress.core.impl.TestUtils.sleep for len=1000
2021-02-13 23:44:055 INFO  LogUtil:64 - org.apache.directory.fortress.core.impl.TestUtils.sleep for len=1000
2021-02-13 23:44:056 INFO  LogUtil:64 - org.apache.directory.fortress.core.impl.TestUtils.sleep for len=1000
2021-02-13 23:44:058 INFO  LogUtil:64 - org.apache.directory.fortress.core.impl.TestUtils.sleep for len=1000
2021-02-13 23:44:059 INFO  LogUtil:64 - PWMAXFAILK11 PLCY TP1 USR TU5
2021-02-13 23:45:000 INFO  LogUtil:64 - org.apache.directory.fortress.core.impl.TestUtils.sleep for len=1000
2021-02-13 23:45:002 INFO  LogUtil:64 - org.apache.directory.fortress.core.impl.TestUtils.sleep for len=1000
2021-02-13 23:45:003 INFO  LogUtil:64 - org.apache.directory.fortress.core.impl.TestUtils.sleep for len=1000
2021-02-13 23:45:005 INFO  LogUtil:64 - org.apache.directory.fortress.core.impl.TestUtils.sleep for len=1000
2021-02-13 23:45:006 INFO  LogUtil:64 - org.apache.directory.fortress.core.impl.TestUtils.sleep for len=1000
2021-02-13 23:45:008 INFO  LogUtil:64 - org.apache.directory.fortress.core.impl.TestUtils.sleep for len=1000
2021-02-13 23:45:009 INFO  LogUtil:64 - org.apache.directory.fortress.core.impl.TestUtils.sleep for len=1000
2021-02-13 23:45:011 INFO  LogUtil:64 - org.apache.directory.fortress.core.impl.TestUtils.sleep for len=1000
2021-02-13 23:45:012 INFO  LogUtil:64 - org.apache.directory.fortress.core.impl.TestUtils.sleep for len=1000
2021-02-13 23:45:014 INFO  LogUtil:64 - org.apache.directory.fortress.core.impl.TestUtils.sleep for len=1000
2021-02-13 23:45:016 INFO  LogUtil:64 - PWMAXFAIL12 PLCY TP1 USR TU5
2021-02-13 23:45:017 INFO  LogUtil:64 - org.apache.directory.fortress.core.impl.TestUtils.sleep for len=1000
2021-02-13 23:45:019 INFO  LogUtil:64 - org.apache.directory.fortress.core.impl.TestUtils.sleep for len=1000
2021-02-13 23:45:020 INFO  LogUtil:64 - org.apache.directory.fortress.core.impl.TestUtils.sleep for len=1000
2021-02-13 23:45:022 INFO  LogUtil:64 - org.apache.directory.fortress.core.impl.TestUtils.sleep for len=1000
2021-02-13 23:45:023 INFO  LogUtil:64 - org.apache.directory.fortress.core.impl.TestUtils.sleep for len=1000
2021-02-13 23:45:025 INFO  LogUtil:64 - PWDURATION13 PLCY TP1 USR TU5
2021-02-13 23:45:027 INFO  LogUtil:64 - org.apache.directory.fortress.core.impl.TestUtils.sleep for len=1000
2021-02-13 23:45:028 INFO  LogUtil:64 - org.apache.directory.fortress.core.impl.TestUtils.sleep for len=1000
2021-02-13 23:45:030 INFO  LogUtil:64 - org.apache.directory.fortress.core.impl.TestUtils.sleep for len=1000
2021-02-13 23:45:031 INFO  LogUtil:64 - org.apache.directory.fortress.core.impl.TestUtils.sleep for len=4000
2021-02-13 23:45:035 INFO  LogUtil:64 - org.apache.directory.fortress.core.impl.TestUtils.sleep for len=1000
2021-02-13 23:45:037 INFO  LogUtil:64 - PWDURATION14 PLCY TP1 USR TU5
2021-02-13 23:45:038 INFO  LogUtil:64 - org.apache.directory.fortress.core.impl.TestUtils.sleep for len=1000
2021-02-13 23:45:039 INFO  LogUtil:64 - org.apache.directory.fortress.core.impl.TestUtils.sleep for len=1000
2021-02-13 23:45:041 INFO  LogUtil:64 - org.apache.directory.fortress.core.impl.TestUtils.sleep for len=1000
2021-02-13 23:45:042 INFO  LogUtil:64 - org.apache.directory.fortress.core.impl.TestUtils.sleep for len=1000
2021-02-13 23:45:044 INFO  LogUtil:64 - org.apache.directory.fortress.core.impl.TestUtils.sleep for len=1000
2021-02-13 23:45:045 INFO  LogUtil:64 - org.apache.directory.fortress.core.impl.TestUtils.sleep for len=5000
2021-02-13 23:45:050 INFO  LogUtil:64 - org.apache.directory.fortress.core.impl.TestUtils.sleep for len=1000
2021-02-13 23:45:052 INFO  LogUtil:64 - PWLOCK15 PLCY TP1 USR TU5
2021-02-13 23:45:053 INFO  LogUtil:64 - org.apache.directory.fortress.core.impl.TestUtils.sleep for len=1000
2021-02-13 23:45:055 INFO  LogUtil:64 - org.apache.directory.fortress.core.impl.TestUtils.sleep for len=1000
2021-02-13 23:45:058 INFO  LogUtil:64 - org.apache.directory.fortress.core.impl.TestUtils.sleep for len=1000
2021-02-13 23:45:059 INFO  LogUtil:64 - PWLOCK16 PLCY TP1 USR TU5
2021-02-13 23:46:000 INFO  LogUtil:64 - org.apache.directory.fortress.core.impl.TestUtils.sleep for len=1000
2021-02-13 23:46:002 INFO  LogUtil:64 - org.apache.directory.fortress.core.impl.TestUtils.sleep for len=1000
2021-02-13 23:46:005 INFO  LogUtil:64 - org.apache.directory.fortress.core.impl.TestUtils.sleep for len=1000
2021-02-13 23:46:006 INFO  LogUtil:64 - PWINTERVAL17 PLCY TP1 USR TU5
2021-02-13 23:46:007 INFO  LogUtil:64 - org.apache.directory.fortress.core.impl.TestUtils.sleep for len=1000
2021-02-13 23:46:009 INFO  LogUtil:64 - org.apache.directory.fortress.core.impl.TestUtils.sleep for len=1000
2021-02-13 23:46:010 INFO  LogUtil:64 - org.apache.directory.fortress.core.impl.TestUtils.sleep for len=1000
2021-02-13 23:46:012 INFO  LogUtil:64 - org.apache.directory.fortress.core.impl.TestUtils.sleep for len=1000
2021-02-13 23:46:013 INFO  LogUtil:64 - org.apache.directory.fortress.core.impl.TestUtils.sleep for len=1000
2021-02-13 23:46:014 INFO  LogUtil:64 - org.apache.directory.fortress.core.impl.TestUtils.sleep for len=5000
2021-02-13 23:46:019 INFO  LogUtil:64 - org.apache.directory.fortress.core.impl.TestUtils.sleep for len=1000
2021-02-13 23:46:021 INFO  LogUtil:64 - org.apache.directory.fortress.core.impl.TestUtils.sleep for len=1000
2021-02-13 23:46:022 INFO  LogUtil:64 - org.apache.directory.fortress.core.impl.TestUtils.sleep for len=1000
2021-02-13 23:46:024 INFO  LogUtil:64 - org.apache.directory.fortress.core.impl.TestUtils.sleep for len=1000
2021-02-13 23:46:026 INFO  LogUtil:64 - org.apache.directory.fortress.core.impl.TestUtils.sleep for len=1000
2021-02-13 23:46:027 INFO  LogUtil:64 - org.apache.directory.fortress.core.impl.TestUtils.sleep for len=1000
2021-02-13 23:46:028 INFO  LogUtil:64 - org.apache.directory.fortress.core.impl.TestUtils.sleep for len=5000
2021-02-13 23:46:033 INFO  LogUtil:64 - org.apache.directory.fortress.core.impl.TestUtils.sleep for len=1000
2021-02-13 23:46:035 INFO  LogUtil:64 - PWINTERVAL18 PLCY TP1 USR TU5
2021-02-13 23:46:036 INFO  LogUtil:64 - org.apache.directory.fortress.core.impl.TestUtils.sleep for len=1000
2021-02-13 23:46:037 INFO  LogUtil:64 - org.apache.directory.fortress.core.impl.TestUtils.sleep for len=1000
2021-02-13 23:46:038 INFO  LogUtil:64 - org.apache.directory.fortress.core.impl.TestUtils.sleep for len=7000
2021-02-13 23:46:045 INFO  LogUtil:64 - org.apache.directory.fortress.core.impl.TestUtils.sleep for len=1000
2021-02-13 23:46:047 INFO  LogUtil:64 - org.apache.directory.fortress.core.impl.TestUtils.sleep for len=1000
2021-02-13 23:46:048 INFO  LogUtil:64 - org.apache.directory.fortress.core.impl.TestUtils.sleep for len=1000
2021-02-13 23:46:049 INFO  LogUtil:64 - org.apache.directory.fortress.core.impl.TestUtils.sleep for len=7000
2021-02-13 23:46:056 INFO  LogUtil:64 - org.apache.directory.fortress.core.impl.TestUtils.sleep for len=1000
2021-02-13 23:46:058 INFO  LogUtil:64 - PWMUST19 PLCY TP1 USR TU5
2021-02-13 23:46:059 INFO  LogUtil:64 - org.apache.directory.fortress.core.impl.TestUtils.sleep for len=1000
2021-02-13 23:47:000 INFO  LogUtil:64 - PWMUST20 PLCY TP1 USR TU5
2021-02-13 23:47:002 INFO  LogUtil:64 - org.apache.directory.fortress.core.impl.TestUtils.sleep for len=1000
2021-02-13 23:47:003 INFO  LogUtil:64 - PWALLOW21 PLCY TP1 USR TU5
2021-02-13 23:47:004 INFO  LogUtil:64 - org.apache.directory.fortress.core.impl.TestUtils.sleep for len=1000
2021-02-13 23:47:005 INFO  LogUtil:64 - PWALLOW22 PLCY TP1 USR TU5
2021-02-13 23:47:006 INFO  UserDAO:1790 - deleteResetFlag user [jtsTU5User24] no such attribute:pwdReset
2021-02-13 23:47:006 INFO  LogUtil:64 - PWSAFEW23 PLCY TP1 USR TU5
2021-02-13 23:47:007 INFO  LogUtil:64 - org.apache.directory.fortress.core.impl.TestUtils.sleep for len=1000
2021-02-13 23:47:008 INFO  LogUtil:64 - PWSAFE24 PLCY TP1 USR TU5
2021-02-13 23:47:010 INFO  UserDAO:1790 - deleteResetFlag user [jtsTU5User26] no such attribute:pwdReset
NUMBER OF ADDS: 1146
NUMBER OF BINDS: 1125
NUMBER OF DELETES: 0
NUMBER OF MODS: 4244
NUMBER OF READS: 20168
NUMBER OF SEARCHES: 7090
Tests run: 128, Failures: 1, Errors: 0, Skipped: 0, Time elapsed: 5,161.286 sec <<< FAILURE! - in org.apache.directory.fortress.core.impl.FortressJUnitTest
testExpireWarning(org.apache.directory.fortress.core.impl.PswdPolicyMgrImplTest)  Time elapsed: 5.339 sec  <<< FAILURE!
junit.framework.AssertionFailedError: checkPwPolicies for userId [jtsTU5User9] PASSWORD HAS EXPIRED
	at junit.framework.Assert.fail(Assert.java:57)
	at junit.framework.TestCase.fail(TestCase.java:227)
	at org.apache.directory.fortress.core.impl.PswdPolicyMgrImplTest.expireWarning(PswdPolicyMgrImplTest.java:535)
	at org.apache.directory.fortress.core.impl.PswdPolicyMgrImplTest.testExpireWarning(PswdPolicyMgrImplTest.java:460)


Results :

Failed tests: 
  PswdPolicyMgrImplTest.testExpireWarning:460->expireWarning:535 checkPwPolicies for userId [jtsTU5User9] PASSWORD HAS EXPIRED

Tests run: 128, Failures: 1, Errors: 0, Skipped: 0

[INFO] ------------------------------------------------------------------------
[INFO] BUILD FAILURE
[INFO] ------------------------------------------------------------------------
[INFO] Total time:  01:26 h
[INFO] Finished at: 2021-02-13T23:47:10Z
[INFO] ------------------------------------------------------------------------
[ERROR] Failed to execute goal org.apache.maven.plugins:maven-surefire-plugin:2.18.1:test (default-test) on project fortress-core: There are test failures.
[ERROR] 
[ERROR] Please refer to <https://ci-builds.apache.org/job/Directory/job/dir-fortress-core-docker-apacheds-test/ws/target/surefire-reports> for the individual test results.
[ERROR] -> [Help 1]
[ERROR] 
[ERROR] To see the full stack trace of the errors, re-run Maven with the -e switch.
[ERROR] Re-run Maven using the -X switch to enable full debug logging.
[ERROR] 
[ERROR] For more information about the errors and possible solutions, please read the following articles:
[ERROR] [Help 1] http://cwiki.apache.org/confluence/display/MAVEN/MojoFailureException
Build step 'Execute shell' marked build as failure

Jenkins build is back to normal : Directory » dir-fortress-core-docker-apacheds-test #50

Posted by Apache Jenkins Server <je...@builds.apache.org>.
See <https://ci-builds.apache.org/job/Directory/job/dir-fortress-core-docker-apacheds-test/50/display/redirect>


Build failed in Jenkins: Directory » dir-fortress-core-docker-apacheds-test #49

Posted by Apache Jenkins Server <je...@builds.apache.org>.
See <https://ci-builds.apache.org/job/Directory/job/dir-fortress-core-docker-apacheds-test/49/display/redirect>

Changes:


------------------------------------------
[...truncated 107.78 KB...]
2021-02-20 23:21:008 INFO  UserDAO:1790 - deleteResetFlag user [jtsTU5User6] no such attribute:pwdReset
2021-02-20 23:21:009 INFO  UserDAO:1790 - deleteResetFlag user [jtsTU5User6] no such attribute:pwdReset
2021-02-20 23:21:010 INFO  UserDAO:1790 - deleteResetFlag user [jtsTU5User6] no such attribute:pwdReset
2021-02-20 23:21:011 INFO  UserDAO:1790 - deleteResetFlag user [jtsTU5User6] no such attribute:pwdReset
2021-02-20 23:21:012 INFO  UserDAO:1790 - deleteResetFlag user [jtsTU5User6] no such attribute:pwdReset
2021-02-20 23:21:013 INFO  UserDAO:1790 - deleteResetFlag user [jtsTU5User6] no such attribute:pwdReset
2021-02-20 23:21:015 INFO  UserDAO:1790 - deleteResetFlag user [jtsTU5User6] no such attribute:pwdReset
2021-02-20 23:21:016 INFO  UserDAO:1790 - deleteResetFlag user [jtsTU5User6] no such attribute:pwdReset
2021-02-20 23:21:017 INFO  UserDAO:1790 - deleteResetFlag user [jtsTU5User6] no such attribute:pwdReset
2021-02-20 23:21:018 INFO  UserDAO:1790 - deleteResetFlag user [jtsTU5User6] no such attribute:pwdReset
2021-02-20 23:21:019 INFO  UserDAO:1790 - deleteResetFlag user [jtsTU5User6] no such attribute:pwdReset
2021-02-20 23:21:020 INFO  UserDAO:1790 - deleteResetFlag user [jtsTU5User6] no such attribute:pwdReset
2021-02-20 23:21:022 INFO  UserDAO:1790 - deleteResetFlag user [jtsTU5User6] no such attribute:pwdReset
2021-02-20 23:21:023 INFO  UserDAO:1790 - deleteResetFlag user [jtsTU5User6] no such attribute:pwdReset
2021-02-20 23:21:024 INFO  UserDAO:1790 - deleteResetFlag user [jtsTU5User6] no such attribute:pwdReset
2021-02-20 23:21:025 INFO  UserDAO:1790 - deleteResetFlag user [jtsTU5User6] no such attribute:pwdReset
2021-02-20 23:21:026 INFO  UserDAO:1790 - deleteResetFlag user [jtsTU5User6] no such attribute:pwdReset
2021-02-20 23:21:027 INFO  UserDAO:1790 - deleteResetFlag user [jtsTU5User6] no such attribute:pwdReset
2021-02-20 23:21:028 INFO  UserDAO:1790 - deleteResetFlag user [jtsTU5User6] no such attribute:pwdReset
2021-02-20 23:21:029 INFO  UserDAO:1790 - deleteResetFlag user [jtsTU5User6] no such attribute:pwdReset
2021-02-20 23:21:031 INFO  UserDAO:1790 - deleteResetFlag user [jtsTU5User6] no such attribute:pwdReset
2021-02-20 23:21:032 INFO  UserDAO:1790 - deleteResetFlag user [jtsTU5User6] no such attribute:pwdReset
2021-02-20 23:21:033 INFO  UserDAO:1790 - deleteResetFlag user [jtsTU5User6] no such attribute:pwdReset
2021-02-20 23:21:034 INFO  UserDAO:1790 - deleteResetFlag user [jtsTU5User6] no such attribute:pwdReset
2021-02-20 23:21:035 INFO  UserDAO:1790 - deleteResetFlag user [jtsTU5User6] no such attribute:pwdReset
2021-02-20 23:21:037 INFO  UserDAO:1790 - deleteResetFlag user [jtsTU5User6] no such attribute:pwdReset
2021-02-20 23:21:038 INFO  UserDAO:1790 - deleteResetFlag user [jtsTU5User6] no such attribute:pwdReset
2021-02-20 23:21:039 INFO  UserDAO:1790 - deleteResetFlag user [jtsTU5User6] no such attribute:pwdReset
2021-02-20 23:21:040 INFO  UserDAO:1790 - deleteResetFlag user [jtsTU5User6] no such attribute:pwdReset
2021-02-20 23:21:042 INFO  UserDAO:1790 - deleteResetFlag user [jtsTU5User6] no such attribute:pwdReset
2021-02-20 23:21:043 INFO  UserDAO:1790 - deleteResetFlag user [jtsTU5User6] no such attribute:pwdReset
2021-02-20 23:21:044 INFO  UserDAO:1790 - deleteResetFlag user [jtsTU5User6] no such attribute:pwdReset
2021-02-20 23:21:045 INFO  UserDAO:1790 - deleteResetFlag user [jtsTU5User6] no such attribute:pwdReset
2021-02-20 23:21:046 INFO  UserDAO:1790 - deleteResetFlag user [jtsTU5User6] no such attribute:pwdReset
2021-02-20 23:21:047 INFO  UserDAO:1790 - deleteResetFlag user [jtsTU5User6] no such attribute:pwdReset
2021-02-20 23:21:049 INFO  UserDAO:1790 - deleteResetFlag user [jtsTU5User6] no such attribute:pwdReset
2021-02-20 23:21:051 INFO  UserDAO:1790 - deleteResetFlag user [jtsTU5User6] no such attribute:pwdReset
2021-02-20 23:21:052 INFO  UserDAO:1790 - deleteResetFlag user [jtsTU5User6] no such attribute:pwdReset
2021-02-20 23:21:053 INFO  UserDAO:1790 - deleteResetFlag user [jtsTU5User6] no such attribute:pwdReset
2021-02-20 23:21:054 INFO  UserDAO:1790 - deleteResetFlag user [jtsTU5User6] no such attribute:pwdReset
2021-02-20 23:21:055 INFO  UserDAO:1790 - deleteResetFlag user [jtsTU5User6] no such attribute:pwdReset
2021-02-20 23:21:057 INFO  UserDAO:1790 - deleteResetFlag user [jtsTU5User6] no such attribute:pwdReset
2021-02-20 23:21:058 INFO  UserDAO:1790 - deleteResetFlag user [jtsTU5User6] no such attribute:pwdReset
2021-02-20 23:21:059 INFO  UserDAO:1790 - deleteResetFlag user [jtsTU5User6] no such attribute:pwdReset
2021-02-20 23:22:001 INFO  UserDAO:1790 - deleteResetFlag user [jtsTU5User6] no such attribute:pwdReset
2021-02-20 23:22:001 INFO  LogUtil:64 - PWLEN7 PLCY TP1 USR TU5
2021-02-20 23:22:001 INFO  LogUtil:64 - PWLEN8 PLCY TP1 USR TU5
2021-02-20 23:22:002 INFO  LogUtil:64 - PWEXP7 PLCY TP1 USR TU5
2021-02-20 23:22:004 INFO  UserDAO:1790 - deleteResetFlag user [jtsTU5User9] no such attribute:pwdReset
2021-02-20 23:22:004 INFO  LogUtil:64 - org.apache.directory.fortress.core.impl.TestUtils.sleep for len=2000
2021-02-20 23:22:006 INFO  LogUtil:64 - org.apache.directory.fortress.core.impl.TestUtils.sleep for len=1000
2021-02-20 23:22:007 ERROR PswdPolicyMgrImplTest:532 - expireWarning caught SecurityException rc=1017, msg=checkPwPolicies for userId [jtsTU5User9] PASSWORD HAS EXPIRED
org.apache.directory.fortress.core.PasswordException: checkPwPolicies for userId [jtsTU5User9] PASSWORD HAS EXPIRED
	at org.apache.directory.fortress.core.impl.UserDAO.checkPassword(UserDAO.java:845) ~[classes/:?]
	at org.apache.directory.fortress.core.impl.UserP.authenticate(UserP.java:419) ~[classes/:?]
	at org.apache.directory.fortress.core.impl.UserP.createSession(UserP.java:578) ~[classes/:?]
	at org.apache.directory.fortress.core.impl.UserP.createSession(UserP.java:497) ~[classes/:?]
	at org.apache.directory.fortress.core.impl.AccessMgrImpl.createSession(AccessMgrImpl.java:115) ~[classes/:?]
	at org.apache.directory.fortress.core.impl.PswdPolicyMgrImplTest.expireWarning(PswdPolicyMgrImplTest.java:513) [test-classes/:?]
	at org.apache.directory.fortress.core.impl.PswdPolicyMgrImplTest.testExpireWarning(PswdPolicyMgrImplTest.java:460) [test-classes/:?]
	at sun.reflect.NativeMethodAccessorImpl.invoke0(Native Method) ~[?:1.8.0_241]
	at sun.reflect.NativeMethodAccessorImpl.invoke(NativeMethodAccessorImpl.java:62) ~[?:1.8.0_241]
	at sun.reflect.DelegatingMethodAccessorImpl.invoke(DelegatingMethodAccessorImpl.java:43) ~[?:1.8.0_241]
	at java.lang.reflect.Method.invoke(Method.java:498) ~[?:1.8.0_241]
	at junit.framework.TestCase.runTest(TestCase.java:176) [junit-4.12.jar:4.12]
	at junit.framework.TestCase.runBare(TestCase.java:141) [junit-4.12.jar:4.12]
	at junit.framework.TestResult$1.protect(TestResult.java:122) [junit-4.12.jar:4.12]
	at junit.framework.TestResult.runProtected(TestResult.java:142) [junit-4.12.jar:4.12]
	at junit.framework.TestResult.run(TestResult.java:125) [junit-4.12.jar:4.12]
	at junit.framework.TestCase.run(TestCase.java:129) [junit-4.12.jar:4.12]
	at junit.framework.TestSuite.runTest(TestSuite.java:252) [junit-4.12.jar:4.12]
	at junit.framework.TestSuite.run(TestSuite.java:247) [junit-4.12.jar:4.12]
	at org.junit.internal.runners.JUnit38ClassRunner.run(JUnit38ClassRunner.java:86) [junit-4.12.jar:4.12]
	at org.apache.maven.surefire.junit4.JUnit4Provider.execute(JUnit4Provider.java:283) [surefire-junit4-2.18.1.jar:2.18.1]
	at org.apache.maven.surefire.junit4.JUnit4Provider.executeWithRerun(JUnit4Provider.java:173) [surefire-junit4-2.18.1.jar:2.18.1]
	at org.apache.maven.surefire.junit4.JUnit4Provider.executeTestSet(JUnit4Provider.java:153) [surefire-junit4-2.18.1.jar:2.18.1]
	at org.apache.maven.surefire.junit4.JUnit4Provider.invoke(JUnit4Provider.java:128) [surefire-junit4-2.18.1.jar:2.18.1]
	at org.apache.maven.surefire.booter.ForkedBooter.invokeProviderInSameClassLoader(ForkedBooter.java:203) [surefire-booter-2.18.1.jar:2.18.1]
	at org.apache.maven.surefire.booter.ForkedBooter.runSuitesInProcess(ForkedBooter.java:155) [surefire-booter-2.18.1.jar:2.18.1]
	at org.apache.maven.surefire.booter.ForkedBooter.main(ForkedBooter.java:103) [surefire-booter-2.18.1.jar:2.18.1]
2021-02-20 23:22:007 INFO  LogUtil:64 - PWGRACE9 PLCY TP1 USR TU5
2021-02-20 23:22:010 INFO  UserDAO:1790 - deleteResetFlag user [jtsTU5User11] no such attribute:pwdReset
2021-02-20 23:22:010 INFO  LogUtil:64 - org.apache.directory.fortress.core.impl.TestUtils.sleep for len=6000
2021-02-20 23:22:016 INFO  LogUtil:64 - org.apache.directory.fortress.core.impl.TestUtils.sleep for len=1000
2021-02-20 23:22:018 INFO  LogUtil:64 - org.apache.directory.fortress.core.impl.TestUtils.sleep for len=1000
2021-02-20 23:22:019 INFO  LogUtil:64 - org.apache.directory.fortress.core.impl.TestUtils.sleep for len=1000
2021-02-20 23:22:020 INFO  LogUtil:64 - org.apache.directory.fortress.core.impl.TestUtils.sleep for len=1000
2021-02-20 23:22:022 INFO  LogUtil:64 - org.apache.directory.fortress.core.impl.TestUtils.sleep for len=1000
2021-02-20 23:22:023 INFO  LogUtil:64 - org.apache.directory.fortress.core.impl.TestUtils.sleep for len=1000
2021-02-20 23:22:025 INFO  LogUtil:64 - org.apache.directory.fortress.core.impl.TestUtils.sleep for len=1000
2021-02-20 23:22:026 INFO  LogUtil:64 - org.apache.directory.fortress.core.impl.TestUtils.sleep for len=1000
2021-02-20 23:22:028 INFO  LogUtil:64 - org.apache.directory.fortress.core.impl.TestUtils.sleep for len=1000
2021-02-20 23:22:029 INFO  LogUtil:64 - org.apache.directory.fortress.core.impl.TestUtils.sleep for len=1000
2021-02-20 23:22:031 INFO  LogUtil:64 - org.apache.directory.fortress.core.impl.TestUtils.sleep for len=1000
2021-02-20 23:22:032 INFO  LogUtil:64 - PWGRACE10 PLCY TP1 USR TU5
2021-02-20 23:22:034 INFO  UserDAO:1790 - deleteResetFlag user [jtsTU5User12] no such attribute:pwdReset
2021-02-20 23:22:034 INFO  LogUtil:64 - org.apache.directory.fortress.core.impl.TestUtils.sleep for len=5000
2021-02-20 23:22:039 INFO  LogUtil:64 - org.apache.directory.fortress.core.impl.TestUtils.sleep for len=1000
2021-02-20 23:22:041 INFO  LogUtil:64 - org.apache.directory.fortress.core.impl.TestUtils.sleep for len=1000
2021-02-20 23:22:042 INFO  LogUtil:64 - org.apache.directory.fortress.core.impl.TestUtils.sleep for len=1000
2021-02-20 23:22:044 INFO  LogUtil:64 - org.apache.directory.fortress.core.impl.TestUtils.sleep for len=1000
2021-02-20 23:22:045 INFO  LogUtil:64 - org.apache.directory.fortress.core.impl.TestUtils.sleep for len=1000
2021-02-20 23:22:047 INFO  LogUtil:64 - org.apache.directory.fortress.core.impl.TestUtils.sleep for len=1000
2021-02-20 23:22:048 INFO  LogUtil:64 - PWMAXFAILK11 PLCY TP1 USR TU5
2021-02-20 23:22:049 INFO  LogUtil:64 - org.apache.directory.fortress.core.impl.TestUtils.sleep for len=1000
2021-02-20 23:22:050 INFO  LogUtil:64 - org.apache.directory.fortress.core.impl.TestUtils.sleep for len=1000
2021-02-20 23:22:052 INFO  LogUtil:64 - org.apache.directory.fortress.core.impl.TestUtils.sleep for len=1000
2021-02-20 23:22:053 INFO  LogUtil:64 - org.apache.directory.fortress.core.impl.TestUtils.sleep for len=1000
2021-02-20 23:22:055 INFO  LogUtil:64 - org.apache.directory.fortress.core.impl.TestUtils.sleep for len=1000
2021-02-20 23:22:056 INFO  LogUtil:64 - org.apache.directory.fortress.core.impl.TestUtils.sleep for len=1000
2021-02-20 23:22:058 INFO  LogUtil:64 - org.apache.directory.fortress.core.impl.TestUtils.sleep for len=1000
2021-02-20 23:23:000 INFO  LogUtil:64 - org.apache.directory.fortress.core.impl.TestUtils.sleep for len=1000
2021-02-20 23:23:002 INFO  LogUtil:64 - org.apache.directory.fortress.core.impl.TestUtils.sleep for len=1000
2021-02-20 23:23:003 INFO  LogUtil:64 - org.apache.directory.fortress.core.impl.TestUtils.sleep for len=1000
2021-02-20 23:23:005 INFO  LogUtil:64 - PWMAXFAIL12 PLCY TP1 USR TU5
2021-02-20 23:23:006 INFO  LogUtil:64 - org.apache.directory.fortress.core.impl.TestUtils.sleep for len=1000
2021-02-20 23:23:008 INFO  LogUtil:64 - org.apache.directory.fortress.core.impl.TestUtils.sleep for len=1000
2021-02-20 23:23:009 INFO  LogUtil:64 - org.apache.directory.fortress.core.impl.TestUtils.sleep for len=1000
2021-02-20 23:23:011 INFO  LogUtil:64 - org.apache.directory.fortress.core.impl.TestUtils.sleep for len=1000
2021-02-20 23:23:012 INFO  LogUtil:64 - org.apache.directory.fortress.core.impl.TestUtils.sleep for len=1000
2021-02-20 23:23:015 INFO  LogUtil:64 - PWDURATION13 PLCY TP1 USR TU5
2021-02-20 23:23:016 INFO  LogUtil:64 - org.apache.directory.fortress.core.impl.TestUtils.sleep for len=1000
2021-02-20 23:23:017 INFO  LogUtil:64 - org.apache.directory.fortress.core.impl.TestUtils.sleep for len=1000
2021-02-20 23:23:019 INFO  LogUtil:64 - org.apache.directory.fortress.core.impl.TestUtils.sleep for len=1000
2021-02-20 23:23:020 INFO  LogUtil:64 - org.apache.directory.fortress.core.impl.TestUtils.sleep for len=4000
2021-02-20 23:23:024 INFO  LogUtil:64 - org.apache.directory.fortress.core.impl.TestUtils.sleep for len=1000
2021-02-20 23:23:027 INFO  LogUtil:64 - PWDURATION14 PLCY TP1 USR TU5
2021-02-20 23:23:028 INFO  LogUtil:64 - org.apache.directory.fortress.core.impl.TestUtils.sleep for len=1000
2021-02-20 23:23:029 INFO  LogUtil:64 - org.apache.directory.fortress.core.impl.TestUtils.sleep for len=1000
2021-02-20 23:23:031 INFO  LogUtil:64 - org.apache.directory.fortress.core.impl.TestUtils.sleep for len=1000
2021-02-20 23:23:032 INFO  LogUtil:64 - org.apache.directory.fortress.core.impl.TestUtils.sleep for len=1000
2021-02-20 23:23:034 INFO  LogUtil:64 - org.apache.directory.fortress.core.impl.TestUtils.sleep for len=1000
2021-02-20 23:23:035 INFO  LogUtil:64 - org.apache.directory.fortress.core.impl.TestUtils.sleep for len=5000
2021-02-20 23:23:040 INFO  LogUtil:64 - org.apache.directory.fortress.core.impl.TestUtils.sleep for len=1000
2021-02-20 23:23:041 INFO  LogUtil:64 - PWLOCK15 PLCY TP1 USR TU5
2021-02-20 23:23:042 INFO  LogUtil:64 - org.apache.directory.fortress.core.impl.TestUtils.sleep for len=1000
2021-02-20 23:23:044 INFO  LogUtil:64 - org.apache.directory.fortress.core.impl.TestUtils.sleep for len=1000
2021-02-20 23:23:046 INFO  LogUtil:64 - org.apache.directory.fortress.core.impl.TestUtils.sleep for len=1000
2021-02-20 23:23:048 INFO  LogUtil:64 - PWLOCK16 PLCY TP1 USR TU5
2021-02-20 23:23:049 INFO  LogUtil:64 - org.apache.directory.fortress.core.impl.TestUtils.sleep for len=1000
2021-02-20 23:23:051 INFO  LogUtil:64 - org.apache.directory.fortress.core.impl.TestUtils.sleep for len=1000
2021-02-20 23:23:053 INFO  LogUtil:64 - org.apache.directory.fortress.core.impl.TestUtils.sleep for len=1000
2021-02-20 23:23:054 INFO  LogUtil:64 - PWINTERVAL17 PLCY TP1 USR TU5
2021-02-20 23:23:056 INFO  LogUtil:64 - org.apache.directory.fortress.core.impl.TestUtils.sleep for len=1000
2021-02-20 23:23:057 INFO  LogUtil:64 - org.apache.directory.fortress.core.impl.TestUtils.sleep for len=1000
2021-02-20 23:23:058 INFO  LogUtil:64 - org.apache.directory.fortress.core.impl.TestUtils.sleep for len=1000
2021-02-20 23:24:000 INFO  LogUtil:64 - org.apache.directory.fortress.core.impl.TestUtils.sleep for len=1000
2021-02-20 23:24:002 INFO  LogUtil:64 - org.apache.directory.fortress.core.impl.TestUtils.sleep for len=1000
2021-02-20 23:24:003 INFO  LogUtil:64 - org.apache.directory.fortress.core.impl.TestUtils.sleep for len=5000
2021-02-20 23:24:008 INFO  LogUtil:64 - org.apache.directory.fortress.core.impl.TestUtils.sleep for len=1000
2021-02-20 23:24:009 INFO  LogUtil:64 - org.apache.directory.fortress.core.impl.TestUtils.sleep for len=1000
2021-02-20 23:24:010 INFO  LogUtil:64 - org.apache.directory.fortress.core.impl.TestUtils.sleep for len=1000
2021-02-20 23:24:012 INFO  LogUtil:64 - org.apache.directory.fortress.core.impl.TestUtils.sleep for len=1000
2021-02-20 23:24:013 INFO  LogUtil:64 - org.apache.directory.fortress.core.impl.TestUtils.sleep for len=1000
2021-02-20 23:24:015 INFO  LogUtil:64 - org.apache.directory.fortress.core.impl.TestUtils.sleep for len=1000
2021-02-20 23:24:016 INFO  LogUtil:64 - org.apache.directory.fortress.core.impl.TestUtils.sleep for len=5000
2021-02-20 23:24:021 INFO  LogUtil:64 - org.apache.directory.fortress.core.impl.TestUtils.sleep for len=1000
2021-02-20 23:24:022 INFO  LogUtil:64 - PWINTERVAL18 PLCY TP1 USR TU5
2021-02-20 23:24:023 INFO  LogUtil:64 - org.apache.directory.fortress.core.impl.TestUtils.sleep for len=1000
2021-02-20 23:24:025 INFO  LogUtil:64 - org.apache.directory.fortress.core.impl.TestUtils.sleep for len=1000
2021-02-20 23:24:026 INFO  LogUtil:64 - org.apache.directory.fortress.core.impl.TestUtils.sleep for len=7000
2021-02-20 23:24:033 INFO  LogUtil:64 - org.apache.directory.fortress.core.impl.TestUtils.sleep for len=1000
2021-02-20 23:24:034 INFO  LogUtil:64 - org.apache.directory.fortress.core.impl.TestUtils.sleep for len=1000
2021-02-20 23:24:036 INFO  LogUtil:64 - org.apache.directory.fortress.core.impl.TestUtils.sleep for len=1000
2021-02-20 23:24:037 INFO  LogUtil:64 - org.apache.directory.fortress.core.impl.TestUtils.sleep for len=7000
2021-02-20 23:24:044 INFO  LogUtil:64 - org.apache.directory.fortress.core.impl.TestUtils.sleep for len=1000
2021-02-20 23:24:045 INFO  LogUtil:64 - PWMUST19 PLCY TP1 USR TU5
2021-02-20 23:24:047 INFO  LogUtil:64 - org.apache.directory.fortress.core.impl.TestUtils.sleep for len=1000
2021-02-20 23:24:048 INFO  LogUtil:64 - PWMUST20 PLCY TP1 USR TU5
2021-02-20 23:24:049 INFO  LogUtil:64 - org.apache.directory.fortress.core.impl.TestUtils.sleep for len=1000
2021-02-20 23:24:050 INFO  LogUtil:64 - PWALLOW21 PLCY TP1 USR TU5
2021-02-20 23:24:051 INFO  LogUtil:64 - org.apache.directory.fortress.core.impl.TestUtils.sleep for len=1000
2021-02-20 23:24:052 INFO  LogUtil:64 - PWALLOW22 PLCY TP1 USR TU5
2021-02-20 23:24:053 INFO  UserDAO:1790 - deleteResetFlag user [jtsTU5User24] no such attribute:pwdReset
2021-02-20 23:24:053 INFO  LogUtil:64 - PWSAFEW23 PLCY TP1 USR TU5
2021-02-20 23:24:054 INFO  LogUtil:64 - org.apache.directory.fortress.core.impl.TestUtils.sleep for len=1000
2021-02-20 23:24:055 INFO  LogUtil:64 - PWSAFE24 PLCY TP1 USR TU5
2021-02-20 23:24:057 INFO  UserDAO:1790 - deleteResetFlag user [jtsTU5User26] no such attribute:pwdReset
NUMBER OF ADDS: 1146
NUMBER OF BINDS: 1125
NUMBER OF DELETES: 0
NUMBER OF MODS: 4244
NUMBER OF READS: 20168
NUMBER OF SEARCHES: 7080
Tests run: 128, Failures: 1, Errors: 0, Skipped: 0, Time elapsed: 3,507.624 sec <<< FAILURE! - in org.apache.directory.fortress.core.impl.FortressJUnitTest
testExpireWarning(org.apache.directory.fortress.core.impl.PswdPolicyMgrImplTest)  Time elapsed: 5.394 sec  <<< FAILURE!
junit.framework.AssertionFailedError: checkPwPolicies for userId [jtsTU5User9] PASSWORD HAS EXPIRED
	at junit.framework.Assert.fail(Assert.java:57)
	at junit.framework.TestCase.fail(TestCase.java:227)
	at org.apache.directory.fortress.core.impl.PswdPolicyMgrImplTest.expireWarning(PswdPolicyMgrImplTest.java:535)
	at org.apache.directory.fortress.core.impl.PswdPolicyMgrImplTest.testExpireWarning(PswdPolicyMgrImplTest.java:460)


Results :

Failed tests: 
  PswdPolicyMgrImplTest.testExpireWarning:460->expireWarning:535 checkPwPolicies for userId [jtsTU5User9] PASSWORD HAS EXPIRED

Tests run: 128, Failures: 1, Errors: 0, Skipped: 0

[INFO] ------------------------------------------------------------------------
[INFO] BUILD FAILURE
[INFO] ------------------------------------------------------------------------
[INFO] Total time:  58:34 min
[INFO] Finished at: 2021-02-20T23:24:57Z
[INFO] ------------------------------------------------------------------------
[ERROR] Failed to execute goal org.apache.maven.plugins:maven-surefire-plugin:2.18.1:test (default-test) on project fortress-core: There are test failures.
[ERROR] 
[ERROR] Please refer to <https://ci-builds.apache.org/job/Directory/job/dir-fortress-core-docker-apacheds-test/ws/target/surefire-reports> for the individual test results.
[ERROR] -> [Help 1]
[ERROR] 
[ERROR] To see the full stack trace of the errors, re-run Maven with the -e switch.
[ERROR] Re-run Maven using the -X switch to enable full debug logging.
[ERROR] 
[ERROR] For more information about the errors and possible solutions, please read the following articles:
[ERROR] [Help 1] http://cwiki.apache.org/confluence/display/MAVEN/MojoFailureException
Build step 'Execute shell' marked build as failure
FATAL: Remote call on H42 failed
Also:   hudson.remoting.Channel$CallSiteStackTrace: Remote call to H42
		at hudson.remoting.Channel.attachCallSiteStackTrace(Channel.java:1788)
		at hudson.remoting.UserRequest$ExceptionResponse.retrieve(UserRequest.java:356)
		at hudson.remoting.Channel.call(Channel.java:998)
		at hudson.Launcher$RemoteLauncher.kill(Launcher.java:1083)
		at hudson.model.AbstractBuild$AbstractBuildExecution.run(AbstractBuild.java:510)
		at hudson.model.Run.execute(Run.java:1880)
		at hudson.model.FreeStyleBuild.run(FreeStyleBuild.java:43)
		at hudson.model.ResourceController.execute(ResourceController.java:97)
		at hudson.model.Executor.run(Executor.java:428)
java.lang.NoClassDefFoundError: Could not initialize class jenkins.model.Jenkins
	at jenkins.agents.AgentComputerUtil.getChannelToMaster(AgentComputerUtil.java:48)
	at hudson.util.ProcessTree.get(ProcessTree.java:432)
	at hudson.Launcher$RemoteLauncher$KillTask.call(Launcher.java:1100)
	at hudson.Launcher$RemoteLauncher$KillTask.call(Launcher.java:1091)
	at hudson.remoting.UserRequest.perform(UserRequest.java:211)
	at hudson.remoting.UserRequest.perform(UserRequest.java:54)
	at hudson.remoting.Request$2.run(Request.java:369)
	at hudson.remoting.InterceptingExecutorService$1.call(InterceptingExecutorService.java:72)
	at java.util.concurrent.FutureTask.run(FutureTask.java:266)
	at java.util.concurrent.ThreadPoolExecutor.runWorker(ThreadPoolExecutor.java:1149)
	at java.util.concurrent.ThreadPoolExecutor$Worker.run(ThreadPoolExecutor.java:624)
	at java.lang.Thread.run(Thread.java:748)
Caused: java.io.IOException: Remote call on H42 failed
	at hudson.remoting.Channel.call(Channel.java:1004)
	at hudson.Launcher$RemoteLauncher.kill(Launcher.java:1083)
	at hudson.model.AbstractBuild$AbstractBuildExecution.run(AbstractBuild.java:510)
	at hudson.model.Run.execute(Run.java:1880)
	at hudson.model.FreeStyleBuild.run(FreeStyleBuild.java:43)
	at hudson.model.ResourceController.execute(ResourceController.java:97)
	at hudson.model.Executor.run(Executor.java:428)