You are viewing a plain text version of this content. The canonical link for it is here.
Posted to builds@beam.apache.org by Apache Jenkins Server <je...@builds.apache.org> on 2019/02/22 06:30:20 UTC

Build failed in Jenkins: beam_PreCommit_Java_Cron #979

See <https://builds.apache.org/job/beam_PreCommit_Java_Cron/979/display/redirect?page=changes>

Changes:

[drieber] Parameterize StreamingDataflowWorkerTest so we run all tests

[github] Merge pull request #7635: [BEAM-4076] Generalize schema inputs to ParDo

------------------------------------------
[...truncated 683.78 KB...]
> Task :beam-sdks-java-maven-archetypes-starter:compileTestJava NO-SOURCE
> Task :beam-sdks-java-maven-archetypes-starter:testClasses
> Task :beam-sdks-java-maven-archetypes-starter:packageTests
> Task :beam-sdks-java-maven-archetypes-starter:assemble
> Task :beam-sdks-java-maven-archetypes-starter:analyzeClassesDependencies SKIPPED
> Task :beam-sdks-java-maven-archetypes-starter:analyzeTestClassesDependencies SKIPPED
> Task :beam-sdks-java-maven-archetypes-starter:analyzeDependencies SKIPPED
> Task :beam-sdks-java-maven-archetypes-starter:checkstyleMain NO-SOURCE
> Task :beam-sdks-java-maven-archetypes-starter:checkstyleTest NO-SOURCE
> Task :beam-sdks-java-maven-archetypes-starter:findbugsMain NO-SOURCE
> Task :beam-sdks-java-maven-archetypes-starter:javadoc NO-SOURCE
> Task :beam-sdks-java-maven-archetypes-starter:test NO-SOURCE
> Task :beam-sdks-java-maven-archetypes-starter:shadowJar
> Task :beam-sdks-java-maven-archetypes-starter:validateShadedJarDoesntLeakNonProjectClasses
> Task :beam-sdks-java-maven-archetypes-starter:check
> Task :beam-sdks-java-maven-archetypes-starter:build
> Task :beam-sdks-java-maven-archetypes-starter:buildDependents
> Task :beam-sdks-java-test-utils:packageTests
> Task :beam-sdks-java-test-utils:assemble
> Task :beam-sdks-java-test-utils:analyzeTestClassesDependencies SKIPPED
> Task :beam-sdks-java-test-utils:analyzeDependencies SKIPPED
> Task :beam-sdks-java-test-utils:checkstyleTest
> Task :beam-sdks-java-io-redis:test
> Task :beam-sdks-java-io-rabbitmq:test
> Task :beam-sdks-java-io-tika:compileTestJava
> Task :beam-sdks-java-io-tika:testClasses
> Task :beam-sdks-java-io-tika:packageTests
> Task :beam-sdks-java-io-tika:assemble
> Task :beam-sdks-java-io-tika:analyzeTestClassesDependencies SKIPPED
> Task :beam-sdks-java-io-tika:analyzeDependencies SKIPPED
> Task :beam-sdks-java-io-tika:checkstyleTest
> Task :beam-sdks-java-io-solr:test
> Task :beam-sdks-java-io-xml:test
> Task :beam-sdks-java-io-synthetic:findbugsMain
> Task :beam-sdks-java-test-utils:test
> Task :beam-sdks-java-test-utils:check
> Task :beam-sdks-java-test-utils:build
> Task :beam-runners-java-fn-execution:testClasses
> Task :beam-runners-java-fn-execution:packageTests
> Task :beam-runners-java-fn-execution:assemble
> Task :beam-runners-java-fn-execution:analyzeClassesDependencies SKIPPED
> Task :beam-runners-java-fn-execution:analyzeTestClassesDependencies SKIPPED
> Task :beam-runners-java-fn-execution:analyzeDependencies SKIPPED
> Task :beam-runners-java-fn-execution:checkstyleMain
> Task :beam-sdks-java-io-synthetic:javadoc
> Task :beam-runners-java-fn-execution:checkstyleTest
> Task :beam-sdks-java-io-tika:test
> Task :beam-sdks-java-io-tika:check
> Task :beam-sdks-java-io-tika:build
> Task :beam-sdks-java-io-tika:buildDependents
> Task :beam-runners-reference-java:testClasses
> Task :beam-runners-reference-java:packageTests
> Task :beam-runners-reference-java:assemble
> Task :beam-runners-reference-java:analyzeClassesDependencies SKIPPED
> Task :beam-runners-reference-java:analyzeTestClassesDependencies SKIPPED
> Task :beam-runners-reference-java:analyzeDependencies SKIPPED
> Task :beam-sdks-java-io-kinesis:check
> Task :beam-sdks-java-io-kinesis:build
> Task :beam-sdks-java-io-kinesis:buildDependents
> Task :beam-runners-samza:classes
> Task :beam-runners-samza:jar
> Task :beam-runners-reference-java:checkstyleMain
> Task :beam-runners-reference-java:checkstyleTest
> Task :beam-sdks-java-io-rabbitmq:check
> Task :beam-sdks-java-io-rabbitmq:build
> Task :beam-sdks-java-io-rabbitmq:buildDependents
> Task :beam-sdks-java-harness:packageTests
> Task :beam-sdks-java-harness:assemble
> Task :beam-sdks-java-harness:analyzeClassesDependencies SKIPPED
> Task :beam-sdks-java-harness:analyzeTestClassesDependencies SKIPPED
> Task :beam-sdks-java-harness:analyzeDependencies SKIPPED
> Task :beam-sdks-java-io-xml:check
> Task :beam-sdks-java-io-xml:build
> Task :beam-sdks-java-io-xml:buildDependents
> Task :beam-sdks-java-io-elasticsearch:buildDependents
> Task :beam-sdks-java-harness:checkstyleMain
> Task :beam-sdks-java-io-synthetic:test
> Task :beam-runners-java-fn-execution:findbugsMain
> Task :beam-sdks-java-harness:checkstyleTest
> Task :beam-sdks-java-io-synthetic:validateShadedJarDoesntLeakNonProjectClasses
> Task :beam-sdks-java-io-synthetic:check
> Task :beam-sdks-java-io-synthetic:build
> Task :beam-sdks-java-io-synthetic:buildDependents
> Task :beam-runners-samza:compileTestJava
> Task :beam-runners-samza:testClasses
> Task :beam-runners-samza:packageTests
> Task :beam-runners-samza:assemble
> Task :beam-runners-samza:analyzeClassesDependencies SKIPPED
> Task :beam-runners-samza:analyzeTestClassesDependencies SKIPPED
> Task :beam-runners-samza:analyzeDependencies SKIPPED
> Task :beam-sdks-java-io-solr:check
> Task :beam-sdks-java-io-solr:build
> Task :beam-sdks-java-io-solr:buildDependents
> Task :beam-runners-samza:checkstyleMain
> Task :beam-runners-samza:checkstyleTest
> Task :beam-runners-reference-java:findbugsMain
> Task :beam-runners-reference-java:javadoc
> Task :beam-sdks-java-extensions-sql-jdbc:shadowJarTest
> Task :beam-runners-java-fn-execution:javadoc
> Task :beam-sdks-java-harness:findbugsMain
> Task :beam-runners-reference-java:test
> Task :beam-runners-reference-java:shadowJar
> Task :beam-runners-reference-java:validateShadedJarDoesntLeakNonProjectClasses
> Task :beam-runners-reference-java:check
> Task :beam-runners-reference-java:build
> Task :beam-runners-reference-java:buildDependents
> Task :beam-sdks-java-harness:javadoc
> Task :beam-runners-samza:findbugsMain
> Task :beam-sdks-java-extensions-sql-jdbc:preCommit
> Task :beam-runners-samza:javadoc
> Task :beam-runners-java-fn-execution:test
> Task :beam-runners-java-fn-execution:validateShadedJarDoesntLeakNonProjectClasses
> Task :beam-runners-java-fn-execution:check
> Task :beam-runners-java-fn-execution:build
> Task :beam-sdks-java-harness:test
> Task :beam-sdks-java-harness:check
> Task :beam-sdks-java-harness:build
> Task :beam-runners-direct-java:jar
> Task :beam-runners-direct-java:packageTests
> Task :beam-runners-direct-java:assemble
> Task :beam-runners-direct-java:analyzeClassesDependencies SKIPPED
> Task :beam-runners-direct-java:analyzeTestClassesDependencies SKIPPED
> Task :beam-runners-direct-java:analyzeDependencies SKIPPED
> Task :beam-runners-direct-java:checkstyleMain
> Task :beam-sdks-java-io-redis:check
> Task :beam-sdks-java-io-redis:build
> Task :beam-sdks-java-io-redis:buildDependents
> Task :beam-runners-direct-java:checkstyleTest
> Task :beam-sdks-java-extensions-kryo:compileTestJava
> Task :beam-sdks-java-extensions-kryo:testClasses
> Task :beam-sdks-java-extensions-kryo:packageTests
> Task :beam-sdks-java-extensions-kryo:assemble
> Task :beam-sdks-java-extensions-kryo:analyzeTestClassesDependencies SKIPPED
> Task :beam-sdks-java-extensions-kryo:analyzeDependencies SKIPPED
> Task :beam-runners-samza:test
> Task :beam-sdks-java-extensions-kryo:checkstyleTest
> Task :beam-sdks-java-io-hbase:check
> Task :beam-sdks-java-io-hbase:build
> Task :beam-sdks-java-io-hbase:buildDependents
> Task :beam-sdks-java-io-hadoop-common:buildDependents
> Task :beam-runners-samza:shadowJar
> Task :beam-runners-samza:validateShadedJarDoesntLeakNonProjectClasses
> Task :beam-runners-samza:check
> Task :beam-runners-samza:build
> Task :beam-runners-samza:buildDependents
> Task :beam-sdks-java-extensions-kryo:test
> Task :beam-sdks-java-extensions-kryo:check
> Task :beam-sdks-java-extensions-kryo:build
> Task :beam-sdks-java-extensions-euphoria:compileTestJava
> Task :beam-sdks-java-extensions-euphoria:testClasses
> Task :beam-sdks-java-extensions-euphoria:packageTests
> Task :beam-sdks-java-extensions-euphoria:assemble
> Task :beam-sdks-java-extensions-euphoria:analyzeTestClassesDependencies SKIPPED
> Task :beam-sdks-java-extensions-euphoria:analyzeDependencies SKIPPED
> Task :beam-sdks-java-extensions-euphoria:checkstyleTest
> Task :beam-runners-direct-java:findbugsMain
> Task :beam-runners-direct-java:javadoc
> Task :beam-sdks-java-javadoc:allJavadoc
> Task :beam-sdks-java-extensions-sql:validateShadedJarDoesntLeakNonProjectClasses
> Task :beam-sdks-java-extensions-sql:check
> Task :beam-sdks-java-extensions-sql:build
> Task :beam-sdks-java-extensions-euphoria:test
> Task :beam-sdks-java-extensions-euphoria:check
> Task :beam-sdks-java-extensions-euphoria:build
> Task :beam-sdks-java-extensions-euphoria:buildDependents
> Task :beam-sdks-java-extensions-kryo:buildDependents
> Task :beam-runners-direct-java:test
> Task :beam-runners-direct-java:validateShadedJarDoesntLeakNonProjectClasses
> Task :beam-runners-direct-java:check
> Task :beam-runners-direct-java:build
> Task :beam-sdks-java-nexmark:shadowJar
> Task :beam-sdks-java-nexmark:validateShadedJarDoesntLeakNonProjectClasses
> Task :beam-sdks-java-nexmark:check
> Task :beam-sdks-java-nexmark:build
> Task :beam-sdks-java-nexmark:buildDependents
> Task :beam-sdks-java-extensions-sql:buildDependents
> Task :beam-sdks-java-test-utils:buildDependents
> Task :beam-sdks-java-io-kafka:buildDependents
> Task :beam-sdks-java-extensions-join-library:buildDependents

FAILURE: Build completed with 5 failures.

1: Task failed with an exception.
-----------
* What went wrong:
Execution failed for task ':beam-runners-google-cloud-dataflow-java:checkstyleMain'.
> Checkstyle rule violations were found. See the report at: file://<https://builds.apache.org/job/beam_PreCommit_Java_Cron/ws/src/runners/google-cloud-dataflow-java/build/reports/checkstyle/main.html>
  Checkstyle files with violations: 1
  Checkstyle violations by severity: [error:1]


* Try:
Run with --stacktrace option to get the stack trace. Run with --info or --debug option to get more log output. Run with --scan to get full insights.
==============================================================================

2: Task failed with an exception.
-----------
* What went wrong:
Execution failed for task ':beam-runners-flink-1.6:compileTestJava'.
> Compilation failed with exit code 1; see the compiler error output for details.

* Try:
Run with --stacktrace option to get the stack trace. Run with --info or --debug option to get more log output. Run with --scan to get full insights.
==============================================================================

3: Task failed with an exception.
-----------
* What went wrong:
Execution failed for task ':beam-runners-flink_2.11:compileTestJava'.
> Compilation failed with exit code 1; see the compiler error output for details.

* Try:
Run with --stacktrace option to get the stack trace. Run with --info or --debug option to get more log output. Run with --scan to get full insights.
==============================================================================

4: Task failed with an exception.
-----------
* What went wrong:
Execution failed for task ':beam-runners-flink-1.7:compileTestJava'.
> Compilation failed with exit code 1; see the compiler error output for details.

* Try:
Run with --stacktrace option to get the stack trace. Run with --info or --debug option to get more log output. Run with --scan to get full insights.
==============================================================================

5: Task failed with an exception.
-----------
* What went wrong:
Execution failed for task ':beam-sdks-java-io-kudu:test'.
> There were failing tests. See the report at: file://<https://builds.apache.org/job/beam_PreCommit_Java_Cron/ws/src/sdks/java/io/kudu/build/reports/tests/test/index.html>

* Try:
Run with --stacktrace option to get the stack trace. Run with --info or --debug option to get more log output. Run with --scan to get full insights.
==============================================================================

* Get more help at https://help.gradle.org

Deprecated Gradle features were used in this build, making it incompatible with Gradle 6.0.
Use '--warning-mode all' to show the individual deprecation warnings.
See https://docs.gradle.org/5.2.1/userguide/command_line_interface.html#sec:command_line_warnings

BUILD FAILED in 30m 7s
899 actionable tasks: 894 executed, 5 from cache

Publishing build scan...
https://gradle.com/s/2kt6d2yvyw4xw

Build step 'Invoke Gradle script' changed build result to FAILURE
Build step 'Invoke Gradle script' marked build as failure

---------------------------------------------------------------------
To unsubscribe, e-mail: builds-unsubscribe@beam.apache.org
For additional commands, e-mail: builds-help@beam.apache.org


Jenkins build is back to normal : beam_PreCommit_Java_Cron #982

Posted by Apache Jenkins Server <je...@builds.apache.org>.
See <https://builds.apache.org/job/beam_PreCommit_Java_Cron/982/display/redirect?page=changes>


---------------------------------------------------------------------
To unsubscribe, e-mail: builds-unsubscribe@beam.apache.org
For additional commands, e-mail: builds-help@beam.apache.org


Build failed in Jenkins: beam_PreCommit_Java_Cron #981

Posted by Apache Jenkins Server <je...@builds.apache.org>.
See <https://builds.apache.org/job/beam_PreCommit_Java_Cron/981/display/redirect?page=changes>

Changes:

[ryan.blake.williams] consolidate MetricResult implementations

------------------------------------------
[...truncated 924.71 KB...]
                ^
<https://builds.apache.org/job/beam_PreCommit_Java_Cron/ws/src/sdks/java/core/src/main/java/org/apache/beam/sdk/coders/Coder.java>:276: warning: no @param for value
  public boolean isRegisterByteSizeObserverCheap(T value) {
                 ^
<https://builds.apache.org/job/beam_PreCommit_Java_Cron/ws/src/sdks/java/core/src/main/java/org/apache/beam/sdk/coders/Coder.java>:276: warning: no @return
  public boolean isRegisterByteSizeObserverCheap(T value) {
                 ^
<https://builds.apache.org/job/beam_PreCommit_Java_Cron/ws/src/sdks/java/core/src/main/java/org/apache/beam/sdk/coders/Coder.java>:290: warning: no @param for value
  public void registerByteSizeObserver(T value, ElementByteSizeObserver observer) throws Exception {
              ^
<https://builds.apache.org/job/beam_PreCommit_Java_Cron/ws/src/sdks/java/core/src/main/java/org/apache/beam/sdk/coders/Coder.java>:290: warning: no @param for observer
  public void registerByteSizeObserver(T value, ElementByteSizeObserver observer) throws Exception {
              ^
<https://builds.apache.org/job/beam_PreCommit_Java_Cron/ws/src/sdks/java/core/src/main/java/org/apache/beam/sdk/coders/Coder.java>:290: warning: no @throws for java.lang.Exception
  public void registerByteSizeObserver(T value, ElementByteSizeObserver observer) throws Exception {
              ^
<https://builds.apache.org/job/beam_PreCommit_Java_Cron/ws/src/sdks/java/core/src/main/java/org/apache/beam/sdk/coders/Coder.java>:295: warning: no @param for value
  protected long getEncodedElementByteSize(T value) throws Exception {
                 ^
<https://builds.apache.org/job/beam_PreCommit_Java_Cron/ws/src/sdks/java/core/src/main/java/org/apache/beam/sdk/coders/Coder.java>:295: warning: no @return
  protected long getEncodedElementByteSize(T value) throws Exception {
                 ^
<https://builds.apache.org/job/beam_PreCommit_Java_Cron/ws/src/sdks/java/core/src/main/java/org/apache/beam/sdk/coders/Coder.java>:295: warning: no @throws for java.lang.Exception
  protected long getEncodedElementByteSize(T value) throws Exception {
                 ^
<https://builds.apache.org/job/beam_PreCommit_Java_Cron/ws/src/sdks/java/core/src/main/java/org/apache/beam/sdk/coders/Coder.java>:307: warning: no @return
  public TypeDescriptor<T> getEncodedTypeDescriptor() {
                           ^
<https://builds.apache.org/job/beam_PreCommit_Java_Cron/ws/src/sdks/java/core/src/main/java/org/apache/beam/sdk/io/fs/MetadataCoderV2.java>:40: warning: no @return
  public static MetadataCoderV2 of() {
                                ^
<https://builds.apache.org/job/beam_PreCommit_Java_Cron/ws/src/sdks/java/core/src/main/java/org/apache/beam/sdk/io/fs/ResourceId.java>:88: warning: no @param for other
  ResourceId resolve(String other, ResolveOptions resolveOptions);
             ^
<https://builds.apache.org/job/beam_PreCommit_Java_Cron/ws/src/sdks/java/core/src/main/java/org/apache/beam/sdk/io/fs/ResourceId.java>:88: warning: no @param for resolveOptions
  ResourceId resolve(String other, ResolveOptions resolveOptions);
             ^
<https://builds.apache.org/job/beam_PreCommit_Java_Cron/ws/src/sdks/java/core/src/main/java/org/apache/beam/sdk/io/fs/ResourceId.java>:88: warning: no @return
  ResourceId resolve(String other, ResolveOptions resolveOptions);
             ^
<https://builds.apache.org/job/beam_PreCommit_Java_Cron/ws/src/sdks/java/core/src/main/java/org/apache/beam/sdk/io/fs/ResourceId.java>:96: warning: no @return
  ResourceId getCurrentDirectory();
             ^
<https://builds.apache.org/job/beam_PreCommit_Java_Cron/ws/src/sdks/java/core/src/main/java/org/apache/beam/sdk/io/fs/ResourceId.java>:104: warning: no @return
  String getScheme();
         ^
<https://builds.apache.org/job/beam_PreCommit_Java_Cron/ws/src/sdks/java/core/src/main/java/org/apache/beam/sdk/io/fs/ResourceId.java>:117: warning: no @return
  boolean isDirectory();
          ^
<https://builds.apache.org/job/beam_PreCommit_Java_Cron/ws/src/sdks/java/core/src/main/java/org/apache/beam/sdk/io/fs/ResourceIdCoder.java>:35: warning: no @return
  public static ResourceIdCoder of() {
                                ^
<https://builds.apache.org/job/beam_PreCommit_Java_Cron/ws/src/sdks/java/core/src/main/java/org/apache/beam/sdk/io/fs/ResourceIdTester.java>:42: warning: no @param for baseDirectory
  public static void runResourceIdBattery(ResourceId baseDirectory) {
                     ^
<https://builds.apache.org/job/beam_PreCommit_Java_Cron/ws/src/sdks/java/core/src/main/java/org/apache/beam/sdk/metrics/Counter.java>:31: warning: no @param for n
  void inc(long n);
       ^
<https://builds.apache.org/job/beam_PreCommit_Java_Cron/ws/src/sdks/java/core/src/main/java/org/apache/beam/sdk/metrics/Metric.java>:29: warning: no @return
  MetricName getName();
             ^
<https://builds.apache.org/job/beam_PreCommit_Java_Cron/ws/src/sdks/java/core/src/main/java/org/apache/beam/sdk/metrics/Distribution.java>:27: warning: no @param for value
  void update(long value);
       ^
<https://builds.apache.org/job/beam_PreCommit_Java_Cron/ws/src/sdks/java/core/src/main/java/org/apache/beam/sdk/metrics/Gauge.java>:31: warning: no @param for value
  void set(long value);
       ^
<https://builds.apache.org/job/beam_PreCommit_Java_Cron/ws/src/sdks/java/core/src/main/java/org/apache/beam/sdk/metrics/MetricName.java>:38: warning: no @return
  public abstract String getNamespace();
                         ^
<https://builds.apache.org/job/beam_PreCommit_Java_Cron/ws/src/sdks/java/core/src/main/java/org/apache/beam/sdk/metrics/MetricName.java>:46: warning: no @return
  public String namespace() {
                ^
<https://builds.apache.org/job/beam_PreCommit_Java_Cron/ws/src/sdks/java/core/src/main/java/org/apache/beam/sdk/metrics/MetricName.java>:51: warning: no @return
  public abstract String getName();
                         ^
<https://builds.apache.org/job/beam_PreCommit_Java_Cron/ws/src/sdks/java/core/src/main/java/org/apache/beam/sdk/metrics/MetricName.java>:64: warning: no @return
  public String name() {
                ^
<https://builds.apache.org/job/beam_PreCommit_Java_Cron/ws/src/sdks/java/core/src/main/java/org/apache/beam/sdk/metrics/MetricNameFilter.java>:33: warning: no @return
  public abstract String getNamespace();
                         ^
<https://builds.apache.org/job/beam_PreCommit_Java_Cron/ws/src/sdks/java/core/src/main/java/org/apache/beam/sdk/metrics/MetricNameFilter.java>:37: warning: no @return
  public abstract String getName();
                         ^
<https://builds.apache.org/job/beam_PreCommit_Java_Cron/ws/src/sdks/java/core/src/main/java/org/apache/beam/sdk/metrics/MetricQueryResults.java>:33: warning: no @return
  public abstract Iterable<MetricResult<Long>> getCounters();
                                               ^
<https://builds.apache.org/job/beam_PreCommit_Java_Cron/ws/src/sdks/java/core/src/main/java/org/apache/beam/sdk/metrics/MetricQueryResults.java>:36: warning: no @return
  public abstract Iterable<MetricResult<DistributionResult>> getDistributions();
                                                             ^
<https://builds.apache.org/job/beam_PreCommit_Java_Cron/ws/src/sdks/java/core/src/main/java/org/apache/beam/sdk/metrics/MetricQueryResults.java>:39: warning: no @return
  public abstract Iterable<MetricResult<GaugeResult>> getGauges();
                                                      ^
<https://builds.apache.org/job/beam_PreCommit_Java_Cron/ws/src/sdks/java/core/src/main/java/org/apache/beam/sdk/metrics/MetricResult.java>:38: warning: no @return
  public abstract MetricName getName();
                             ^
<https://builds.apache.org/job/beam_PreCommit_Java_Cron/ws/src/sdks/java/core/src/main/java/org/apache/beam/sdk/metrics/MetricResult.java>:42: warning: no @return
  public abstract String getStep();
                         ^
<https://builds.apache.org/job/beam_PreCommit_Java_Cron/ws/src/sdks/java/core/src/main/java/org/apache/beam/sdk/metrics/MetricResult.java>:50: warning: no @return
  public T getCommitted() {
           ^
<https://builds.apache.org/job/beam_PreCommit_Java_Cron/ws/src/sdks/java/core/src/main/java/org/apache/beam/sdk/metrics/MetricResult.java>:66: warning: no @return
  public abstract T getCommittedOrNull();
                    ^
<https://builds.apache.org/job/beam_PreCommit_Java_Cron/ws/src/sdks/java/core/src/main/java/org/apache/beam/sdk/metrics/MetricResult.java>:69: warning: no @return
  public abstract T getAttempted();
                    ^
<https://builds.apache.org/job/beam_PreCommit_Java_Cron/ws/src/sdks/java/core/src/main/java/org/apache/beam/sdk/metrics/MetricResults.java>:62: warning: no @param for filter
  public abstract MetricQueryResults queryMetrics(@Nullable MetricsFilter filter);
                                     ^
<https://builds.apache.org/job/beam_PreCommit_Java_Cron/ws/src/sdks/java/core/src/main/java/org/apache/beam/sdk/metrics/MetricResults.java>:62: warning: no @return
  public abstract MetricQueryResults queryMetrics(@Nullable MetricsFilter filter);
                                     ^
<https://builds.apache.org/job/beam_PreCommit_Java_Cron/ws/src/sdks/java/core/src/main/java/org/apache/beam/sdk/metrics/Metrics.java>:62: warning: no @param for namespace
  public static Counter counter(String namespace, String name) {
                        ^
<https://builds.apache.org/job/beam_PreCommit_Java_Cron/ws/src/sdks/java/core/src/main/java/org/apache/beam/sdk/metrics/Metrics.java>:62: warning: no @param for name
  public static Counter counter(String namespace, String name) {
                        ^
<https://builds.apache.org/job/beam_PreCommit_Java_Cron/ws/src/sdks/java/core/src/main/java/org/apache/beam/sdk/metrics/Metrics.java>:62: warning: no @return
  public static Counter counter(String namespace, String name) {
                        ^
<https://builds.apache.org/job/beam_PreCommit_Java_Cron/ws/src/sdks/java/core/src/main/java/org/apache/beam/sdk/metrics/Metrics.java>:69: warning: no @param for namespace
  public static Counter counter(Class<?> namespace, String name) {
                        ^
<https://builds.apache.org/job/beam_PreCommit_Java_Cron/ws/src/sdks/java/core/src/main/java/org/apache/beam/sdk/metrics/Metrics.java>:69: warning: no @param for name
  public static Counter counter(Class<?> namespace, String name) {
                        ^
<https://builds.apache.org/job/beam_PreCommit_Java_Cron/ws/src/sdks/java/core/src/main/java/org/apache/beam/sdk/metrics/Metrics.java>:69: warning: no @return
  public static Counter counter(Class<?> namespace, String name) {
                        ^
<https://builds.apache.org/job/beam_PreCommit_Java_Cron/ws/src/sdks/java/core/src/main/java/org/apache/beam/sdk/metrics/Metrics.java>:74: warning: no @param for namespace
  public static Distribution distribution(String namespace, String name) {
                             ^
<https://builds.apache.org/job/beam_PreCommit_Java_Cron/ws/src/sdks/java/core/src/main/java/org/apache/beam/sdk/metrics/Metrics.java>:74: warning: no @param for name
  public static Distribution distribution(String namespace, String name) {
                             ^
<https://builds.apache.org/job/beam_PreCommit_Java_Cron/ws/src/sdks/java/core/src/main/java/org/apache/beam/sdk/metrics/Metrics.java>:74: warning: no @return
  public static Distribution distribution(String namespace, String name) {
                             ^
<https://builds.apache.org/job/beam_PreCommit_Java_Cron/ws/src/sdks/java/core/src/main/java/org/apache/beam/sdk/metrics/Metrics.java>:79: warning: no @param for namespace
  public static Distribution distribution(Class<?> namespace, String name) {
                             ^
<https://builds.apache.org/job/beam_PreCommit_Java_Cron/ws/src/sdks/java/core/src/main/java/org/apache/beam/sdk/metrics/Metrics.java>:79: warning: no @param for name
  public static Distribution distribution(Class<?> namespace, String name) {
                             ^
<https://builds.apache.org/job/beam_PreCommit_Java_Cron/ws/src/sdks/java/core/src/main/java/org/apache/beam/sdk/metrics/Metrics.java>:79: warning: no @return
  public static Distribution distribution(Class<?> namespace, String name) {
                             ^
<https://builds.apache.org/job/beam_PreCommit_Java_Cron/ws/src/sdks/java/core/src/main/java/org/apache/beam/sdk/metrics/Metrics.java>:87: warning: no @param for namespace
  public static Gauge gauge(String namespace, String name) {
                      ^

> Task :beam-runners-samza:shadowJar
> Task :beam-runners-samza:validateShadedJarDoesntLeakNonProjectClasses
> Task :beam-runners-samza:check
> Task :beam-runners-samza:build
> Task :beam-runners-samza:buildDependents

> Task :beam-sdks-java-core:javadoc
100 warnings

> Task :beam-sdks-java-javadoc:allJavadoc
> Task :beam-sdks-java-core:test
> Task :beam-sdks-java-core:validateShadedJarDoesntLeakNonProjectClasses
> Task :beam-sdks-java-core:check
> Task :beam-sdks-java-core:build
> Task :beam-sdks-java-core:buildNeeded
> Task :beam-sdks-java-nexmark:shadowJar
> Task :beam-sdks-java-nexmark:validateShadedJarDoesntLeakNonProjectClasses
> Task :beam-sdks-java-nexmark:check
> Task :beam-sdks-java-nexmark:build
> Task :beam-sdks-java-nexmark:buildDependents
> Task :beam-sdks-java-test-utils:buildDependents
> Task :beam-sdks-java-io-kafka:buildDependents
> Task :beam-sdks-java-extensions-sql:buildDependents
> Task :beam-sdks-java-extensions-join-library:buildDependents

FAILURE: Build completed with 5 failures.

1: Task failed with an exception.
-----------
* What went wrong:
Execution failed for task ':beam-runners-google-cloud-dataflow-java:checkstyleMain'.
> Checkstyle rule violations were found. See the report at: file://<https://builds.apache.org/job/beam_PreCommit_Java_Cron/ws/src/runners/google-cloud-dataflow-java/build/reports/checkstyle/main.html>
  Checkstyle files with violations: 1
  Checkstyle violations by severity: [error:1]


* Try:
Run with --stacktrace option to get the stack trace. Run with --info or --debug option to get more log output. Run with --scan to get full insights.
==============================================================================

2: Task failed with an exception.
-----------
* What went wrong:
Execution failed for task ':beam-runners-flink_2.11:compileTestJava'.
> Compilation failed with exit code 1; see the compiler error output for details.

* Try:
Run with --stacktrace option to get the stack trace. Run with --info or --debug option to get more log output. Run with --scan to get full insights.
==============================================================================

3: Task failed with an exception.
-----------
* What went wrong:
Execution failed for task ':beam-runners-flink-1.6:compileTestJava'.
> Compilation failed with exit code 1; see the compiler error output for details.

* Try:
Run with --stacktrace option to get the stack trace. Run with --info or --debug option to get more log output. Run with --scan to get full insights.
==============================================================================

4: Task failed with an exception.
-----------
* What went wrong:
Execution failed for task ':beam-runners-flink-1.7:compileTestJava'.
> Compilation failed with exit code 1; see the compiler error output for details.

* Try:
Run with --stacktrace option to get the stack trace. Run with --info or --debug option to get more log output. Run with --scan to get full insights.
==============================================================================

5: Task failed with an exception.
-----------
* What went wrong:
Execution failed for task ':beam-sdks-java-io-kudu:test'.
> There were failing tests. See the report at: file://<https://builds.apache.org/job/beam_PreCommit_Java_Cron/ws/src/sdks/java/io/kudu/build/reports/tests/test/index.html>

* Try:
Run with --stacktrace option to get the stack trace. Run with --info or --debug option to get more log output. Run with --scan to get full insights.
==============================================================================

* Get more help at https://help.gradle.org

Deprecated Gradle features were used in this build, making it incompatible with Gradle 6.0.
Use '--warning-mode all' to show the individual deprecation warnings.
See https://docs.gradle.org/5.2.1/userguide/command_line_interface.html#sec:command_line_warnings

BUILD FAILED in 28m 0s
899 actionable tasks: 883 executed, 16 from cache

Publishing build scan...
https://gradle.com/s/4v4cg3xw2hhzo

Build step 'Invoke Gradle script' changed build result to FAILURE
Build step 'Invoke Gradle script' marked build as failure

---------------------------------------------------------------------
To unsubscribe, e-mail: builds-unsubscribe@beam.apache.org
For additional commands, e-mail: builds-help@beam.apache.org


Build failed in Jenkins: beam_PreCommit_Java_Cron #980

Posted by Apache Jenkins Server <je...@builds.apache.org>.
See <https://builds.apache.org/job/beam_PreCommit_Java_Cron/980/display/redirect?page=changes>

Changes:

[robertwb] [BEAM-6638] Python ExternalTransform output mismatched (#7792)

------------------------------------------
[...truncated 907.68 KB...]
<https://builds.apache.org/job/beam_PreCommit_Java_Cron/ws/src/sdks/java/core/src/main/java/org/apache/beam/sdk/coders/Coder.java>:222: warning: no @return
  public boolean consistentWithEquals() {
                 ^
<https://builds.apache.org/job/beam_PreCommit_Java_Cron/ws/src/sdks/java/core/src/main/java/org/apache/beam/sdk/coders/Coder.java>:249: warning: no @param for value
  public Object structuralValue(T value) {
                ^
<https://builds.apache.org/job/beam_PreCommit_Java_Cron/ws/src/sdks/java/core/src/main/java/org/apache/beam/sdk/coders/Coder.java>:249: warning: no @return
  public Object structuralValue(T value) {
                ^
<https://builds.apache.org/job/beam_PreCommit_Java_Cron/ws/src/sdks/java/core/src/main/java/org/apache/beam/sdk/coders/Coder.java>:276: warning: no @param for value
  public boolean isRegisterByteSizeObserverCheap(T value) {
                 ^
<https://builds.apache.org/job/beam_PreCommit_Java_Cron/ws/src/sdks/java/core/src/main/java/org/apache/beam/sdk/coders/Coder.java>:276: warning: no @return
  public boolean isRegisterByteSizeObserverCheap(T value) {
                 ^
<https://builds.apache.org/job/beam_PreCommit_Java_Cron/ws/src/sdks/java/core/src/main/java/org/apache/beam/sdk/coders/Coder.java>:290: warning: no @param for value
  public void registerByteSizeObserver(T value, ElementByteSizeObserver observer) throws Exception {
              ^
<https://builds.apache.org/job/beam_PreCommit_Java_Cron/ws/src/sdks/java/core/src/main/java/org/apache/beam/sdk/coders/Coder.java>:290: warning: no @param for observer
  public void registerByteSizeObserver(T value, ElementByteSizeObserver observer) throws Exception {
              ^
<https://builds.apache.org/job/beam_PreCommit_Java_Cron/ws/src/sdks/java/core/src/main/java/org/apache/beam/sdk/coders/Coder.java>:290: warning: no @throws for java.lang.Exception
  public void registerByteSizeObserver(T value, ElementByteSizeObserver observer) throws Exception {
              ^
<https://builds.apache.org/job/beam_PreCommit_Java_Cron/ws/src/sdks/java/core/src/main/java/org/apache/beam/sdk/coders/Coder.java>:295: warning: no @param for value
  protected long getEncodedElementByteSize(T value) throws Exception {
                 ^
<https://builds.apache.org/job/beam_PreCommit_Java_Cron/ws/src/sdks/java/core/src/main/java/org/apache/beam/sdk/coders/Coder.java>:295: warning: no @return
  protected long getEncodedElementByteSize(T value) throws Exception {
                 ^
<https://builds.apache.org/job/beam_PreCommit_Java_Cron/ws/src/sdks/java/core/src/main/java/org/apache/beam/sdk/coders/Coder.java>:295: warning: no @throws for java.lang.Exception
  protected long getEncodedElementByteSize(T value) throws Exception {
                 ^
<https://builds.apache.org/job/beam_PreCommit_Java_Cron/ws/src/sdks/java/core/src/main/java/org/apache/beam/sdk/coders/Coder.java>:307: warning: no @return
  public TypeDescriptor<T> getEncodedTypeDescriptor() {
                           ^
<https://builds.apache.org/job/beam_PreCommit_Java_Cron/ws/src/sdks/java/core/src/main/java/org/apache/beam/sdk/io/fs/MetadataCoderV2.java>:40: warning: no @return
  public static MetadataCoderV2 of() {
                                ^
<https://builds.apache.org/job/beam_PreCommit_Java_Cron/ws/src/sdks/java/core/src/main/java/org/apache/beam/sdk/io/fs/ResourceId.java>:88: warning: no @param for other
  ResourceId resolve(String other, ResolveOptions resolveOptions);
             ^
<https://builds.apache.org/job/beam_PreCommit_Java_Cron/ws/src/sdks/java/core/src/main/java/org/apache/beam/sdk/io/fs/ResourceId.java>:88: warning: no @param for resolveOptions
  ResourceId resolve(String other, ResolveOptions resolveOptions);
             ^
<https://builds.apache.org/job/beam_PreCommit_Java_Cron/ws/src/sdks/java/core/src/main/java/org/apache/beam/sdk/io/fs/ResourceId.java>:88: warning: no @return
  ResourceId resolve(String other, ResolveOptions resolveOptions);
             ^
<https://builds.apache.org/job/beam_PreCommit_Java_Cron/ws/src/sdks/java/core/src/main/java/org/apache/beam/sdk/io/fs/ResourceId.java>:96: warning: no @return
  ResourceId getCurrentDirectory();
             ^
<https://builds.apache.org/job/beam_PreCommit_Java_Cron/ws/src/sdks/java/core/src/main/java/org/apache/beam/sdk/io/fs/ResourceId.java>:104: warning: no @return
  String getScheme();
         ^
<https://builds.apache.org/job/beam_PreCommit_Java_Cron/ws/src/sdks/java/core/src/main/java/org/apache/beam/sdk/io/fs/ResourceId.java>:117: warning: no @return
  boolean isDirectory();
          ^
<https://builds.apache.org/job/beam_PreCommit_Java_Cron/ws/src/sdks/java/core/src/main/java/org/apache/beam/sdk/io/fs/ResourceIdCoder.java>:35: warning: no @return
  public static ResourceIdCoder of() {
                                ^
<https://builds.apache.org/job/beam_PreCommit_Java_Cron/ws/src/sdks/java/core/src/main/java/org/apache/beam/sdk/io/fs/ResourceIdTester.java>:42: warning: no @param for baseDirectory
  public static void runResourceIdBattery(ResourceId baseDirectory) {
                     ^
<https://builds.apache.org/job/beam_PreCommit_Java_Cron/ws/src/sdks/java/core/src/main/java/org/apache/beam/sdk/metrics/Counter.java>:31: warning: no @param for n
  void inc(long n);
       ^
<https://builds.apache.org/job/beam_PreCommit_Java_Cron/ws/src/sdks/java/core/src/main/java/org/apache/beam/sdk/metrics/Metric.java>:29: warning: no @return
  MetricName getName();
             ^
<https://builds.apache.org/job/beam_PreCommit_Java_Cron/ws/src/sdks/java/core/src/main/java/org/apache/beam/sdk/metrics/MetricResult.java>:32: warning: no @return
  MetricName getName();
             ^
<https://builds.apache.org/job/beam_PreCommit_Java_Cron/ws/src/sdks/java/core/src/main/java/org/apache/beam/sdk/metrics/MetricResult.java>:35: warning: no @return
  String getStep();
         ^
<https://builds.apache.org/job/beam_PreCommit_Java_Cron/ws/src/sdks/java/core/src/main/java/org/apache/beam/sdk/metrics/MetricResult.java>:43: warning: no @return
  T getCommitted();
    ^
<https://builds.apache.org/job/beam_PreCommit_Java_Cron/ws/src/sdks/java/core/src/main/java/org/apache/beam/sdk/metrics/MetricResult.java>:46: warning: no @return
  T getAttempted();
    ^
<https://builds.apache.org/job/beam_PreCommit_Java_Cron/ws/src/sdks/java/core/src/main/java/org/apache/beam/sdk/metrics/Distribution.java>:27: warning: no @param for value
  void update(long value);
       ^
<https://builds.apache.org/job/beam_PreCommit_Java_Cron/ws/src/sdks/java/core/src/main/java/org/apache/beam/sdk/metrics/Gauge.java>:31: warning: no @param for value
  void set(long value);
       ^
<https://builds.apache.org/job/beam_PreCommit_Java_Cron/ws/src/sdks/java/core/src/main/java/org/apache/beam/sdk/metrics/MetricName.java>:38: warning: no @return
  public abstract String getNamespace();
                         ^
<https://builds.apache.org/job/beam_PreCommit_Java_Cron/ws/src/sdks/java/core/src/main/java/org/apache/beam/sdk/metrics/MetricName.java>:46: warning: no @return
  public String namespace() {
                ^
<https://builds.apache.org/job/beam_PreCommit_Java_Cron/ws/src/sdks/java/core/src/main/java/org/apache/beam/sdk/metrics/MetricName.java>:51: warning: no @return
  public abstract String getName();
                         ^
<https://builds.apache.org/job/beam_PreCommit_Java_Cron/ws/src/sdks/java/core/src/main/java/org/apache/beam/sdk/metrics/MetricName.java>:64: warning: no @return
  public String name() {
                ^
<https://builds.apache.org/job/beam_PreCommit_Java_Cron/ws/src/sdks/java/core/src/main/java/org/apache/beam/sdk/metrics/MetricNameFilter.java>:33: warning: no @return
  public abstract String getNamespace();
                         ^
<https://builds.apache.org/job/beam_PreCommit_Java_Cron/ws/src/sdks/java/core/src/main/java/org/apache/beam/sdk/metrics/MetricNameFilter.java>:37: warning: no @return
  public abstract String getName();
                         ^
<https://builds.apache.org/job/beam_PreCommit_Java_Cron/ws/src/sdks/java/core/src/main/java/org/apache/beam/sdk/metrics/MetricQueryResults.java>:33: warning: no @return
  public abstract Iterable<MetricResult<Long>> getCounters();
                                               ^
<https://builds.apache.org/job/beam_PreCommit_Java_Cron/ws/src/sdks/java/core/src/main/java/org/apache/beam/sdk/metrics/MetricQueryResults.java>:36: warning: no @return
  public abstract Iterable<MetricResult<DistributionResult>> getDistributions();
                                                             ^
<https://builds.apache.org/job/beam_PreCommit_Java_Cron/ws/src/sdks/java/core/src/main/java/org/apache/beam/sdk/metrics/MetricQueryResults.java>:39: warning: no @return
  public abstract Iterable<MetricResult<GaugeResult>> getGauges();
                                                      ^
<https://builds.apache.org/job/beam_PreCommit_Java_Cron/ws/src/sdks/java/core/src/main/java/org/apache/beam/sdk/metrics/MetricResults.java>:62: warning: no @param for filter
  public abstract MetricQueryResults queryMetrics(@Nullable MetricsFilter filter);
                                     ^
<https://builds.apache.org/job/beam_PreCommit_Java_Cron/ws/src/sdks/java/core/src/main/java/org/apache/beam/sdk/metrics/MetricResults.java>:62: warning: no @return
  public abstract MetricQueryResults queryMetrics(@Nullable MetricsFilter filter);
                                     ^
<https://builds.apache.org/job/beam_PreCommit_Java_Cron/ws/src/sdks/java/core/src/main/java/org/apache/beam/sdk/metrics/Metrics.java>:62: warning: no @param for namespace
  public static Counter counter(String namespace, String name) {
                        ^
<https://builds.apache.org/job/beam_PreCommit_Java_Cron/ws/src/sdks/java/core/src/main/java/org/apache/beam/sdk/metrics/Metrics.java>:62: warning: no @param for name
  public static Counter counter(String namespace, String name) {
                        ^
<https://builds.apache.org/job/beam_PreCommit_Java_Cron/ws/src/sdks/java/core/src/main/java/org/apache/beam/sdk/metrics/Metrics.java>:62: warning: no @return
  public static Counter counter(String namespace, String name) {
                        ^
<https://builds.apache.org/job/beam_PreCommit_Java_Cron/ws/src/sdks/java/core/src/main/java/org/apache/beam/sdk/metrics/Metrics.java>:69: warning: no @param for namespace
  public static Counter counter(Class<?> namespace, String name) {
                        ^
<https://builds.apache.org/job/beam_PreCommit_Java_Cron/ws/src/sdks/java/core/src/main/java/org/apache/beam/sdk/metrics/Metrics.java>:69: warning: no @param for name
  public static Counter counter(Class<?> namespace, String name) {
                        ^
<https://builds.apache.org/job/beam_PreCommit_Java_Cron/ws/src/sdks/java/core/src/main/java/org/apache/beam/sdk/metrics/Metrics.java>:69: warning: no @return
  public static Counter counter(Class<?> namespace, String name) {
                        ^
<https://builds.apache.org/job/beam_PreCommit_Java_Cron/ws/src/sdks/java/core/src/main/java/org/apache/beam/sdk/metrics/Metrics.java>:74: warning: no @param for namespace
  public static Distribution distribution(String namespace, String name) {
                             ^
<https://builds.apache.org/job/beam_PreCommit_Java_Cron/ws/src/sdks/java/core/src/main/java/org/apache/beam/sdk/metrics/Metrics.java>:74: warning: no @param for name
  public static Distribution distribution(String namespace, String name) {
                             ^
<https://builds.apache.org/job/beam_PreCommit_Java_Cron/ws/src/sdks/java/core/src/main/java/org/apache/beam/sdk/metrics/Metrics.java>:74: warning: no @return
  public static Distribution distribution(String namespace, String name) {
                             ^
<https://builds.apache.org/job/beam_PreCommit_Java_Cron/ws/src/sdks/java/core/src/main/java/org/apache/beam/sdk/metrics/Metrics.java>:79: warning: no @param for namespace
  public static Distribution distribution(Class<?> namespace, String name) {
                             ^
<https://builds.apache.org/job/beam_PreCommit_Java_Cron/ws/src/sdks/java/core/src/main/java/org/apache/beam/sdk/metrics/Metrics.java>:79: warning: no @param for name
  public static Distribution distribution(Class<?> namespace, String name) {
                             ^
<https://builds.apache.org/job/beam_PreCommit_Java_Cron/ws/src/sdks/java/core/src/main/java/org/apache/beam/sdk/metrics/Metrics.java>:79: warning: no @return
  public static Distribution distribution(Class<?> namespace, String name) {
                             ^
<https://builds.apache.org/job/beam_PreCommit_Java_Cron/ws/src/sdks/java/core/src/main/java/org/apache/beam/sdk/metrics/Metrics.java>:87: warning: no @param for namespace
  public static Gauge gauge(String namespace, String name) {
                      ^
<https://builds.apache.org/job/beam_PreCommit_Java_Cron/ws/src/sdks/java/core/src/main/java/org/apache/beam/sdk/metrics/Metrics.java>:87: warning: no @param for name
  public static Gauge gauge(String namespace, String name) {
                      ^
100 warnings

> Task :beam-sdks-java-javadoc:allJavadoc
> Task :beam-sdks-java-core:test
> Task :beam-sdks-java-core:validateShadedJarDoesntLeakNonProjectClasses
> Task :beam-sdks-java-core:check
> Task :beam-sdks-java-core:build
> Task :beam-sdks-java-core:buildNeeded
> Task :beam-sdks-java-nexmark:shadowJar
> Task :beam-sdks-java-nexmark:validateShadedJarDoesntLeakNonProjectClasses
> Task :beam-sdks-java-nexmark:check
> Task :beam-sdks-java-nexmark:build
> Task :beam-sdks-java-nexmark:buildDependents
> Task :beam-sdks-java-extensions-sql:buildDependents
> Task :beam-sdks-java-io-kafka:buildDependents
> Task :beam-sdks-java-test-utils:buildDependents
> Task :beam-sdks-java-extensions-join-library:buildDependents

FAILURE: Build completed with 5 failures.

1: Task failed with an exception.
-----------
* What went wrong:
Execution failed for task ':beam-runners-google-cloud-dataflow-java:checkstyleMain'.
> Checkstyle rule violations were found. See the report at: file://<https://builds.apache.org/job/beam_PreCommit_Java_Cron/ws/src/runners/google-cloud-dataflow-java/build/reports/checkstyle/main.html>
  Checkstyle files with violations: 1
  Checkstyle violations by severity: [error:1]


* Try:
Run with --stacktrace option to get the stack trace. Run with --info or --debug option to get more log output. Run with --scan to get full insights.
==============================================================================

2: Task failed with an exception.
-----------
* What went wrong:
Execution failed for task ':beam-runners-flink_2.11:compileTestJava'.
> Compilation failed with exit code 1; see the compiler error output for details.

* Try:
Run with --stacktrace option to get the stack trace. Run with --info or --debug option to get more log output. Run with --scan to get full insights.
==============================================================================

3: Task failed with an exception.
-----------
* What went wrong:
Execution failed for task ':beam-runners-flink-1.6:compileTestJava'.
> Compilation failed with exit code 1; see the compiler error output for details.

* Try:
Run with --stacktrace option to get the stack trace. Run with --info or --debug option to get more log output. Run with --scan to get full insights.
==============================================================================

4: Task failed with an exception.
-----------
* What went wrong:
Execution failed for task ':beam-runners-flink-1.7:compileTestJava'.
> Compilation failed with exit code 1; see the compiler error output for details.

* Try:
Run with --stacktrace option to get the stack trace. Run with --info or --debug option to get more log output. Run with --scan to get full insights.
==============================================================================

5: Task failed with an exception.
-----------
* What went wrong:
Execution failed for task ':beam-sdks-java-io-kudu:test'.
> There were failing tests. See the report at: file://<https://builds.apache.org/job/beam_PreCommit_Java_Cron/ws/src/sdks/java/io/kudu/build/reports/tests/test/index.html>

* Try:
Run with --stacktrace option to get the stack trace. Run with --info or --debug option to get more log output. Run with --scan to get full insights.
==============================================================================

* Get more help at https://help.gradle.org

Deprecated Gradle features were used in this build, making it incompatible with Gradle 6.0.
Use '--warning-mode all' to show the individual deprecation warnings.
See https://docs.gradle.org/5.2.1/userguide/command_line_interface.html#sec:command_line_warnings

BUILD FAILED in 23m 19s
899 actionable tasks: 862 executed, 37 from cache

Publishing build scan...
https://gradle.com/s/terlbjzxfgbcw

Build step 'Invoke Gradle script' changed build result to FAILURE
Build step 'Invoke Gradle script' marked build as failure

---------------------------------------------------------------------
To unsubscribe, e-mail: builds-unsubscribe@beam.apache.org
For additional commands, e-mail: builds-help@beam.apache.org