You are viewing a plain text version of this content. The canonical link for it is here.
Posted to builds@beam.apache.org by Apache Jenkins Server <je...@builds.apache.org> on 2023/06/26 02:30:42 UTC

Build failed in Jenkins: beam_PostCommit_Java_DataflowV1 #3218

See <https://ci-beam.apache.org/job/beam_PostCommit_Java_DataflowV1/3218/display/redirect?page=changes>

Changes:

[noreply] Updates Python ExternalTransform to use the transform service when


------------------------------------------
[...truncated 13.10 KB...]
> Task :sdks:java:extensions:google-cloud-platform-core:processResources NO-SOURCE
> Task :runners:core-java:processResources NO-SOURCE
> Task :runners:java-fn-execution:processResources NO-SOURCE
> Task :sdks:java:harness:createCheckerFrameworkManifest
> Task :sdks:java:expansion-service:createCheckerFrameworkManifest
> Task :sdks:java:extensions:arrow:createCheckerFrameworkManifest
> Task :sdks:java:harness:processResources NO-SOURCE
> Task :sdks:java:expansion-service:processResources NO-SOURCE
> Task :sdks:java:extensions:arrow:processResources NO-SOURCE
> Task :sdks:java:core:generateGrammarSource FROM-CACHE
> Task :model:job-management:processResources
> Task :model:fn-execution:processResources
> Task :runners:google-cloud-dataflow-java:worker:createCheckerFrameworkManifest
> Task :sdks:java:extensions:protobuf:createCheckerFrameworkManifest
> Task :runners:google-cloud-dataflow-java:worker:windmill:createCheckerFrameworkManifest
> Task :sdks:java:io:google-cloud-platform:createCheckerFrameworkManifest
> Task :sdks:java:io:kafka:createCheckerFrameworkManifest
> Task :sdks:java:io:google-cloud-platform:processResources NO-SOURCE
> Task :sdks:java:io:kafka:processResources NO-SOURCE
> Task :sdks:java:extensions:protobuf:extractProto
> Task :sdks:java:extensions:protobuf:processResources NO-SOURCE
> Task :runners:google-cloud-dataflow-java:worker:processResources
> Task :sdks:java:extensions:ml:createCheckerFrameworkManifest
> Task :examples:java:createCheckerFrameworkManifest
> Task :sdks:java:extensions:python:createCheckerFrameworkManifest
> Task :sdks:java:extensions:ml:processResources NO-SOURCE
> Task :examples:java:processResources NO-SOURCE
> Task :sdks:java:transform-service:launcher:createCheckerFrameworkManifest
> Task :runners:direct-java:createCheckerFrameworkManifest
> Task :runners:local-java:createCheckerFrameworkManifest
> Task :runners:local-java:processResources NO-SOURCE
> Task :runners:direct-java:processResources NO-SOURCE
> Task :sdks:java:extensions:python:processResources
> Task :runners:direct-java:processTestResources NO-SOURCE
> Task :runners:core-java:processTestResources NO-SOURCE
> Task :sdks:java:extensions:google-cloud-platform-core:processTestResources NO-SOURCE
> Task :sdks:java:core:processResources
> Task :runners:google-cloud-dataflow-java:processResources
> Task :sdks:java:extensions:avro:generateTestAvroProtocol NO-SOURCE
> Task :sdks:java:core:generateTestAvroProtocol NO-SOURCE
> Task :sdks:java:extensions:protobuf:extractTestProto
> Task :examples:java:processTestResources
> Task :sdks:java:io:common:createCheckerFrameworkManifest
> Task :sdks:java:io:common:compileJava NO-SOURCE
> Task :sdks:java:io:common:processResources NO-SOURCE
> Task :sdks:java:io:common:classes UP-TO-DATE
> Task :sdks:java:extensions:protobuf:processTestResources
> Task :sdks:java:io:common:jar
> Task :sdks:java:testing:test-utils:createCheckerFrameworkManifest
> Task :sdks:java:io:common:processTestResources NO-SOURCE
> Task :sdks:java:testing:test-utils:processResources NO-SOURCE
> Task :sdks:java:testing:test-utils:processTestResources NO-SOURCE
> Task :sdks:java:transform-service:launcher:compileJava FROM-CACHE
> Task :sdks:java:transform-service:launcher:processResources
> Task :sdks:java:transform-service:launcher:classes
> Task :runners:google-cloud-dataflow-java:copyGoogleCloudPlatformTestResources
> Task :sdks:java:io:google-cloud-platform:processTestResources
> Task :sdks:java:transform-service:launcher:shadowJar FROM-CACHE
> Task :sdks:java:core:generateTestAvroJava
> Task :sdks:java:core:generateTestGrammarSource NO-SOURCE
> Task :sdks:java:extensions:avro:generateTestAvroJava
> Task :sdks:java:extensions:avro:processTestResources NO-SOURCE
> Task :sdks:java:core:processTestResources
> Task :runners:google-cloud-dataflow-java:worker:windmill:extractIncludeProto
> Task :model:pipeline:extractIncludeProto
> Task :runners:google-cloud-dataflow-java:worker:windmill:extractProto
> Task :model:pipeline:extractProto
> Task :runners:google-cloud-dataflow-java:worker:windmill:generateProto FROM-CACHE
> Task :model:pipeline:generateProto FROM-CACHE
> Task :runners:google-cloud-dataflow-java:worker:windmill:compileJava FROM-CACHE
> Task :runners:google-cloud-dataflow-java:worker:windmill:processResources
> Task :runners:google-cloud-dataflow-java:worker:windmill:classes
> Task :runners:google-cloud-dataflow-java:worker:windmill:shadowJar FROM-CACHE
> Task :model:pipeline:compileJava FROM-CACHE
> Task :model:pipeline:processResources
> Task :model:pipeline:classes
> Task :model:pipeline:jar
> Task :model:pipeline:shadowJar FROM-CACHE
> Task :model:job-management:extractIncludeProto
> Task :model:fn-execution:extractIncludeProto
> Task :model:job-management:generateProto FROM-CACHE
> Task :model:fn-execution:generateProto FROM-CACHE
> Task :model:job-management:compileJava FROM-CACHE
> Task :model:job-management:classes
> Task :model:fn-execution:compileJava FROM-CACHE
> Task :model:fn-execution:classes
> Task :model:job-management:shadowJar FROM-CACHE
> Task :model:fn-execution:shadowJar FROM-CACHE
> Task :sdks:java:core:compileJava FROM-CACHE
> Task :sdks:java:core:classes
> Task :sdks:java:core:shadowJar FROM-CACHE
> Task :runners:local-java:compileJava FROM-CACHE
> Task :runners:local-java:classes UP-TO-DATE
> Task :runners:local-java:jar
> Task :sdks:java:io:common:compileTestJava FROM-CACHE
> Task :sdks:java:io:common:testClasses UP-TO-DATE
> Task :sdks:java:testing:test-utils:compileJava FROM-CACHE
> Task :sdks:java:testing:test-utils:classes UP-TO-DATE
> Task :sdks:java:io:common:testJar
> Task :sdks:java:testing:test-utils:jar
> Task :sdks:java:extensions:arrow:compileJava FROM-CACHE
> Task :sdks:java:extensions:arrow:classes UP-TO-DATE
> Task :sdks:java:extensions:arrow:jar
> Task :sdks:java:extensions:avro:compileJava FROM-CACHE
> Task :sdks:java:fn-execution:compileJava FROM-CACHE
> Task :sdks:java:fn-execution:classes UP-TO-DATE
> Task :sdks:java:extensions:avro:classes UP-TO-DATE
> Task :sdks:java:testing:test-utils:compileTestJava FROM-CACHE
> Task :sdks:java:testing:test-utils:testClasses UP-TO-DATE
> Task :sdks:java:testing:test-utils:testJar
> Task :sdks:java:fn-execution:jar
> Task :sdks:java:extensions:avro:jar
> Task :sdks:java:extensions:protobuf:extractIncludeProto
> Task :sdks:java:extensions:protobuf:generateProto NO-SOURCE
> Task :runners:core-construction-java:compileJava FROM-CACHE
> Task :runners:core-construction-java:classes UP-TO-DATE
> Task :sdks:java:extensions:protobuf:compileJava FROM-CACHE
> Task :sdks:java:extensions:protobuf:classes UP-TO-DATE
> Task :sdks:java:extensions:protobuf:jar
> Task :runners:core-construction-java:jar
> Task :runners:core-java:compileJava FROM-CACHE
> Task :runners:core-java:classes UP-TO-DATE
> Task :sdks:java:extensions:python:compileJava FROM-CACHE
> Task :sdks:java:extensions:python:classes
> Task :sdks:java:extensions:python:jar
> Task :runners:core-java:jar
> Task :sdks:java:core:compileTestJava FROM-CACHE
> Task :sdks:java:core:testClasses
> Task :sdks:java:extensions:google-cloud-platform-core:compileJava FROM-CACHE
> Task :sdks:java:extensions:google-cloud-platform-core:classes UP-TO-DATE
> Task :sdks:java:extensions:google-cloud-platform-core:jar
> Task :sdks:java:harness:compileJava FROM-CACHE
> Task :sdks:java:harness:classes UP-TO-DATE
> Task :sdks:java:core:shadowTestJar FROM-CACHE
> Task :sdks:java:harness:jar
> Task :runners:java-fn-execution:compileJava FROM-CACHE
> Task :runners:java-fn-execution:classes UP-TO-DATE
> Task :runners:java-fn-execution:jar
> Task :sdks:java:expansion-service:compileJava FROM-CACHE
> Task :sdks:java:expansion-service:classes UP-TO-DATE
> Task :sdks:java:expansion-service:jar
> Task :sdks:java:extensions:google-cloud-platform-core:compileTestJava FROM-CACHE
> Task :sdks:java:extensions:avro:compileTestJava FROM-CACHE
> Task :sdks:java:extensions:avro:testClasses UP-TO-DATE
> Task :runners:direct-java:compileJava FROM-CACHE
> Task :runners:direct-java:classes UP-TO-DATE
> Task :sdks:java:extensions:avro:testJar
> Task :sdks:java:extensions:google-cloud-platform-core:testClasses UP-TO-DATE
> Task :runners:core-java:compileTestJava FROM-CACHE
> Task :runners:core-java:testClasses UP-TO-DATE
> Task :sdks:java:extensions:google-cloud-platform-core:testJar
> Task :runners:direct-java:shadowJar FROM-CACHE
> Task :sdks:java:harness:shadowJar FROM-CACHE
> Task :runners:core-java:testJar
> Task :sdks:java:extensions:ml:compileJava FROM-CACHE
> Task :sdks:java:extensions:ml:classes UP-TO-DATE
> Task :sdks:java:extensions:ml:jar
> Task :sdks:java:io:kafka:compileJava FROM-CACHE
> Task :sdks:java:io:kafka:classes UP-TO-DATE
> Task :sdks:java:io:kafka:jar
> Task :runners:direct-java:compileTestJava FROM-CACHE
> Task :runners:direct-java:testClasses UP-TO-DATE
> Task :runners:direct-java:shadowTestJar FROM-CACHE
> Task :sdks:java:io:google-cloud-platform:compileJava FROM-CACHE
> Task :sdks:java:io:google-cloud-platform:classes UP-TO-DATE
> Task :sdks:java:io:google-cloud-platform:jar
> Task :sdks:java:extensions:protobuf:extractIncludeTestProto
> Task :sdks:java:extensions:protobuf:generateTestProto FROM-CACHE
> Task :sdks:java:extensions:protobuf:compileTestJava FROM-CACHE
> Task :sdks:java:extensions:protobuf:testClasses
> Task :runners:google-cloud-dataflow-java:compileJava FROM-CACHE
> Task :runners:google-cloud-dataflow-java:classes
> Task :examples:java:compileJava FROM-CACHE
> Task :examples:java:classes UP-TO-DATE
> Task :sdks:java:extensions:protobuf:testJar
> Task :runners:google-cloud-dataflow-java:jar
> Task :examples:java:jar
> Task :examples:java:compileTestJava FROM-CACHE
> Task :examples:java:testClasses
> Task :examples:java:testJar
> Task :runners:google-cloud-dataflow-java:worker:compileJava FROM-CACHE
> Task :runners:google-cloud-dataflow-java:worker:classes
> Task :sdks:java:io:google-cloud-platform:compileTestJava FROM-CACHE
> Task :sdks:java:io:google-cloud-platform:testClasses
> Task :runners:google-cloud-dataflow-java:worker:shadowJar FROM-CACHE
> Task :runners:google-cloud-dataflow-java:coreSDKJavaLegacyWorkerIntegrationTest NO-SOURCE
> Task :sdks:java:io:google-cloud-platform:testJar
> Task :runners:google-cloud-dataflow-java:examplesJavaLegacyWorkerIntegrationTest FROM-CACHE
> Task :runners:google-cloud-dataflow-java:googleCloudPlatformLegacyWorkerIntegrationTest

org.apache.beam.sdk.io.gcp.firestore.it.FirestoreV1IT > batchWrite_partialFailureOutputsToDeadLetterQueue FAILED
    java.util.concurrent.ExecutionException at FirestoreV1IT.java:96
        Caused by: com.google.api.gax.rpc.InvalidArgumentException at ApiExceptionFactory.java:92
            Caused by: io.grpc.StatusRuntimeException at Status.java:539

org.apache.beam.sdk.io.gcp.firestore.it.FirestoreV1IT > batchGet FAILED
    java.util.concurrent.ExecutionException at AbstractFuture.java:588
        Caused by: com.google.api.gax.rpc.InvalidArgumentException at ApiExceptionFactory.java:92
            Caused by: io.grpc.StatusRuntimeException at Status.java:539

org.apache.beam.sdk.io.gcp.firestore.it.FirestoreV1IT > partitionQuery FAILED
    java.util.concurrent.ExecutionException at AbstractFuture.java:588
        Caused by: com.google.api.gax.rpc.InvalidArgumentException at ApiExceptionFactory.java:92
            Caused by: io.grpc.StatusRuntimeException at Status.java:539

org.apache.beam.sdk.io.gcp.firestore.it.FirestoreV1IT > listCollections FAILED
    java.util.concurrent.ExecutionException at AbstractFuture.java:588
        Caused by: com.google.api.gax.rpc.InvalidArgumentException at ApiExceptionFactory.java:92
            Caused by: io.grpc.StatusRuntimeException at Status.java:539

org.apache.beam.sdk.io.gcp.firestore.it.FirestoreV1IT > write FAILED
    java.lang.RuntimeException at TestDataflowRunner.java:141

org.apache.beam.sdk.io.gcp.firestore.it.FirestoreV1IT > runQuery FAILED
    java.util.concurrent.ExecutionException at AbstractFuture.java:588
        Caused by: com.google.api.gax.rpc.InvalidArgumentException at ApiExceptionFactory.java:92
            Caused by: io.grpc.StatusRuntimeException at Status.java:539

105 tests completed, 6 failed, 3 skipped

> Task :runners:google-cloud-dataflow-java:googleCloudPlatformLegacyWorkerIntegrationTest FAILED
> Task :runners:google-cloud-dataflow-java:googleCloudPlatformLegacyWorkerKmsIntegrationTest FROM-CACHE

FAILURE: Build failed with an exception.

* What went wrong:
Execution failed for task ':runners:google-cloud-dataflow-java:googleCloudPlatformLegacyWorkerIntegrationTest'.
> There were failing tests. See the report at: file://<https://ci-beam.apache.org/job/beam_PostCommit_Java_DataflowV1/ws/src/runners/google-cloud-dataflow-java/build/reports/tests/googleCloudPlatformLegacyWorkerIntegrationTest/index.html>

* Try:
> Run with --stacktrace option to get the stack trace.
> Run with --info or --debug option to get more log output.

* Get more help at https://help.gradle.org

Deprecated Gradle features were used in this build, making it incompatible with Gradle 8.0.

You can use '--warning-mode all' to show the individual deprecation warnings and determine if they come from your own scripts or plugins.

See https://docs.gradle.org/7.5.1/userguide/command_line_interface.html#sec:command_line_warnings

BUILD FAILED in 2h 15m
149 actionable tasks: 88 executed, 59 from cache, 2 up-to-date

Publishing build scan...
https://ge.apache.org/s/pz3fvmtt247pe

Build step 'Invoke Gradle script' changed build result to FAILURE
Build step 'Invoke Gradle script' marked build as failure

---------------------------------------------------------------------
To unsubscribe, e-mail: builds-unsubscribe@beam.apache.org
For additional commands, e-mail: builds-help@beam.apache.org


Jenkins build is back to normal : beam_PostCommit_Java_DataflowV1 #3226

Posted by Apache Jenkins Server <je...@builds.apache.org>.
See <https://ci-beam.apache.org/job/beam_PostCommit_Java_DataflowV1/3226/display/redirect>


---------------------------------------------------------------------
To unsubscribe, e-mail: builds-unsubscribe@beam.apache.org
For additional commands, e-mail: builds-help@beam.apache.org


Build failed in Jenkins: beam_PostCommit_Java_DataflowV1 #3225

Posted by Apache Jenkins Server <je...@builds.apache.org>.
See <https://ci-beam.apache.org/job/beam_PostCommit_Java_DataflowV1/3225/display/redirect>

Changes:


------------------------------------------
[...truncated 21.41 KB...]
> Task :runners:direct-java:processTestResources NO-SOURCE
> Task :runners:google-cloud-dataflow-java:processResources
> Task :sdks:java:extensions:avro:generateTestAvroProtocol NO-SOURCE
> Task :sdks:java:core:processResources
> Task :runners:core-java:processTestResources NO-SOURCE
> Task :examples:java:processTestResources
> Task :sdks:java:extensions:google-cloud-platform-core:processTestResources NO-SOURCE
> Task :sdks:java:core:generateTestAvroProtocol NO-SOURCE
> Task :sdks:java:extensions:protobuf:extractTestProto
> Task :sdks:java:io:common:createCheckerFrameworkManifest
> Task :sdks:java:io:common:compileJava NO-SOURCE
> Task :sdks:java:io:common:processResources NO-SOURCE
> Task :sdks:java:io:common:classes UP-TO-DATE
> Task :sdks:java:extensions:protobuf:processTestResources
> Task :sdks:java:io:common:jar
> Task :sdks:java:testing:test-utils:createCheckerFrameworkManifest
> Task :sdks:java:io:common:processTestResources NO-SOURCE
> Task :sdks:java:testing:test-utils:processResources NO-SOURCE
> Task :sdks:java:testing:test-utils:processTestResources NO-SOURCE
> Task :sdks:java:transform-service:launcher:compileJava FROM-CACHE
> Task :sdks:java:transform-service:launcher:processResources
> Task :sdks:java:transform-service:launcher:classes
> Task :sdks:java:io:google-cloud-platform:processTestResources
> Task :runners:google-cloud-dataflow-java:copyGoogleCloudPlatformTestResources
> Task :sdks:java:transform-service:launcher:shadowJar FROM-CACHE
> Task :sdks:java:core:generateTestAvroJava
> Task :sdks:java:core:generateTestGrammarSource NO-SOURCE
> Task :sdks:java:extensions:avro:generateTestAvroJava
> Task :sdks:java:extensions:avro:processTestResources NO-SOURCE
> Task :sdks:java:core:processTestResources
> Task :runners:google-cloud-dataflow-java:worker:windmill:extractIncludeProto
> Task :runners:google-cloud-dataflow-java:worker:windmill:extractProto
> Task :runners:google-cloud-dataflow-java:worker:windmill:generateProto FROM-CACHE
> Task :model:pipeline:extractIncludeProto
> Task :model:pipeline:extractProto
> Task :model:pipeline:generateProto FROM-CACHE
> Task :runners:google-cloud-dataflow-java:worker:windmill:compileJava FROM-CACHE
> Task :runners:google-cloud-dataflow-java:worker:windmill:processResources
> Task :runners:google-cloud-dataflow-java:worker:windmill:classes
> Task :runners:google-cloud-dataflow-java:worker:windmill:shadowJar FROM-CACHE
> Task :model:pipeline:compileJava FROM-CACHE
> Task :model:pipeline:processResources
> Task :model:pipeline:classes
> Task :model:pipeline:jar
> Task :model:pipeline:shadowJar FROM-CACHE
> Task :model:job-management:extractIncludeProto
> Task :model:job-management:generateProto FROM-CACHE
> Task :model:fn-execution:extractIncludeProto
> Task :model:fn-execution:generateProto FROM-CACHE
> Task :model:fn-execution:compileJava FROM-CACHE
> Task :model:fn-execution:classes
> Task :model:job-management:compileJava FROM-CACHE
> Task :model:job-management:classes
> Task :model:job-management:shadowJar FROM-CACHE
> Task :model:fn-execution:shadowJar FROM-CACHE
> Task :sdks:java:core:compileJava FROM-CACHE
> Task :sdks:java:core:classes
> Task :sdks:java:core:shadowJar FROM-CACHE
> Task :sdks:java:extensions:avro:compileJava FROM-CACHE
> Task :sdks:java:extensions:avro:classes UP-TO-DATE
> Task :runners:local-java:compileJava FROM-CACHE
> Task :runners:local-java:classes UP-TO-DATE
> Task :runners:local-java:jar
> Task :sdks:java:testing:test-utils:compileJava FROM-CACHE
> Task :sdks:java:testing:test-utils:classes UP-TO-DATE
> Task :sdks:java:io:common:compileTestJava FROM-CACHE
> Task :sdks:java:io:common:testClasses UP-TO-DATE
> Task :sdks:java:testing:test-utils:jar
> Task :sdks:java:io:common:testJar
> Task :sdks:java:extensions:avro:jar
> Task :sdks:java:testing:test-utils:compileTestJava FROM-CACHE
> Task :sdks:java:testing:test-utils:testClasses UP-TO-DATE
> Task :sdks:java:testing:test-utils:testJar
> Task :sdks:java:extensions:arrow:compileJava FROM-CACHE
> Task :sdks:java:extensions:arrow:classes UP-TO-DATE
> Task :sdks:java:extensions:arrow:jar
> Task :sdks:java:fn-execution:compileJava FROM-CACHE
> Task :sdks:java:fn-execution:classes UP-TO-DATE
> Task :sdks:java:extensions:protobuf:extractIncludeProto
> Task :sdks:java:extensions:protobuf:generateProto NO-SOURCE
> Task :sdks:java:fn-execution:jar
> Task :sdks:java:extensions:protobuf:compileJava FROM-CACHE
> Task :sdks:java:extensions:protobuf:classes UP-TO-DATE
> Task :sdks:java:extensions:protobuf:jar
> Task :runners:core-construction-java:compileJava FROM-CACHE
> Task :runners:core-construction-java:classes UP-TO-DATE
> Task :runners:core-construction-java:jar
> Task :sdks:java:core:compileTestJava FROM-CACHE
> Task :sdks:java:core:testClasses
> Task :runners:core-java:compileJava FROM-CACHE
> Task :runners:core-java:classes UP-TO-DATE
> Task :sdks:java:core:shadowTestJar FROM-CACHE
> Task :sdks:java:extensions:python:compileJava FROM-CACHE
> Task :sdks:java:extensions:python:classes
> Task :sdks:java:extensions:python:jar
> Task :runners:core-java:jar
> Task :sdks:java:extensions:avro:compileTestJava FROM-CACHE
> Task :sdks:java:extensions:avro:testClasses UP-TO-DATE
> Task :sdks:java:extensions:google-cloud-platform-core:compileJava FROM-CACHE
> Task :sdks:java:extensions:google-cloud-platform-core:classes UP-TO-DATE
> Task :sdks:java:harness:compileJava FROM-CACHE
> Task :sdks:java:harness:classes UP-TO-DATE
> Task :sdks:java:extensions:avro:testJar
> Task :runners:core-java:compileTestJava FROM-CACHE
> Task :runners:core-java:testClasses UP-TO-DATE
> Task :sdks:java:extensions:google-cloud-platform-core:jar
> Task :sdks:java:harness:jar
> Task :runners:core-java:testJar
> Task :sdks:java:extensions:google-cloud-platform-core:compileTestJava FROM-CACHE
> Task :sdks:java:extensions:google-cloud-platform-core:testClasses UP-TO-DATE
> Task :sdks:java:extensions:google-cloud-platform-core:testJar
> Task :runners:java-fn-execution:compileJava FROM-CACHE
> Task :runners:java-fn-execution:classes UP-TO-DATE
> Task :runners:java-fn-execution:jar
> Task :sdks:java:expansion-service:compileJava FROM-CACHE
> Task :sdks:java:expansion-service:classes UP-TO-DATE
> Task :sdks:java:expansion-service:jar
> Task :runners:direct-java:compileJava FROM-CACHE
> Task :runners:direct-java:classes UP-TO-DATE
> Task :sdks:java:harness:shadowJar FROM-CACHE
> Task :sdks:java:extensions:ml:compileJava FROM-CACHE
> Task :sdks:java:extensions:ml:classes UP-TO-DATE
> Task :runners:direct-java:shadowJar FROM-CACHE
> Task :sdks:java:extensions:ml:jar
> Task :sdks:java:io:kafka:compileJava FROM-CACHE
> Task :sdks:java:io:kafka:classes UP-TO-DATE
> Task :sdks:java:io:kafka:jar
> Task :runners:direct-java:compileTestJava FROM-CACHE
> Task :runners:direct-java:testClasses UP-TO-DATE
> Task :sdks:java:extensions:protobuf:extractIncludeTestProto
> Task :sdks:java:extensions:protobuf:generateTestProto FROM-CACHE
> Task :sdks:java:extensions:protobuf:compileTestJava FROM-CACHE
> Task :sdks:java:extensions:protobuf:testClasses
> Task :runners:direct-java:shadowTestJar FROM-CACHE
> Task :sdks:java:io:google-cloud-platform:compileJava FROM-CACHE
> Task :sdks:java:io:google-cloud-platform:classes UP-TO-DATE
> Task :sdks:java:extensions:protobuf:testJar
> Task :sdks:java:io:google-cloud-platform:jar
> Task :runners:google-cloud-dataflow-java:compileJava FROM-CACHE
> Task :runners:google-cloud-dataflow-java:classes
> Task :runners:google-cloud-dataflow-java:jar
> Task :examples:java:compileJava FROM-CACHE
> Task :examples:java:classes UP-TO-DATE
> Task :examples:java:jar
> Task :runners:google-cloud-dataflow-java:worker:compileJava FROM-CACHE
> Task :runners:google-cloud-dataflow-java:worker:classes
> Task :examples:java:compileTestJava FROM-CACHE
> Task :examples:java:testClasses
> Task :examples:java:testJar
> Task :sdks:java:io:google-cloud-platform:compileTestJava FROM-CACHE
> Task :sdks:java:io:google-cloud-platform:testClasses
> Task :runners:google-cloud-dataflow-java:worker:shadowJar FROM-CACHE
> Task :runners:google-cloud-dataflow-java:coreSDKJavaLegacyWorkerIntegrationTest NO-SOURCE
> Task :sdks:java:io:google-cloud-platform:testJar
> Task :runners:google-cloud-dataflow-java:examplesJavaLegacyWorkerIntegrationTest

***********************************************************
***********************************************************
*************************Tear Down*************************
The Pub/Sub topic has been deleted: projects/apache-beam-testing/topics/testpipeline-jenkins-0627182020-1133fbfd
The Pub/Sub subscription has been deleted: projects/apache-beam-testing/subscriptions/testpipeline-jenkins-0627182020-1133fbfd
***********************************************************
***********************************************************

***********************************************************
***********************************************************
**********************Set Up Pubsub************************
The Pub/Sub topic has been set up for this example: projects/apache-beam-testing/topics/testpipeline-jenkins-0627182544-1c5dfdcf
The Pub/Sub subscription has been set up for this example: projects/apache-beam-testing/subscriptions/testpipeline-jenkins-0627182544-1c5dfdcf
*************************Tear Down*************************
The Pub/Sub topic has been deleted: projects/apache-beam-testing/topics/testpipeline-jenkins-0627182544-1c5dfdcf
The Pub/Sub subscription has been deleted: projects/apache-beam-testing/subscriptions/testpipeline-jenkins-0627182544-1c5dfdcf
***********************************************************
***********************************************************

***********************************************************
***********************************************************
**********************Set Up Pubsub************************
The Pub/Sub topic has been set up for this example: projects/apache-beam-testing/topics/testpipeline-jenkins-0627182023-64c38735
The Pub/Sub subscription has been set up for this example: projects/apache-beam-testing/subscriptions/testpipeline-jenkins-0627182023-64c38735
*************************Tear Down*************************
The Pub/Sub topic has been deleted: projects/apache-beam-testing/topics/testpipeline-jenkins-0627182023-64c38735
The Pub/Sub subscription has been deleted: projects/apache-beam-testing/subscriptions/testpipeline-jenkins-0627182023-64c38735
***********************************************************
***********************************************************
Could not store entry a396e3e1114466afdb66342e60dd71b4 in remote build cache: Storing entry at 'https://beam-cache.apache.org/cache/a396e3e1114466afdb66342e60dd71b4' response status 403: Forbidden

> Task :runners:google-cloud-dataflow-java:googleCloudPlatformLegacyWorkerIntegrationTest

org.apache.beam.sdk.io.gcp.firestore.it.FirestoreV1IT > batchWrite_partialFailureOutputsToDeadLetterQueue FAILED
    java.util.concurrent.ExecutionException at FirestoreV1IT.java:96
        Caused by: com.google.api.gax.rpc.InvalidArgumentException at ApiExceptionFactory.java:92
            Caused by: io.grpc.StatusRuntimeException at Status.java:539

org.apache.beam.sdk.io.gcp.firestore.it.FirestoreV1IT > batchGet FAILED
    java.util.concurrent.ExecutionException at AbstractFuture.java:588
        Caused by: com.google.api.gax.rpc.InvalidArgumentException at ApiExceptionFactory.java:92
            Caused by: io.grpc.StatusRuntimeException at Status.java:539

org.apache.beam.sdk.io.gcp.firestore.it.FirestoreV1IT > partitionQuery FAILED
    java.util.concurrent.ExecutionException at AbstractFuture.java:588
        Caused by: com.google.api.gax.rpc.InvalidArgumentException at ApiExceptionFactory.java:92
            Caused by: io.grpc.StatusRuntimeException at Status.java:539

org.apache.beam.sdk.io.gcp.firestore.it.FirestoreV1IT > listCollections FAILED
    java.util.concurrent.ExecutionException at AbstractFuture.java:588
        Caused by: com.google.api.gax.rpc.InvalidArgumentException at ApiExceptionFactory.java:92
            Caused by: io.grpc.StatusRuntimeException at Status.java:539

org.apache.beam.sdk.io.gcp.firestore.it.FirestoreV1IT > write FAILED
    java.lang.RuntimeException at TestDataflowRunner.java:141

org.apache.beam.sdk.io.gcp.firestore.it.FirestoreV1IT > runQuery FAILED
    java.util.concurrent.ExecutionException at AbstractFuture.java:588
        Caused by: com.google.api.gax.rpc.InvalidArgumentException at ApiExceptionFactory.java:92
            Caused by: io.grpc.StatusRuntimeException at Status.java:539

105 tests completed, 6 failed, 3 skipped

> Task :runners:google-cloud-dataflow-java:googleCloudPlatformLegacyWorkerIntegrationTest FAILED
> Task :runners:google-cloud-dataflow-java:googleCloudPlatformLegacyWorkerKmsIntegrationTest

FAILURE: Build failed with an exception.

* What went wrong:
Execution failed for task ':runners:google-cloud-dataflow-java:googleCloudPlatformLegacyWorkerIntegrationTest'.
> There were failing tests. See the report at: file://<https://ci-beam.apache.org/job/beam_PostCommit_Java_DataflowV1/ws/src/runners/google-cloud-dataflow-java/build/reports/tests/googleCloudPlatformLegacyWorkerIntegrationTest/index.html>

* Try:
> Run with --stacktrace option to get the stack trace.
> Run with --info or --debug option to get more log output.

* Get more help at https://help.gradle.org

Deprecated Gradle features were used in this build, making it incompatible with Gradle 8.0.

You can use '--warning-mode all' to show the individual deprecation warnings and determine if they come from your own scripts or plugins.

See https://docs.gradle.org/7.5.1/userguide/command_line_interface.html#sec:command_line_warnings

BUILD FAILED in 2h 52m 48s
149 actionable tasks: 90 executed, 57 from cache, 2 up-to-date

Publishing build scan...
https://ge.apache.org/s/fdup5vejcclbg

The remote build cache was disabled during the build due to errors.
Build step 'Invoke Gradle script' changed build result to FAILURE
Build step 'Invoke Gradle script' marked build as failure

---------------------------------------------------------------------
To unsubscribe, e-mail: builds-unsubscribe@beam.apache.org
For additional commands, e-mail: builds-help@beam.apache.org


Build failed in Jenkins: beam_PostCommit_Java_DataflowV1 #3224

Posted by Apache Jenkins Server <je...@builds.apache.org>.
See <https://ci-beam.apache.org/job/beam_PostCommit_Java_DataflowV1/3224/display/redirect?page=changes>

Changes:

[noreply] [#22737] Add line about timer support for Go (#27263)


------------------------------------------
[...truncated 13.03 KB...]
> Task :sdks:java:harness:createCheckerFrameworkManifest
> Task :sdks:java:extensions:google-cloud-platform-core:createCheckerFrameworkManifest
> Task :sdks:java:harness:processResources NO-SOURCE
> Task :sdks:java:expansion-service:createCheckerFrameworkManifest
> Task :runners:java-fn-execution:processResources NO-SOURCE
> Task :sdks:java:extensions:google-cloud-platform-core:processResources NO-SOURCE
> Task :model:job-management:processResources
> Task :model:fn-execution:processResources
> Task :sdks:java:extensions:arrow:createCheckerFrameworkManifest
> Task :sdks:java:core:generateGrammarSource FROM-CACHE
> Task :sdks:java:expansion-service:processResources NO-SOURCE
> Task :sdks:java:extensions:arrow:processResources NO-SOURCE
> Task :sdks:java:io:google-cloud-platform:createCheckerFrameworkManifest
> Task :sdks:java:extensions:protobuf:createCheckerFrameworkManifest
> Task :runners:google-cloud-dataflow-java:worker:createCheckerFrameworkManifest
> Task :runners:google-cloud-dataflow-java:worker:windmill:createCheckerFrameworkManifest
> Task :sdks:java:io:kafka:createCheckerFrameworkManifest
> Task :sdks:java:io:google-cloud-platform:processResources NO-SOURCE
> Task :sdks:java:io:kafka:processResources NO-SOURCE
> Task :sdks:java:extensions:protobuf:extractProto
> Task :sdks:java:extensions:protobuf:processResources NO-SOURCE
> Task :runners:google-cloud-dataflow-java:worker:processResources
> Task :sdks:java:extensions:ml:createCheckerFrameworkManifest
> Task :examples:java:createCheckerFrameworkManifest
> Task :examples:java:processResources NO-SOURCE
> Task :sdks:java:extensions:ml:processResources NO-SOURCE
> Task :sdks:java:extensions:python:createCheckerFrameworkManifest
> Task :sdks:java:transform-service:launcher:createCheckerFrameworkManifest
> Task :runners:direct-java:createCheckerFrameworkManifest
> Task :runners:local-java:createCheckerFrameworkManifest
> Task :runners:local-java:processResources NO-SOURCE
> Task :runners:direct-java:processResources NO-SOURCE
> Task :runners:core-java:processTestResources NO-SOURCE
> Task :runners:direct-java:processTestResources NO-SOURCE
> Task :sdks:java:extensions:python:processResources
> Task :examples:java:processTestResources
> Task :sdks:java:extensions:avro:generateTestAvroProtocol NO-SOURCE
> Task :sdks:java:extensions:google-cloud-platform-core:processTestResources NO-SOURCE
> Task :sdks:java:extensions:protobuf:extractTestProto
> Task :sdks:java:io:common:createCheckerFrameworkManifest
> Task :runners:google-cloud-dataflow-java:processResources
> Task :sdks:java:core:processResources
> Task :sdks:java:core:generateTestAvroProtocol NO-SOURCE
> Task :sdks:java:io:common:compileJava NO-SOURCE
> Task :sdks:java:io:common:processResources NO-SOURCE
> Task :sdks:java:io:common:classes UP-TO-DATE
> Task :sdks:java:extensions:protobuf:processTestResources
> Task :sdks:java:io:common:jar
> Task :sdks:java:io:common:processTestResources NO-SOURCE
> Task :sdks:java:testing:test-utils:createCheckerFrameworkManifest
> Task :sdks:java:testing:test-utils:processResources NO-SOURCE
> Task :sdks:java:testing:test-utils:processTestResources NO-SOURCE
> Task :sdks:java:transform-service:launcher:compileJava FROM-CACHE
> Task :sdks:java:transform-service:launcher:processResources
> Task :sdks:java:transform-service:launcher:classes
> Task :sdks:java:io:google-cloud-platform:processTestResources
> Task :runners:google-cloud-dataflow-java:copyGoogleCloudPlatformTestResources
> Task :sdks:java:transform-service:launcher:shadowJar FROM-CACHE
> Task :sdks:java:core:generateTestAvroJava
> Task :sdks:java:extensions:avro:generateTestAvroJava
> Task :sdks:java:core:generateTestGrammarSource NO-SOURCE
> Task :sdks:java:extensions:avro:processTestResources NO-SOURCE
> Task :sdks:java:core:processTestResources
> Task :runners:google-cloud-dataflow-java:worker:windmill:extractIncludeProto
> Task :model:pipeline:extractIncludeProto
> Task :runners:google-cloud-dataflow-java:worker:windmill:extractProto
> Task :model:pipeline:extractProto
> Task :runners:google-cloud-dataflow-java:worker:windmill:generateProto FROM-CACHE
> Task :model:pipeline:generateProto FROM-CACHE
> Task :runners:google-cloud-dataflow-java:worker:windmill:compileJava FROM-CACHE
> Task :runners:google-cloud-dataflow-java:worker:windmill:processResources
> Task :runners:google-cloud-dataflow-java:worker:windmill:classes
> Task :runners:google-cloud-dataflow-java:worker:windmill:shadowJar FROM-CACHE
> Task :model:pipeline:compileJava FROM-CACHE
> Task :model:pipeline:processResources
> Task :model:pipeline:classes
> Task :model:pipeline:jar
> Task :model:pipeline:shadowJar FROM-CACHE
> Task :model:job-management:extractIncludeProto
> Task :model:fn-execution:extractIncludeProto
> Task :model:job-management:generateProto FROM-CACHE
> Task :model:fn-execution:generateProto FROM-CACHE
> Task :model:job-management:compileJava FROM-CACHE
> Task :model:job-management:classes
> Task :model:fn-execution:compileJava FROM-CACHE
> Task :model:fn-execution:classes
> Task :model:job-management:shadowJar FROM-CACHE
> Task :model:fn-execution:shadowJar FROM-CACHE
> Task :sdks:java:core:compileJava FROM-CACHE
> Task :sdks:java:core:classes
> Task :sdks:java:core:shadowJar FROM-CACHE
> Task :runners:local-java:compileJava FROM-CACHE
> Task :runners:local-java:classes UP-TO-DATE
> Task :runners:local-java:jar
> Task :sdks:java:testing:test-utils:compileJava FROM-CACHE
> Task :sdks:java:testing:test-utils:classes UP-TO-DATE
> Task :sdks:java:extensions:avro:compileJava FROM-CACHE
> Task :sdks:java:extensions:avro:classes UP-TO-DATE
> Task :sdks:java:testing:test-utils:jar
> Task :sdks:java:io:common:compileTestJava FROM-CACHE
> Task :sdks:java:io:common:testClasses UP-TO-DATE
> Task :sdks:java:io:common:testJar
> Task :sdks:java:testing:test-utils:compileTestJava FROM-CACHE
> Task :sdks:java:testing:test-utils:testClasses UP-TO-DATE
> Task :sdks:java:extensions:avro:jar
> Task :sdks:java:testing:test-utils:testJar
> Task :sdks:java:extensions:arrow:compileJava FROM-CACHE
> Task :sdks:java:extensions:arrow:classes UP-TO-DATE
> Task :sdks:java:extensions:arrow:jar
> Task :sdks:java:fn-execution:compileJava FROM-CACHE
> Task :sdks:java:fn-execution:classes UP-TO-DATE
> Task :sdks:java:fn-execution:jar
> Task :sdks:java:extensions:protobuf:extractIncludeProto
> Task :sdks:java:extensions:protobuf:generateProto NO-SOURCE
> Task :runners:core-construction-java:compileJava FROM-CACHE
> Task :runners:core-construction-java:classes UP-TO-DATE
> Task :sdks:java:extensions:protobuf:compileJava FROM-CACHE
> Task :sdks:java:extensions:protobuf:classes UP-TO-DATE
> Task :sdks:java:extensions:protobuf:jar
> Task :runners:core-construction-java:jar
> Task :runners:core-java:compileJava FROM-CACHE
> Task :runners:core-java:classes UP-TO-DATE
> Task :sdks:java:core:compileTestJava FROM-CACHE
> Task :sdks:java:core:testClasses
> Task :sdks:java:extensions:python:compileJava FROM-CACHE
> Task :sdks:java:extensions:python:classes
> Task :sdks:java:extensions:python:jar
> Task :runners:core-java:jar
> Task :sdks:java:core:shadowTestJar FROM-CACHE
> Task :sdks:java:extensions:google-cloud-platform-core:compileJava FROM-CACHE
> Task :sdks:java:extensions:google-cloud-platform-core:classes UP-TO-DATE
> Task :sdks:java:harness:compileJava FROM-CACHE
> Task :sdks:java:harness:classes UP-TO-DATE
> Task :sdks:java:extensions:google-cloud-platform-core:jar
> Task :sdks:java:harness:jar
> Task :runners:java-fn-execution:compileJava FROM-CACHE
> Task :runners:java-fn-execution:classes UP-TO-DATE
> Task :runners:java-fn-execution:jar
> Task :sdks:java:extensions:avro:compileTestJava FROM-CACHE
> Task :sdks:java:extensions:avro:testClasses UP-TO-DATE
> Task :sdks:java:expansion-service:compileJava FROM-CACHE
> Task :sdks:java:expansion-service:classes UP-TO-DATE
> Task :sdks:java:expansion-service:jar
> Task :sdks:java:extensions:avro:testJar
> Task :sdks:java:extensions:google-cloud-platform-core:compileTestJava FROM-CACHE
> Task :sdks:java:extensions:google-cloud-platform-core:testClasses UP-TO-DATE
> Task :sdks:java:extensions:google-cloud-platform-core:testJar
> Task :runners:direct-java:compileJava FROM-CACHE
> Task :runners:direct-java:classes UP-TO-DATE
> Task :runners:core-java:compileTestJava FROM-CACHE
> Task :runners:core-java:testClasses UP-TO-DATE
> Task :runners:core-java:testJar
> Task :runners:direct-java:shadowJar FROM-CACHE
> Task :sdks:java:extensions:ml:compileJava FROM-CACHE
> Task :sdks:java:extensions:ml:classes UP-TO-DATE
> Task :sdks:java:harness:shadowJar FROM-CACHE
> Task :sdks:java:io:kafka:compileJava FROM-CACHE
> Task :sdks:java:io:kafka:classes UP-TO-DATE
> Task :sdks:java:extensions:ml:jar
> Task :sdks:java:io:kafka:jar
> Task :runners:direct-java:compileTestJava FROM-CACHE
> Task :runners:direct-java:testClasses UP-TO-DATE
> Task :runners:direct-java:shadowTestJar FROM-CACHE
> Task :sdks:java:io:google-cloud-platform:compileJava FROM-CACHE
> Task :sdks:java:io:google-cloud-platform:classes UP-TO-DATE
> Task :sdks:java:extensions:protobuf:extractIncludeTestProto
> Task :sdks:java:extensions:protobuf:generateTestProto FROM-CACHE
> Task :sdks:java:io:google-cloud-platform:jar
> Task :sdks:java:extensions:protobuf:compileTestJava FROM-CACHE
> Task :sdks:java:extensions:protobuf:testClasses
> Task :runners:google-cloud-dataflow-java:compileJava FROM-CACHE
> Task :runners:google-cloud-dataflow-java:classes
> Task :examples:java:compileJava FROM-CACHE
> Task :examples:java:classes UP-TO-DATE
> Task :sdks:java:extensions:protobuf:testJar
> Task :runners:google-cloud-dataflow-java:jar
> Task :examples:java:jar
> Task :examples:java:compileTestJava FROM-CACHE
> Task :examples:java:testClasses
> Task :examples:java:testJar
> Task :runners:google-cloud-dataflow-java:worker:compileJava FROM-CACHE
> Task :runners:google-cloud-dataflow-java:worker:classes
> Task :sdks:java:io:google-cloud-platform:compileTestJava FROM-CACHE
> Task :sdks:java:io:google-cloud-platform:testClasses
> Task :runners:google-cloud-dataflow-java:worker:shadowJar FROM-CACHE
> Task :runners:google-cloud-dataflow-java:coreSDKJavaLegacyWorkerIntegrationTest NO-SOURCE
> Task :sdks:java:io:google-cloud-platform:testJar
> Task :runners:google-cloud-dataflow-java:examplesJavaLegacyWorkerIntegrationTest FROM-CACHE
> Task :runners:google-cloud-dataflow-java:googleCloudPlatformLegacyWorkerIntegrationTest

org.apache.beam.sdk.io.gcp.firestore.it.FirestoreV1IT > batchWrite_partialFailureOutputsToDeadLetterQueue FAILED
    java.util.concurrent.ExecutionException at FirestoreV1IT.java:96
        Caused by: com.google.api.gax.rpc.InvalidArgumentException at ApiExceptionFactory.java:92
            Caused by: io.grpc.StatusRuntimeException at Status.java:539

org.apache.beam.sdk.io.gcp.firestore.it.FirestoreV1IT > batchGet FAILED
    java.util.concurrent.ExecutionException at AbstractFuture.java:588
        Caused by: com.google.api.gax.rpc.InvalidArgumentException at ApiExceptionFactory.java:92
            Caused by: io.grpc.StatusRuntimeException at Status.java:539

org.apache.beam.sdk.io.gcp.firestore.it.FirestoreV1IT > partitionQuery FAILED
    java.util.concurrent.ExecutionException at AbstractFuture.java:588
        Caused by: com.google.api.gax.rpc.InvalidArgumentException at ApiExceptionFactory.java:92
            Caused by: io.grpc.StatusRuntimeException at Status.java:539

org.apache.beam.sdk.io.gcp.firestore.it.FirestoreV1IT > listCollections FAILED
    java.util.concurrent.ExecutionException at AbstractFuture.java:588
        Caused by: com.google.api.gax.rpc.InvalidArgumentException at ApiExceptionFactory.java:92
            Caused by: io.grpc.StatusRuntimeException at Status.java:539

org.apache.beam.sdk.io.gcp.firestore.it.FirestoreV1IT > write FAILED
    java.lang.RuntimeException at TestDataflowRunner.java:141

org.apache.beam.sdk.io.gcp.firestore.it.FirestoreV1IT > runQuery FAILED
    java.util.concurrent.ExecutionException at AbstractFuture.java:588
        Caused by: com.google.api.gax.rpc.InvalidArgumentException at ApiExceptionFactory.java:92
            Caused by: io.grpc.StatusRuntimeException at Status.java:539

105 tests completed, 6 failed, 3 skipped

> Task :runners:google-cloud-dataflow-java:googleCloudPlatformLegacyWorkerIntegrationTest FAILED
> Task :runners:google-cloud-dataflow-java:googleCloudPlatformLegacyWorkerKmsIntegrationTest FROM-CACHE

FAILURE: Build failed with an exception.

* What went wrong:
Execution failed for task ':runners:google-cloud-dataflow-java:googleCloudPlatformLegacyWorkerIntegrationTest'.
> There were failing tests. See the report at: file://<https://ci-beam.apache.org/job/beam_PostCommit_Java_DataflowV1/ws/src/runners/google-cloud-dataflow-java/build/reports/tests/googleCloudPlatformLegacyWorkerIntegrationTest/index.html>

* Try:
> Run with --stacktrace option to get the stack trace.
> Run with --info or --debug option to get more log output.

* Get more help at https://help.gradle.org

Deprecated Gradle features were used in this build, making it incompatible with Gradle 8.0.

You can use '--warning-mode all' to show the individual deprecation warnings and determine if they come from your own scripts or plugins.

See https://docs.gradle.org/7.5.1/userguide/command_line_interface.html#sec:command_line_warnings

BUILD FAILED in 2h 23m 6s
149 actionable tasks: 88 executed, 59 from cache, 2 up-to-date

Publishing build scan...
https://ge.apache.org/s/xpan5lbka2bjk

Build step 'Invoke Gradle script' changed build result to FAILURE
Build step 'Invoke Gradle script' marked build as failure

---------------------------------------------------------------------
To unsubscribe, e-mail: builds-unsubscribe@beam.apache.org
For additional commands, e-mail: builds-help@beam.apache.org


Build failed in Jenkins: beam_PostCommit_Java_DataflowV1 #3223

Posted by Apache Jenkins Server <je...@builds.apache.org>.
See <https://ci-beam.apache.org/job/beam_PostCommit_Java_DataflowV1/3223/display/redirect>

Changes:


------------------------------------------
[...truncated 13.01 KB...]
> Task :sdks:java:extensions:google-cloud-platform-core:createCheckerFrameworkManifest
> Task :runners:java-fn-execution:createCheckerFrameworkManifest
> Task :sdks:java:harness:processResources NO-SOURCE
> Task :runners:java-fn-execution:processResources NO-SOURCE
> Task :sdks:java:extensions:google-cloud-platform-core:processResources NO-SOURCE
> Task :sdks:java:core:generateGrammarSource FROM-CACHE
> Task :model:job-management:processResources
> Task :sdks:java:expansion-service:createCheckerFrameworkManifest
> Task :model:fn-execution:processResources
> Task :sdks:java:extensions:arrow:createCheckerFrameworkManifest
> Task :sdks:java:expansion-service:processResources NO-SOURCE
> Task :sdks:java:extensions:protobuf:createCheckerFrameworkManifest
> Task :sdks:java:io:kafka:createCheckerFrameworkManifest
> Task :sdks:java:io:google-cloud-platform:createCheckerFrameworkManifest
> Task :sdks:java:io:kafka:processResources NO-SOURCE
> Task :sdks:java:extensions:protobuf:extractProto
> Task :sdks:java:extensions:protobuf:processResources NO-SOURCE
> Task :runners:google-cloud-dataflow-java:worker:createCheckerFrameworkManifest
> Task :sdks:java:io:google-cloud-platform:processResources NO-SOURCE
> Task :sdks:java:extensions:arrow:processResources NO-SOURCE
> Task :runners:google-cloud-dataflow-java:worker:windmill:createCheckerFrameworkManifest
> Task :sdks:java:extensions:ml:createCheckerFrameworkManifest
> Task :examples:java:createCheckerFrameworkManifest
> Task :runners:google-cloud-dataflow-java:worker:processResources
> Task :sdks:java:extensions:ml:processResources NO-SOURCE
> Task :examples:java:processResources NO-SOURCE
> Task :runners:direct-java:createCheckerFrameworkManifest
> Task :sdks:java:transform-service:launcher:createCheckerFrameworkManifest
> Task :sdks:java:extensions:python:createCheckerFrameworkManifest
> Task :runners:local-java:createCheckerFrameworkManifest
> Task :runners:direct-java:processResources NO-SOURCE
> Task :runners:local-java:processResources NO-SOURCE
> Task :runners:core-java:processTestResources NO-SOURCE
> Task :runners:direct-java:processTestResources NO-SOURCE
> Task :sdks:java:core:processResources
> Task :sdks:java:extensions:python:processResources
> Task :examples:java:processTestResources
> Task :sdks:java:core:generateTestAvroProtocol NO-SOURCE
> Task :sdks:java:extensions:avro:generateTestAvroProtocol NO-SOURCE
> Task :sdks:java:extensions:google-cloud-platform-core:processTestResources NO-SOURCE
> Task :runners:google-cloud-dataflow-java:processResources
> Task :sdks:java:extensions:protobuf:extractTestProto
> Task :sdks:java:io:common:createCheckerFrameworkManifest
> Task :sdks:java:io:common:compileJava NO-SOURCE
> Task :sdks:java:io:common:processResources NO-SOURCE
> Task :sdks:java:io:common:classes UP-TO-DATE
> Task :sdks:java:extensions:protobuf:processTestResources
> Task :sdks:java:io:common:jar
> Task :sdks:java:io:common:processTestResources NO-SOURCE
> Task :sdks:java:testing:test-utils:createCheckerFrameworkManifest
> Task :sdks:java:testing:test-utils:processResources NO-SOURCE
> Task :sdks:java:testing:test-utils:processTestResources NO-SOURCE
> Task :sdks:java:transform-service:launcher:compileJava FROM-CACHE
> Task :sdks:java:transform-service:launcher:processResources
> Task :sdks:java:transform-service:launcher:classes
> Task :runners:google-cloud-dataflow-java:copyGoogleCloudPlatformTestResources
> Task :sdks:java:io:google-cloud-platform:processTestResources
> Task :sdks:java:transform-service:launcher:shadowJar FROM-CACHE
> Task :sdks:java:core:generateTestAvroJava
> Task :sdks:java:core:generateTestGrammarSource NO-SOURCE
> Task :sdks:java:extensions:avro:generateTestAvroJava
> Task :sdks:java:extensions:avro:processTestResources NO-SOURCE
> Task :sdks:java:core:processTestResources
> Task :model:pipeline:extractIncludeProto
> Task :runners:google-cloud-dataflow-java:worker:windmill:extractIncludeProto
> Task :model:pipeline:extractProto
> Task :runners:google-cloud-dataflow-java:worker:windmill:extractProto
> Task :runners:google-cloud-dataflow-java:worker:windmill:generateProto FROM-CACHE
> Task :model:pipeline:generateProto FROM-CACHE
> Task :runners:google-cloud-dataflow-java:worker:windmill:compileJava FROM-CACHE
> Task :runners:google-cloud-dataflow-java:worker:windmill:processResources
> Task :runners:google-cloud-dataflow-java:worker:windmill:classes
> Task :runners:google-cloud-dataflow-java:worker:windmill:shadowJar FROM-CACHE
> Task :model:pipeline:compileJava FROM-CACHE
> Task :model:pipeline:processResources
> Task :model:pipeline:classes
> Task :model:pipeline:jar
> Task :model:pipeline:shadowJar FROM-CACHE
> Task :model:job-management:extractIncludeProto
> Task :model:fn-execution:extractIncludeProto
> Task :model:job-management:generateProto FROM-CACHE
> Task :model:fn-execution:generateProto FROM-CACHE
> Task :model:job-management:compileJava FROM-CACHE
> Task :model:job-management:classes
> Task :model:fn-execution:compileJava FROM-CACHE
> Task :model:fn-execution:classes
> Task :model:fn-execution:shadowJar FROM-CACHE
> Task :model:job-management:shadowJar FROM-CACHE
> Task :sdks:java:core:compileJava FROM-CACHE
> Task :sdks:java:core:classes
> Task :sdks:java:core:shadowJar FROM-CACHE
> Task :runners:local-java:compileJava FROM-CACHE
> Task :runners:local-java:classes UP-TO-DATE
> Task :sdks:java:io:common:compileTestJava FROM-CACHE
> Task :sdks:java:io:common:testClasses UP-TO-DATE
> Task :runners:local-java:jar
> Task :sdks:java:io:common:testJar
> Task :sdks:java:testing:test-utils:compileJava FROM-CACHE
> Task :sdks:java:testing:test-utils:classes UP-TO-DATE
> Task :sdks:java:testing:test-utils:jar
> Task :sdks:java:extensions:arrow:compileJava FROM-CACHE
> Task :sdks:java:extensions:arrow:classes UP-TO-DATE
> Task :sdks:java:extensions:avro:compileJava FROM-CACHE
> Task :sdks:java:extensions:avro:classes UP-TO-DATE
> Task :sdks:java:testing:test-utils:compileTestJava FROM-CACHE
> Task :sdks:java:testing:test-utils:testClasses UP-TO-DATE
> Task :sdks:java:extensions:arrow:jar
> Task :sdks:java:testing:test-utils:testJar
> Task :sdks:java:extensions:avro:jar
> Task :sdks:java:fn-execution:compileJava FROM-CACHE
> Task :sdks:java:fn-execution:classes UP-TO-DATE
> Task :sdks:java:fn-execution:jar
> Task :runners:core-construction-java:compileJava FROM-CACHE
> Task :runners:core-construction-java:classes UP-TO-DATE
> Task :runners:core-construction-java:jar
> Task :sdks:java:extensions:protobuf:extractIncludeProto
> Task :sdks:java:extensions:protobuf:generateProto NO-SOURCE
> Task :sdks:java:extensions:protobuf:compileJava FROM-CACHE
> Task :sdks:java:extensions:protobuf:classes UP-TO-DATE
> Task :sdks:java:extensions:protobuf:jar
> Task :runners:core-java:compileJava FROM-CACHE
> Task :runners:core-java:classes UP-TO-DATE
> Task :sdks:java:extensions:python:compileJava FROM-CACHE
> Task :sdks:java:extensions:python:classes
> Task :sdks:java:extensions:python:jar
> Task :runners:core-java:jar
> Task :sdks:java:core:compileTestJava FROM-CACHE
> Task :sdks:java:core:testClasses
> Task :sdks:java:extensions:google-cloud-platform-core:compileJava FROM-CACHE
> Task :sdks:java:extensions:google-cloud-platform-core:classes UP-TO-DATE
> Task :sdks:java:harness:compileJava FROM-CACHE
> Task :sdks:java:harness:classes UP-TO-DATE
> Task :sdks:java:extensions:google-cloud-platform-core:jar
> Task :sdks:java:harness:jar
> Task :sdks:java:core:shadowTestJar FROM-CACHE
> Task :runners:java-fn-execution:compileJava FROM-CACHE
> Task :runners:java-fn-execution:classes UP-TO-DATE
> Task :runners:java-fn-execution:jar
> Task :sdks:java:expansion-service:compileJava FROM-CACHE
> Task :sdks:java:expansion-service:classes UP-TO-DATE
> Task :sdks:java:expansion-service:jar
> Task :runners:direct-java:compileJava FROM-CACHE
> Task :sdks:java:extensions:google-cloud-platform-core:compileTestJava FROM-CACHE
> Task :runners:direct-java:classes UP-TO-DATE
> Task :sdks:java:io:kafka:compileJava FROM-CACHE
> Task :sdks:java:io:kafka:classes UP-TO-DATE
> Task :sdks:java:harness:shadowJar FROM-CACHE
> Task :sdks:java:extensions:google-cloud-platform-core:testClasses UP-TO-DATE
> Task :sdks:java:extensions:avro:compileTestJava FROM-CACHE
> Task :sdks:java:extensions:avro:testClasses UP-TO-DATE
> Task :sdks:java:extensions:google-cloud-platform-core:testJar
> Task :sdks:java:extensions:ml:compileJava FROM-CACHE
> Task :sdks:java:extensions:ml:classes UP-TO-DATE
> Task :runners:direct-java:shadowJar FROM-CACHE
> Task :runners:core-java:compileTestJava FROM-CACHE
> Task :runners:core-java:testClasses UP-TO-DATE
> Task :sdks:java:io:kafka:jar
> Task :sdks:java:extensions:avro:testJar
> Task :sdks:java:extensions:ml:jar
> Task :runners:core-java:testJar
> Task :runners:direct-java:compileTestJava FROM-CACHE
> Task :runners:direct-java:testClasses UP-TO-DATE
> Task :sdks:java:io:google-cloud-platform:compileJava FROM-CACHE
> Task :sdks:java:io:google-cloud-platform:classes UP-TO-DATE
> Task :runners:direct-java:shadowTestJar FROM-CACHE
> Task :sdks:java:io:google-cloud-platform:jar
> Task :sdks:java:extensions:protobuf:extractIncludeTestProto
> Task :sdks:java:extensions:protobuf:generateTestProto FROM-CACHE
> Task :runners:google-cloud-dataflow-java:compileJava FROM-CACHE
> Task :runners:google-cloud-dataflow-java:classes
> Task :sdks:java:extensions:protobuf:compileTestJava FROM-CACHE
> Task :sdks:java:extensions:protobuf:testClasses
> Task :runners:google-cloud-dataflow-java:jar
> Task :examples:java:compileJava FROM-CACHE
> Task :examples:java:classes UP-TO-DATE
> Task :sdks:java:extensions:protobuf:testJar
> Task :examples:java:jar
> Task :runners:google-cloud-dataflow-java:worker:compileJava FROM-CACHE
> Task :runners:google-cloud-dataflow-java:worker:classes
> Task :examples:java:compileTestJava FROM-CACHE
> Task :examples:java:testClasses
> Task :examples:java:testJar
> Task :runners:google-cloud-dataflow-java:worker:shadowJar FROM-CACHE
> Task :runners:google-cloud-dataflow-java:coreSDKJavaLegacyWorkerIntegrationTest NO-SOURCE
> Task :sdks:java:io:google-cloud-platform:compileTestJava FROM-CACHE
> Task :sdks:java:io:google-cloud-platform:testClasses
> Task :sdks:java:io:google-cloud-platform:testJar
> Task :runners:google-cloud-dataflow-java:examplesJavaLegacyWorkerIntegrationTest FROM-CACHE
> Task :runners:google-cloud-dataflow-java:googleCloudPlatformLegacyWorkerIntegrationTest

org.apache.beam.sdk.io.gcp.firestore.it.FirestoreV1IT > batchWrite_partialFailureOutputsToDeadLetterQueue FAILED
    java.util.concurrent.ExecutionException at FirestoreV1IT.java:96
        Caused by: com.google.api.gax.rpc.InvalidArgumentException at ApiExceptionFactory.java:92
            Caused by: io.grpc.StatusRuntimeException at Status.java:539

org.apache.beam.sdk.io.gcp.firestore.it.FirestoreV1IT > batchGet FAILED
    java.util.concurrent.ExecutionException at AbstractFuture.java:588
        Caused by: com.google.api.gax.rpc.InvalidArgumentException at ApiExceptionFactory.java:92
            Caused by: io.grpc.StatusRuntimeException at Status.java:539

org.apache.beam.sdk.io.gcp.firestore.it.FirestoreV1IT > partitionQuery FAILED
    java.util.concurrent.ExecutionException at AbstractFuture.java:588
        Caused by: com.google.api.gax.rpc.InvalidArgumentException at ApiExceptionFactory.java:92
            Caused by: io.grpc.StatusRuntimeException at Status.java:539

org.apache.beam.sdk.io.gcp.firestore.it.FirestoreV1IT > listCollections FAILED
    java.util.concurrent.ExecutionException at AbstractFuture.java:588
        Caused by: com.google.api.gax.rpc.InvalidArgumentException at ApiExceptionFactory.java:92
            Caused by: io.grpc.StatusRuntimeException at Status.java:539

org.apache.beam.sdk.io.gcp.firestore.it.FirestoreV1IT > write FAILED
    java.lang.RuntimeException at TestDataflowRunner.java:141

org.apache.beam.sdk.io.gcp.firestore.it.FirestoreV1IT > runQuery FAILED
    java.util.concurrent.ExecutionException at AbstractFuture.java:588
        Caused by: com.google.api.gax.rpc.InvalidArgumentException at ApiExceptionFactory.java:92
            Caused by: io.grpc.StatusRuntimeException at Status.java:539

105 tests completed, 6 failed, 3 skipped

> Task :runners:google-cloud-dataflow-java:googleCloudPlatformLegacyWorkerIntegrationTest FAILED
> Task :runners:google-cloud-dataflow-java:googleCloudPlatformLegacyWorkerKmsIntegrationTest FROM-CACHE

FAILURE: Build failed with an exception.

* What went wrong:
Execution failed for task ':runners:google-cloud-dataflow-java:googleCloudPlatformLegacyWorkerIntegrationTest'.
> There were failing tests. See the report at: file://<https://ci-beam.apache.org/job/beam_PostCommit_Java_DataflowV1/ws/src/runners/google-cloud-dataflow-java/build/reports/tests/googleCloudPlatformLegacyWorkerIntegrationTest/index.html>

* Try:
> Run with --stacktrace option to get the stack trace.
> Run with --info or --debug option to get more log output.

* Get more help at https://help.gradle.org

Deprecated Gradle features were used in this build, making it incompatible with Gradle 8.0.

You can use '--warning-mode all' to show the individual deprecation warnings and determine if they come from your own scripts or plugins.

See https://docs.gradle.org/7.5.1/userguide/command_line_interface.html#sec:command_line_warnings

BUILD FAILED in 2h 11m 55s
149 actionable tasks: 88 executed, 59 from cache, 2 up-to-date

Publishing build scan...
https://ge.apache.org/s/7pjbtll256reo

Build step 'Invoke Gradle script' changed build result to FAILURE
Build step 'Invoke Gradle script' marked build as failure

---------------------------------------------------------------------
To unsubscribe, e-mail: builds-unsubscribe@beam.apache.org
For additional commands, e-mail: builds-help@beam.apache.org


Build failed in Jenkins: beam_PostCommit_Java_DataflowV1 #3222

Posted by Apache Jenkins Server <je...@builds.apache.org>.
See <https://ci-beam.apache.org/job/beam_PostCommit_Java_DataflowV1/3222/display/redirect>

Changes:


------------------------------------------
[...truncated 13.06 KB...]
> Task :runners:core-java:processResources NO-SOURCE
> Task :sdks:java:extensions:google-cloud-platform-core:createCheckerFrameworkManifest
> Task :sdks:java:harness:createCheckerFrameworkManifest
> Task :sdks:java:extensions:google-cloud-platform-core:processResources NO-SOURCE
> Task :sdks:java:harness:processResources NO-SOURCE
> Task :sdks:java:expansion-service:createCheckerFrameworkManifest
> Task :sdks:java:extensions:arrow:createCheckerFrameworkManifest
> Task :sdks:java:core:generateGrammarSource FROM-CACHE
> Task :sdks:java:expansion-service:processResources NO-SOURCE
> Task :model:job-management:processResources
> Task :sdks:java:extensions:arrow:processResources NO-SOURCE
> Task :model:fn-execution:processResources
> Task :sdks:java:io:kafka:createCheckerFrameworkManifest
> Task :sdks:java:io:google-cloud-platform:createCheckerFrameworkManifest
> Task :runners:google-cloud-dataflow-java:worker:createCheckerFrameworkManifest
> Task :sdks:java:io:google-cloud-platform:processResources NO-SOURCE
> Task :sdks:java:io:kafka:processResources NO-SOURCE
> Task :sdks:java:extensions:protobuf:createCheckerFrameworkManifest
> Task :runners:google-cloud-dataflow-java:worker:windmill:createCheckerFrameworkManifest
> Task :examples:java:createCheckerFrameworkManifest
> Task :sdks:java:extensions:ml:createCheckerFrameworkManifest
> Task :runners:google-cloud-dataflow-java:worker:processResources
> Task :sdks:java:extensions:protobuf:extractProto
> Task :sdks:java:extensions:ml:processResources NO-SOURCE
> Task :sdks:java:extensions:protobuf:processResources NO-SOURCE
> Task :examples:java:processResources NO-SOURCE
> Task :sdks:java:extensions:python:createCheckerFrameworkManifest
> Task :sdks:java:transform-service:launcher:createCheckerFrameworkManifest
> Task :runners:direct-java:createCheckerFrameworkManifest
> Task :runners:local-java:createCheckerFrameworkManifest
> Task :runners:direct-java:processResources NO-SOURCE
> Task :runners:local-java:processResources NO-SOURCE
> Task :runners:core-java:processTestResources NO-SOURCE
> Task :runners:direct-java:processTestResources NO-SOURCE
> Task :runners:google-cloud-dataflow-java:processResources
> Task :sdks:java:extensions:python:processResources
> Task :sdks:java:extensions:avro:generateTestAvroProtocol NO-SOURCE
> Task :sdks:java:extensions:google-cloud-platform-core:processTestResources NO-SOURCE
> Task :sdks:java:core:processResources
> Task :examples:java:processTestResources
> Task :sdks:java:core:generateTestAvroProtocol NO-SOURCE
> Task :sdks:java:extensions:protobuf:extractTestProto
> Task :sdks:java:io:common:createCheckerFrameworkManifest
> Task :sdks:java:io:common:compileJava NO-SOURCE
> Task :sdks:java:io:common:processResources NO-SOURCE
> Task :sdks:java:io:common:classes UP-TO-DATE
> Task :sdks:java:extensions:protobuf:processTestResources
> Task :sdks:java:io:common:jar
> Task :sdks:java:io:common:processTestResources NO-SOURCE
> Task :sdks:java:testing:test-utils:createCheckerFrameworkManifest
> Task :sdks:java:testing:test-utils:processResources NO-SOURCE
> Task :sdks:java:testing:test-utils:processTestResources NO-SOURCE
> Task :sdks:java:transform-service:launcher:compileJava FROM-CACHE
> Task :sdks:java:transform-service:launcher:processResources
> Task :sdks:java:transform-service:launcher:classes
> Task :runners:google-cloud-dataflow-java:copyGoogleCloudPlatformTestResources
> Task :sdks:java:io:google-cloud-platform:processTestResources
> Task :sdks:java:transform-service:launcher:shadowJar FROM-CACHE
> Task :sdks:java:core:generateTestAvroJava
> Task :sdks:java:extensions:avro:generateTestAvroJava
> Task :sdks:java:core:generateTestGrammarSource NO-SOURCE
> Task :sdks:java:extensions:avro:processTestResources NO-SOURCE
> Task :sdks:java:core:processTestResources
> Task :runners:google-cloud-dataflow-java:worker:windmill:extractIncludeProto
> Task :runners:google-cloud-dataflow-java:worker:windmill:extractProto
> Task :model:pipeline:extractIncludeProto
> Task :model:pipeline:extractProto
> Task :runners:google-cloud-dataflow-java:worker:windmill:generateProto FROM-CACHE
> Task :model:pipeline:generateProto FROM-CACHE
> Task :runners:google-cloud-dataflow-java:worker:windmill:compileJava FROM-CACHE
> Task :runners:google-cloud-dataflow-java:worker:windmill:processResources
> Task :runners:google-cloud-dataflow-java:worker:windmill:classes
> Task :runners:google-cloud-dataflow-java:worker:windmill:shadowJar FROM-CACHE
> Task :model:pipeline:compileJava FROM-CACHE
> Task :model:pipeline:processResources
> Task :model:pipeline:classes
> Task :model:pipeline:jar
> Task :model:pipeline:shadowJar FROM-CACHE
> Task :model:fn-execution:extractIncludeProto
> Task :model:job-management:extractIncludeProto
> Task :model:job-management:generateProto FROM-CACHE
> Task :model:fn-execution:generateProto FROM-CACHE
> Task :model:job-management:compileJava FROM-CACHE
> Task :model:job-management:classes
> Task :model:fn-execution:compileJava FROM-CACHE
> Task :model:fn-execution:classes
> Task :model:job-management:shadowJar FROM-CACHE
> Task :model:fn-execution:shadowJar FROM-CACHE
> Task :sdks:java:core:compileJava FROM-CACHE
> Task :sdks:java:core:classes
> Task :sdks:java:core:shadowJar FROM-CACHE
> Task :sdks:java:io:common:compileTestJava FROM-CACHE
> Task :sdks:java:io:common:testClasses UP-TO-DATE
> Task :runners:local-java:compileJava FROM-CACHE
> Task :runners:local-java:classes UP-TO-DATE
> Task :sdks:java:extensions:avro:compileJava FROM-CACHE
> Task :runners:local-java:jar
> Task :sdks:java:extensions:avro:classes UP-TO-DATE
> Task :sdks:java:testing:test-utils:compileJava FROM-CACHE
> Task :sdks:java:testing:test-utils:classes UP-TO-DATE
> Task :sdks:java:io:common:testJar
> Task :sdks:java:testing:test-utils:jar
> Task :sdks:java:extensions:arrow:compileJava FROM-CACHE
> Task :sdks:java:extensions:arrow:classes UP-TO-DATE
> Task :sdks:java:extensions:arrow:jar
> Task :sdks:java:extensions:avro:jar
> Task :sdks:java:testing:test-utils:compileTestJava FROM-CACHE
> Task :sdks:java:testing:test-utils:testClasses UP-TO-DATE
> Task :sdks:java:testing:test-utils:testJar
> Task :sdks:java:fn-execution:compileJava FROM-CACHE
> Task :sdks:java:fn-execution:classes UP-TO-DATE
> Task :sdks:java:fn-execution:jar
> Task :runners:core-construction-java:compileJava FROM-CACHE
> Task :sdks:java:extensions:protobuf:extractIncludeProto
> Task :runners:core-construction-java:classes UP-TO-DATE
> Task :sdks:java:extensions:protobuf:generateProto NO-SOURCE
> Task :sdks:java:extensions:protobuf:compileJava FROM-CACHE
> Task :sdks:java:extensions:protobuf:classes UP-TO-DATE
> Task :sdks:java:extensions:protobuf:jar
> Task :runners:core-construction-java:jar
> Task :runners:core-java:compileJava FROM-CACHE
> Task :runners:core-java:classes UP-TO-DATE
> Task :runners:core-java:jar
> Task :sdks:java:extensions:python:compileJava FROM-CACHE
> Task :sdks:java:extensions:python:classes
> Task :sdks:java:extensions:python:jar
> Task :sdks:java:core:compileTestJava FROM-CACHE
> Task :sdks:java:core:testClasses
> Task :sdks:java:extensions:google-cloud-platform-core:compileJava FROM-CACHE
> Task :sdks:java:extensions:google-cloud-platform-core:classes UP-TO-DATE
> Task :sdks:java:extensions:google-cloud-platform-core:jar
> Task :sdks:java:harness:compileJava FROM-CACHE
> Task :sdks:java:harness:classes UP-TO-DATE
> Task :sdks:java:harness:jar
> Task :sdks:java:core:shadowTestJar FROM-CACHE
> Task :runners:java-fn-execution:compileJava FROM-CACHE
> Task :runners:java-fn-execution:classes UP-TO-DATE
> Task :runners:java-fn-execution:jar
> Task :sdks:java:expansion-service:compileJava FROM-CACHE
> Task :sdks:java:expansion-service:classes UP-TO-DATE
> Task :sdks:java:expansion-service:jar
> Task :runners:direct-java:compileJava FROM-CACHE
> Task :sdks:java:extensions:google-cloud-platform-core:compileTestJava FROM-CACHE
> Task :runners:direct-java:classes UP-TO-DATE
> Task :sdks:java:extensions:avro:compileTestJava FROM-CACHE
> Task :sdks:java:extensions:avro:testClasses UP-TO-DATE
> Task :sdks:java:harness:shadowJar FROM-CACHE
> Task :sdks:java:extensions:google-cloud-platform-core:testClasses UP-TO-DATE
> Task :sdks:java:extensions:ml:compileJava FROM-CACHE
> Task :sdks:java:extensions:ml:classes UP-TO-DATE
> Task :sdks:java:io:kafka:compileJava FROM-CACHE
> Task :sdks:java:io:kafka:classes UP-TO-DATE
> Task :sdks:java:extensions:google-cloud-platform-core:testJar
> Task :sdks:java:extensions:avro:testJar
> Task :runners:direct-java:shadowJar FROM-CACHE
> Task :sdks:java:extensions:ml:jar
> Task :sdks:java:io:kafka:jar
> Task :runners:core-java:compileTestJava FROM-CACHE
> Task :runners:core-java:testClasses UP-TO-DATE
> Task :runners:core-java:testJar
> Task :runners:direct-java:compileTestJava FROM-CACHE
> Task :runners:direct-java:testClasses UP-TO-DATE
> Task :sdks:java:io:google-cloud-platform:compileJava FROM-CACHE
> Task :sdks:java:io:google-cloud-platform:classes UP-TO-DATE
> Task :runners:direct-java:shadowTestJar FROM-CACHE
> Task :sdks:java:io:google-cloud-platform:jar
> Task :sdks:java:extensions:protobuf:extractIncludeTestProto
> Task :sdks:java:extensions:protobuf:generateTestProto FROM-CACHE
> Task :runners:google-cloud-dataflow-java:compileJava FROM-CACHE
> Task :sdks:java:extensions:protobuf:compileTestJava FROM-CACHE
> Task :runners:google-cloud-dataflow-java:classes
> Task :sdks:java:extensions:protobuf:testClasses
> Task :examples:java:compileJava FROM-CACHE
> Task :examples:java:classes UP-TO-DATE
> Task :sdks:java:extensions:protobuf:testJar
> Task :runners:google-cloud-dataflow-java:jar
> Task :examples:java:jar
> Task :examples:java:compileTestJava FROM-CACHE
> Task :examples:java:testClasses
> Task :runners:google-cloud-dataflow-java:worker:compileJava FROM-CACHE
> Task :runners:google-cloud-dataflow-java:worker:classes
> Task :examples:java:testJar
> Task :sdks:java:io:google-cloud-platform:compileTestJava FROM-CACHE
> Task :sdks:java:io:google-cloud-platform:testClasses
> Task :runners:google-cloud-dataflow-java:worker:shadowJar FROM-CACHE
> Task :runners:google-cloud-dataflow-java:coreSDKJavaLegacyWorkerIntegrationTest NO-SOURCE
> Task :sdks:java:io:google-cloud-platform:testJar
> Task :runners:google-cloud-dataflow-java:examplesJavaLegacyWorkerIntegrationTest FROM-CACHE
> Task :runners:google-cloud-dataflow-java:googleCloudPlatformLegacyWorkerIntegrationTest

org.apache.beam.sdk.io.gcp.firestore.it.FirestoreV1IT > batchWrite_partialFailureOutputsToDeadLetterQueue FAILED
    java.util.concurrent.ExecutionException at FirestoreV1IT.java:96
        Caused by: com.google.api.gax.rpc.InvalidArgumentException at ApiExceptionFactory.java:92
            Caused by: io.grpc.StatusRuntimeException at Status.java:539

org.apache.beam.sdk.io.gcp.firestore.it.FirestoreV1IT > batchGet FAILED
    java.util.concurrent.ExecutionException at AbstractFuture.java:588
        Caused by: com.google.api.gax.rpc.InvalidArgumentException at ApiExceptionFactory.java:92
            Caused by: io.grpc.StatusRuntimeException at Status.java:539

org.apache.beam.sdk.io.gcp.firestore.it.FirestoreV1IT > partitionQuery FAILED
    java.util.concurrent.ExecutionException at AbstractFuture.java:588
        Caused by: com.google.api.gax.rpc.InvalidArgumentException at ApiExceptionFactory.java:92
            Caused by: io.grpc.StatusRuntimeException at Status.java:539

org.apache.beam.sdk.io.gcp.firestore.it.FirestoreV1IT > listCollections FAILED
    java.util.concurrent.ExecutionException at AbstractFuture.java:588
        Caused by: com.google.api.gax.rpc.InvalidArgumentException at ApiExceptionFactory.java:92
            Caused by: io.grpc.StatusRuntimeException at Status.java:539

org.apache.beam.sdk.io.gcp.firestore.it.FirestoreV1IT > write FAILED
    java.lang.RuntimeException at TestDataflowRunner.java:141

org.apache.beam.sdk.io.gcp.firestore.it.FirestoreV1IT > runQuery FAILED
    java.util.concurrent.ExecutionException at AbstractFuture.java:588
        Caused by: com.google.api.gax.rpc.InvalidArgumentException at ApiExceptionFactory.java:92
            Caused by: io.grpc.StatusRuntimeException at Status.java:539

105 tests completed, 6 failed, 3 skipped

> Task :runners:google-cloud-dataflow-java:googleCloudPlatformLegacyWorkerIntegrationTest FAILED
> Task :runners:google-cloud-dataflow-java:googleCloudPlatformLegacyWorkerKmsIntegrationTest FROM-CACHE

FAILURE: Build failed with an exception.

* What went wrong:
Execution failed for task ':runners:google-cloud-dataflow-java:googleCloudPlatformLegacyWorkerIntegrationTest'.
> There were failing tests. See the report at: file://<https://ci-beam.apache.org/job/beam_PostCommit_Java_DataflowV1/ws/src/runners/google-cloud-dataflow-java/build/reports/tests/googleCloudPlatformLegacyWorkerIntegrationTest/index.html>

* Try:
> Run with --stacktrace option to get the stack trace.
> Run with --info or --debug option to get more log output.

* Get more help at https://help.gradle.org

Deprecated Gradle features were used in this build, making it incompatible with Gradle 8.0.

You can use '--warning-mode all' to show the individual deprecation warnings and determine if they come from your own scripts or plugins.

See https://docs.gradle.org/7.5.1/userguide/command_line_interface.html#sec:command_line_warnings

BUILD FAILED in 2h 13m 59s
149 actionable tasks: 88 executed, 59 from cache, 2 up-to-date

Publishing build scan...
https://ge.apache.org/s/ycra5acq2sw3q

Build step 'Invoke Gradle script' changed build result to FAILURE
Build step 'Invoke Gradle script' marked build as failure

---------------------------------------------------------------------
To unsubscribe, e-mail: builds-unsubscribe@beam.apache.org
For additional commands, e-mail: builds-help@beam.apache.org


Build failed in Jenkins: beam_PostCommit_Java_DataflowV1 #3221

Posted by Apache Jenkins Server <je...@builds.apache.org>.
See <https://ci-beam.apache.org/job/beam_PostCommit_Java_DataflowV1/3221/display/redirect>

Changes:


------------------------------------------
[...truncated 20.87 KB...]
> Task :runners:direct-java:processResources NO-SOURCE
> Task :runners:core-java:processTestResources NO-SOURCE
> Task :runners:direct-java:processTestResources NO-SOURCE
> Task :sdks:java:extensions:python:processResources
> Task :sdks:java:extensions:avro:generateTestAvroProtocol NO-SOURCE
> Task :examples:java:processTestResources
> Task :sdks:java:extensions:google-cloud-platform-core:processTestResources NO-SOURCE
> Task :sdks:java:core:processResources
> Task :runners:google-cloud-dataflow-java:processResources
> Task :sdks:java:core:generateTestAvroProtocol NO-SOURCE
> Task :sdks:java:extensions:protobuf:extractTestProto
> Task :sdks:java:io:common:createCheckerFrameworkManifest
> Task :sdks:java:io:common:compileJava NO-SOURCE
> Task :sdks:java:io:common:processResources NO-SOURCE
> Task :sdks:java:io:common:classes UP-TO-DATE
> Task :sdks:java:extensions:protobuf:processTestResources
> Task :sdks:java:io:common:jar
> Task :sdks:java:io:common:processTestResources NO-SOURCE
> Task :sdks:java:testing:test-utils:createCheckerFrameworkManifest
> Task :sdks:java:testing:test-utils:processResources NO-SOURCE
> Task :sdks:java:testing:test-utils:processTestResources NO-SOURCE
> Task :sdks:java:transform-service:launcher:compileJava FROM-CACHE
> Task :runners:google-cloud-dataflow-java:copyGoogleCloudPlatformTestResources
> Task :sdks:java:io:google-cloud-platform:processTestResources
> Task :sdks:java:transform-service:launcher:processResources
> Task :sdks:java:transform-service:launcher:classes
> Task :sdks:java:transform-service:launcher:shadowJar FROM-CACHE
> Task :sdks:java:core:generateTestAvroJava
> Task :sdks:java:extensions:avro:generateTestAvroJava
> Task :sdks:java:core:generateTestGrammarSource NO-SOURCE
> Task :sdks:java:extensions:avro:processTestResources NO-SOURCE
> Task :sdks:java:core:processTestResources
> Task :model:pipeline:extractIncludeProto
> Task :runners:google-cloud-dataflow-java:worker:windmill:extractIncludeProto
> Task :runners:google-cloud-dataflow-java:worker:windmill:extractProto
> Task :model:pipeline:extractProto
> Task :runners:google-cloud-dataflow-java:worker:windmill:generateProto FROM-CACHE
> Task :model:pipeline:generateProto FROM-CACHE
> Task :runners:google-cloud-dataflow-java:worker:windmill:compileJava FROM-CACHE
> Task :runners:google-cloud-dataflow-java:worker:windmill:processResources
> Task :runners:google-cloud-dataflow-java:worker:windmill:classes
> Task :runners:google-cloud-dataflow-java:worker:windmill:shadowJar FROM-CACHE
> Task :model:pipeline:compileJava FROM-CACHE
> Task :model:pipeline:processResources
> Task :model:pipeline:classes
> Task :model:pipeline:jar
> Task :model:pipeline:shadowJar FROM-CACHE
> Task :model:fn-execution:extractIncludeProto
> Task :model:job-management:extractIncludeProto
> Task :model:job-management:generateProto FROM-CACHE
> Task :model:fn-execution:generateProto FROM-CACHE
> Task :model:job-management:compileJava FROM-CACHE
> Task :model:job-management:classes
> Task :model:fn-execution:compileJava FROM-CACHE
> Task :model:fn-execution:classes
> Task :model:job-management:shadowJar FROM-CACHE
> Task :model:fn-execution:shadowJar FROM-CACHE
> Task :sdks:java:core:compileJava FROM-CACHE
> Task :sdks:java:core:classes
> Task :sdks:java:core:shadowJar FROM-CACHE
> Task :runners:local-java:compileJava FROM-CACHE
> Task :runners:local-java:classes UP-TO-DATE
> Task :runners:local-java:jar
> Task :sdks:java:testing:test-utils:compileJava FROM-CACHE
> Task :sdks:java:testing:test-utils:classes UP-TO-DATE
> Task :sdks:java:extensions:arrow:compileJava FROM-CACHE
> Task :sdks:java:extensions:arrow:classes UP-TO-DATE
> Task :sdks:java:testing:test-utils:jar
> Task :sdks:java:io:common:compileTestJava FROM-CACHE
> Task :sdks:java:io:common:testClasses UP-TO-DATE
> Task :sdks:java:extensions:arrow:jar
> Task :sdks:java:extensions:avro:compileJava FROM-CACHE
> Task :sdks:java:extensions:avro:classes UP-TO-DATE
> Task :sdks:java:io:common:testJar
> Task :sdks:java:testing:test-utils:compileTestJava FROM-CACHE
> Task :sdks:java:testing:test-utils:testClasses UP-TO-DATE
> Task :sdks:java:testing:test-utils:testJar
> Task :sdks:java:extensions:avro:jar
> Task :sdks:java:fn-execution:compileJava FROM-CACHE
> Task :sdks:java:fn-execution:classes UP-TO-DATE
> Task :sdks:java:fn-execution:jar
> Task :runners:core-construction-java:compileJava FROM-CACHE
> Task :runners:core-construction-java:classes UP-TO-DATE
> Task :sdks:java:extensions:protobuf:extractIncludeProto
> Task :sdks:java:extensions:protobuf:generateProto NO-SOURCE
> Task :sdks:java:extensions:protobuf:compileJava FROM-CACHE
> Task :sdks:java:extensions:protobuf:classes UP-TO-DATE
> Task :sdks:java:extensions:protobuf:jar
> Task :runners:core-construction-java:jar
> Task :runners:core-java:compileJava FROM-CACHE
> Task :runners:core-java:classes UP-TO-DATE
> Task :sdks:java:extensions:python:compileJava FROM-CACHE
> Task :sdks:java:extensions:python:classes
> Task :sdks:java:extensions:python:jar
> Task :sdks:java:core:compileTestJava FROM-CACHE
> Task :sdks:java:core:testClasses
> Task :runners:core-java:jar
> Task :sdks:java:core:shadowTestJar FROM-CACHE
> Task :sdks:java:extensions:google-cloud-platform-core:compileJava FROM-CACHE
> Task :sdks:java:extensions:google-cloud-platform-core:classes UP-TO-DATE
> Task :sdks:java:harness:compileJava FROM-CACHE
> Task :sdks:java:harness:classes UP-TO-DATE
> Task :sdks:java:extensions:google-cloud-platform-core:jar
> Task :sdks:java:harness:jar
> Task :runners:java-fn-execution:compileJava FROM-CACHE
> Task :runners:java-fn-execution:classes UP-TO-DATE
> Task :runners:java-fn-execution:jar
> Task :sdks:java:expansion-service:compileJava FROM-CACHE
> Task :sdks:java:expansion-service:classes UP-TO-DATE
> Task :sdks:java:extensions:avro:compileTestJava FROM-CACHE
> Task :sdks:java:extensions:avro:testClasses UP-TO-DATE
> Task :sdks:java:expansion-service:jar
> Task :sdks:java:extensions:google-cloud-platform-core:compileTestJava FROM-CACHE
> Task :sdks:java:extensions:avro:testJar
> Task :sdks:java:extensions:google-cloud-platform-core:testClasses UP-TO-DATE
> Task :runners:direct-java:compileJava FROM-CACHE
> Task :runners:direct-java:classes UP-TO-DATE
> Task :sdks:java:extensions:google-cloud-platform-core:testJar
> Task :runners:core-java:compileTestJava FROM-CACHE
> Task :runners:core-java:testClasses UP-TO-DATE
> Task :sdks:java:harness:shadowJar FROM-CACHE
> Task :runners:direct-java:shadowJar FROM-CACHE
> Task :sdks:java:extensions:ml:compileJava FROM-CACHE
> Task :sdks:java:extensions:ml:classes UP-TO-DATE
> Task :runners:core-java:testJar
> Task :sdks:java:extensions:ml:jar
> Task :sdks:java:io:kafka:compileJava FROM-CACHE
> Task :sdks:java:io:kafka:classes UP-TO-DATE
> Task :sdks:java:io:kafka:jar
> Task :runners:direct-java:compileTestJava FROM-CACHE
> Task :runners:direct-java:testClasses UP-TO-DATE
> Task :runners:direct-java:shadowTestJar FROM-CACHE
> Task :sdks:java:io:google-cloud-platform:compileJava FROM-CACHE
> Task :sdks:java:io:google-cloud-platform:classes UP-TO-DATE
> Task :sdks:java:extensions:protobuf:extractIncludeTestProto
> Task :sdks:java:io:google-cloud-platform:jar
> Task :sdks:java:extensions:protobuf:generateTestProto FROM-CACHE
> Task :sdks:java:extensions:protobuf:compileTestJava FROM-CACHE
> Task :sdks:java:extensions:protobuf:testClasses
> Task :sdks:java:extensions:protobuf:testJar
> Task :runners:google-cloud-dataflow-java:compileJava FROM-CACHE
> Task :runners:google-cloud-dataflow-java:classes
> Task :examples:java:compileJava FROM-CACHE
> Task :examples:java:classes UP-TO-DATE
> Task :runners:google-cloud-dataflow-java:jar
> Task :examples:java:jar
> Task :examples:java:compileTestJava FROM-CACHE
> Task :examples:java:testClasses
> Task :examples:java:testJar
> Task :runners:google-cloud-dataflow-java:worker:compileJava FROM-CACHE
> Task :runners:google-cloud-dataflow-java:worker:classes
> Task :sdks:java:io:google-cloud-platform:compileTestJava FROM-CACHE
> Task :sdks:java:io:google-cloud-platform:testClasses
> Task :runners:google-cloud-dataflow-java:worker:shadowJar FROM-CACHE
> Task :runners:google-cloud-dataflow-java:coreSDKJavaLegacyWorkerIntegrationTest NO-SOURCE
> Task :sdks:java:io:google-cloud-platform:testJar
> Task :runners:google-cloud-dataflow-java:examplesJavaLegacyWorkerIntegrationTest

***********************************************************
***********************************************************
*************************Tear Down*************************
The Pub/Sub topic has been deleted: projects/apache-beam-testing/topics/testpipeline-jenkins-0626181556-e04a3aaa
The Pub/Sub subscription has been deleted: projects/apache-beam-testing/subscriptions/testpipeline-jenkins-0626181556-e04a3aaa
***********************************************************
***********************************************************

***********************************************************
***********************************************************
**********************Set Up Pubsub************************
The Pub/Sub topic has been set up for this example: projects/apache-beam-testing/topics/testpipeline-jenkins-0626182057-adea2284
The Pub/Sub subscription has been set up for this example: projects/apache-beam-testing/subscriptions/testpipeline-jenkins-0626182057-adea2284
*************************Tear Down*************************
The Pub/Sub topic has been deleted: projects/apache-beam-testing/topics/testpipeline-jenkins-0626182057-adea2284
The Pub/Sub subscription has been deleted: projects/apache-beam-testing/subscriptions/testpipeline-jenkins-0626182057-adea2284
***********************************************************
***********************************************************

***********************************************************
***********************************************************
**********************Set Up Pubsub************************
The Pub/Sub topic has been set up for this example: projects/apache-beam-testing/topics/testpipeline-jenkins-0626181557-9c7cb516
The Pub/Sub subscription has been set up for this example: projects/apache-beam-testing/subscriptions/testpipeline-jenkins-0626181557-9c7cb516
*************************Tear Down*************************
The Pub/Sub topic has been deleted: projects/apache-beam-testing/topics/testpipeline-jenkins-0626181557-9c7cb516
The Pub/Sub subscription has been deleted: projects/apache-beam-testing/subscriptions/testpipeline-jenkins-0626181557-9c7cb516
***********************************************************
***********************************************************

> Task :runners:google-cloud-dataflow-java:googleCloudPlatformLegacyWorkerIntegrationTest

org.apache.beam.sdk.io.gcp.firestore.it.FirestoreV1IT > batchWrite_partialFailureOutputsToDeadLetterQueue FAILED
    java.util.concurrent.ExecutionException at FirestoreV1IT.java:96
        Caused by: com.google.api.gax.rpc.InvalidArgumentException at ApiExceptionFactory.java:92
            Caused by: io.grpc.StatusRuntimeException at Status.java:539

org.apache.beam.sdk.io.gcp.firestore.it.FirestoreV1IT > batchGet FAILED
    java.util.concurrent.ExecutionException at AbstractFuture.java:588
        Caused by: com.google.api.gax.rpc.InvalidArgumentException at ApiExceptionFactory.java:92
            Caused by: io.grpc.StatusRuntimeException at Status.java:539

org.apache.beam.sdk.io.gcp.firestore.it.FirestoreV1IT > partitionQuery FAILED
    java.util.concurrent.ExecutionException at AbstractFuture.java:588
        Caused by: com.google.api.gax.rpc.InvalidArgumentException at ApiExceptionFactory.java:92
            Caused by: io.grpc.StatusRuntimeException at Status.java:539

org.apache.beam.sdk.io.gcp.firestore.it.FirestoreV1IT > listCollections FAILED
    java.util.concurrent.ExecutionException at AbstractFuture.java:588
        Caused by: com.google.api.gax.rpc.InvalidArgumentException at ApiExceptionFactory.java:92
            Caused by: io.grpc.StatusRuntimeException at Status.java:539

org.apache.beam.sdk.io.gcp.firestore.it.FirestoreV1IT > write FAILED
    java.lang.RuntimeException at TestDataflowRunner.java:141

org.apache.beam.sdk.io.gcp.firestore.it.FirestoreV1IT > runQuery FAILED
    java.util.concurrent.ExecutionException at AbstractFuture.java:588
        Caused by: com.google.api.gax.rpc.InvalidArgumentException at ApiExceptionFactory.java:92
            Caused by: io.grpc.StatusRuntimeException at Status.java:539

105 tests completed, 6 failed, 3 skipped

> Task :runners:google-cloud-dataflow-java:googleCloudPlatformLegacyWorkerIntegrationTest FAILED
> Task :runners:google-cloud-dataflow-java:googleCloudPlatformLegacyWorkerKmsIntegrationTest

FAILURE: Build failed with an exception.

* What went wrong:
Execution failed for task ':runners:google-cloud-dataflow-java:googleCloudPlatformLegacyWorkerIntegrationTest'.
> There were failing tests. See the report at: file://<https://ci-beam.apache.org/job/beam_PostCommit_Java_DataflowV1/ws/src/runners/google-cloud-dataflow-java/build/reports/tests/googleCloudPlatformLegacyWorkerIntegrationTest/index.html>

* Try:
> Run with --stacktrace option to get the stack trace.
> Run with --info or --debug option to get more log output.

* Get more help at https://help.gradle.org

Deprecated Gradle features were used in this build, making it incompatible with Gradle 8.0.

You can use '--warning-mode all' to show the individual deprecation warnings and determine if they come from your own scripts or plugins.

See https://docs.gradle.org/7.5.1/userguide/command_line_interface.html#sec:command_line_warnings

BUILD FAILED in 2h 48m 13s
149 actionable tasks: 90 executed, 57 from cache, 2 up-to-date

Publishing build scan...
https://ge.apache.org/s/o3kp3lkelikqy

Build step 'Invoke Gradle script' changed build result to FAILURE
Build step 'Invoke Gradle script' marked build as failure

---------------------------------------------------------------------
To unsubscribe, e-mail: builds-unsubscribe@beam.apache.org
For additional commands, e-mail: builds-help@beam.apache.org


Build failed in Jenkins: beam_PostCommit_Java_DataflowV1 #3220

Posted by Apache Jenkins Server <je...@builds.apache.org>.
See <https://ci-beam.apache.org/job/beam_PostCommit_Java_DataflowV1/3220/display/redirect?page=changes>

Changes:

[noreply] Vertex AI Remote Model Handler (#27091)


------------------------------------------
[...truncated 13.02 KB...]
> Task :runners:java-fn-execution:createCheckerFrameworkManifest
> Task :runners:java-fn-execution:processResources NO-SOURCE
> Task :sdks:java:extensions:google-cloud-platform-core:processResources NO-SOURCE
> Task :sdks:java:harness:createCheckerFrameworkManifest
> Task :sdks:java:harness:processResources NO-SOURCE
> Task :sdks:java:expansion-service:createCheckerFrameworkManifest
> Task :sdks:java:extensions:arrow:createCheckerFrameworkManifest
> Task :sdks:java:expansion-service:processResources NO-SOURCE
> Task :sdks:java:extensions:arrow:processResources NO-SOURCE
> Task :model:job-management:processResources
> Task :sdks:java:core:generateGrammarSource FROM-CACHE
> Task :model:fn-execution:processResources
> Task :sdks:java:extensions:protobuf:createCheckerFrameworkManifest
> Task :sdks:java:io:google-cloud-platform:createCheckerFrameworkManifest
> Task :sdks:java:extensions:protobuf:extractProto
> Task :sdks:java:io:kafka:createCheckerFrameworkManifest
> Task :sdks:java:io:kafka:processResources NO-SOURCE
> Task :runners:google-cloud-dataflow-java:worker:createCheckerFrameworkManifest
> Task :sdks:java:extensions:protobuf:processResources NO-SOURCE
> Task :runners:google-cloud-dataflow-java:worker:windmill:createCheckerFrameworkManifest
> Task :sdks:java:io:google-cloud-platform:processResources NO-SOURCE
> Task :sdks:java:extensions:ml:createCheckerFrameworkManifest
> Task :examples:java:createCheckerFrameworkManifest
> Task :runners:google-cloud-dataflow-java:worker:processResources
> Task :sdks:java:extensions:python:createCheckerFrameworkManifest
> Task :sdks:java:extensions:ml:processResources NO-SOURCE
> Task :examples:java:processResources NO-SOURCE
> Task :sdks:java:transform-service:launcher:createCheckerFrameworkManifest
> Task :runners:local-java:createCheckerFrameworkManifest
> Task :runners:direct-java:createCheckerFrameworkManifest
> Task :runners:direct-java:processResources NO-SOURCE
> Task :sdks:java:extensions:python:processResources
> Task :runners:local-java:processResources NO-SOURCE
> Task :runners:core-java:processTestResources NO-SOURCE
> Task :runners:direct-java:processTestResources NO-SOURCE
> Task :sdks:java:extensions:avro:generateTestAvroProtocol NO-SOURCE
> Task :sdks:java:extensions:google-cloud-platform-core:processTestResources NO-SOURCE
> Task :sdks:java:extensions:protobuf:extractTestProto
> Task :examples:java:processTestResources
> Task :sdks:java:io:common:createCheckerFrameworkManifest
> Task :sdks:java:io:common:compileJava NO-SOURCE
> Task :sdks:java:core:processResources
> Task :runners:google-cloud-dataflow-java:processResources
> Task :sdks:java:io:common:processResources NO-SOURCE
> Task :sdks:java:core:generateTestAvroProtocol NO-SOURCE
> Task :sdks:java:io:common:classes UP-TO-DATE
> Task :sdks:java:extensions:protobuf:processTestResources
> Task :sdks:java:testing:test-utils:createCheckerFrameworkManifest
> Task :sdks:java:testing:test-utils:processResources NO-SOURCE
> Task :sdks:java:io:common:jar
> Task :sdks:java:io:common:processTestResources NO-SOURCE
> Task :sdks:java:testing:test-utils:processTestResources NO-SOURCE
> Task :sdks:java:transform-service:launcher:compileJava FROM-CACHE
> Task :sdks:java:transform-service:launcher:processResources
> Task :sdks:java:transform-service:launcher:classes
> Task :runners:google-cloud-dataflow-java:copyGoogleCloudPlatformTestResources
> Task :sdks:java:io:google-cloud-platform:processTestResources
> Task :sdks:java:transform-service:launcher:shadowJar FROM-CACHE
> Task :sdks:java:core:generateTestAvroJava
> Task :sdks:java:core:generateTestGrammarSource NO-SOURCE
> Task :sdks:java:extensions:avro:generateTestAvroJava
> Task :sdks:java:extensions:avro:processTestResources NO-SOURCE
> Task :sdks:java:core:processTestResources
> Task :model:pipeline:extractIncludeProto
> Task :runners:google-cloud-dataflow-java:worker:windmill:extractIncludeProto
> Task :model:pipeline:extractProto
> Task :runners:google-cloud-dataflow-java:worker:windmill:extractProto
> Task :runners:google-cloud-dataflow-java:worker:windmill:generateProto FROM-CACHE
> Task :model:pipeline:generateProto FROM-CACHE
> Task :runners:google-cloud-dataflow-java:worker:windmill:compileJava FROM-CACHE
> Task :runners:google-cloud-dataflow-java:worker:windmill:processResources
> Task :runners:google-cloud-dataflow-java:worker:windmill:classes
> Task :runners:google-cloud-dataflow-java:worker:windmill:shadowJar FROM-CACHE
> Task :model:pipeline:compileJava FROM-CACHE
> Task :model:pipeline:processResources
> Task :model:pipeline:classes
> Task :model:pipeline:jar
> Task :model:pipeline:shadowJar FROM-CACHE
> Task :model:job-management:extractIncludeProto
> Task :model:fn-execution:extractIncludeProto
> Task :model:job-management:generateProto FROM-CACHE
> Task :model:fn-execution:generateProto FROM-CACHE
> Task :model:job-management:compileJava FROM-CACHE
> Task :model:job-management:classes
> Task :model:fn-execution:compileJava FROM-CACHE
> Task :model:fn-execution:classes
> Task :model:job-management:shadowJar FROM-CACHE
> Task :model:fn-execution:shadowJar FROM-CACHE
> Task :sdks:java:core:compileJava FROM-CACHE
> Task :sdks:java:core:classes
> Task :sdks:java:core:shadowJar FROM-CACHE
> Task :runners:local-java:compileJava FROM-CACHE
> Task :runners:local-java:classes UP-TO-DATE
> Task :sdks:java:io:common:compileTestJava FROM-CACHE
> Task :sdks:java:io:common:testClasses UP-TO-DATE
> Task :runners:local-java:jar
> Task :sdks:java:io:common:testJar
> Task :sdks:java:extensions:avro:compileJava FROM-CACHE
> Task :sdks:java:extensions:avro:classes UP-TO-DATE
> Task :sdks:java:testing:test-utils:compileJava FROM-CACHE
> Task :sdks:java:testing:test-utils:classes UP-TO-DATE
> Task :sdks:java:testing:test-utils:jar
> Task :sdks:java:extensions:avro:jar
> Task :sdks:java:extensions:arrow:compileJava FROM-CACHE
> Task :sdks:java:extensions:arrow:classes UP-TO-DATE
> Task :sdks:java:extensions:arrow:jar
> Task :sdks:java:testing:test-utils:compileTestJava FROM-CACHE
> Task :sdks:java:testing:test-utils:testClasses UP-TO-DATE
> Task :sdks:java:testing:test-utils:testJar
> Task :sdks:java:fn-execution:compileJava FROM-CACHE
> Task :sdks:java:fn-execution:classes UP-TO-DATE
> Task :sdks:java:fn-execution:jar
> Task :sdks:java:extensions:protobuf:extractIncludeProto
> Task :sdks:java:extensions:protobuf:generateProto NO-SOURCE
> Task :runners:core-construction-java:compileJava FROM-CACHE
> Task :sdks:java:extensions:protobuf:compileJava FROM-CACHE
> Task :runners:core-construction-java:classes UP-TO-DATE
> Task :sdks:java:extensions:protobuf:classes UP-TO-DATE
> Task :sdks:java:extensions:protobuf:jar
> Task :runners:core-construction-java:jar
> Task :runners:core-java:compileJava FROM-CACHE
> Task :runners:core-java:classes UP-TO-DATE
> Task :sdks:java:extensions:python:compileJava FROM-CACHE
> Task :sdks:java:extensions:python:classes
> Task :sdks:java:extensions:python:jar
> Task :runners:core-java:jar
> Task :sdks:java:core:compileTestJava FROM-CACHE
> Task :sdks:java:core:testClasses
> Task :sdks:java:extensions:google-cloud-platform-core:compileJava FROM-CACHE
> Task :sdks:java:extensions:google-cloud-platform-core:classes UP-TO-DATE
> Task :sdks:java:harness:compileJava FROM-CACHE
> Task :sdks:java:harness:classes UP-TO-DATE
> Task :sdks:java:extensions:google-cloud-platform-core:jar
> Task :sdks:java:core:shadowTestJar FROM-CACHE
> Task :sdks:java:harness:jar
> Task :runners:java-fn-execution:compileJava FROM-CACHE
> Task :runners:java-fn-execution:classes UP-TO-DATE
> Task :runners:java-fn-execution:jar
> Task :sdks:java:expansion-service:compileJava FROM-CACHE
> Task :sdks:java:expansion-service:classes UP-TO-DATE
> Task :sdks:java:expansion-service:jar
> Task :runners:direct-java:compileJava FROM-CACHE
> Task :sdks:java:harness:shadowJar FROM-CACHE
> Task :runners:direct-java:classes UP-TO-DATE
> Task :sdks:java:extensions:ml:compileJava FROM-CACHE
> Task :sdks:java:extensions:ml:classes UP-TO-DATE
> Task :sdks:java:extensions:avro:compileTestJava FROM-CACHE
> Task :sdks:java:extensions:avro:testClasses UP-TO-DATE
> Task :sdks:java:io:kafka:compileJava FROM-CACHE
> Task :sdks:java:io:kafka:classes UP-TO-DATE
> Task :sdks:java:extensions:ml:jar
> Task :sdks:java:extensions:google-cloud-platform-core:compileTestJava FROM-CACHE
> Task :sdks:java:extensions:google-cloud-platform-core:testClasses UP-TO-DATE
> Task :sdks:java:extensions:avro:testJar
> Task :sdks:java:extensions:google-cloud-platform-core:testJar
> Task :runners:direct-java:shadowJar FROM-CACHE
> Task :sdks:java:io:kafka:jar
> Task :runners:core-java:compileTestJava FROM-CACHE
> Task :runners:core-java:testClasses UP-TO-DATE
> Task :runners:core-java:testJar
> Task :runners:direct-java:compileTestJava FROM-CACHE
> Task :runners:direct-java:testClasses UP-TO-DATE
> Task :sdks:java:io:google-cloud-platform:compileJava FROM-CACHE
> Task :sdks:java:io:google-cloud-platform:classes UP-TO-DATE
> Task :runners:direct-java:shadowTestJar FROM-CACHE
> Task :sdks:java:io:google-cloud-platform:jar
> Task :sdks:java:extensions:protobuf:extractIncludeTestProto
> Task :sdks:java:extensions:protobuf:generateTestProto FROM-CACHE
> Task :sdks:java:extensions:protobuf:compileTestJava FROM-CACHE
> Task :sdks:java:extensions:protobuf:testClasses
> Task :sdks:java:extensions:protobuf:testJar
> Task :runners:google-cloud-dataflow-java:compileJava FROM-CACHE
> Task :runners:google-cloud-dataflow-java:classes
> Task :examples:java:compileJava FROM-CACHE
> Task :examples:java:classes UP-TO-DATE
> Task :runners:google-cloud-dataflow-java:jar
> Task :examples:java:jar
> Task :examples:java:compileTestJava FROM-CACHE
> Task :examples:java:testClasses
> Task :examples:java:testJar
> Task :runners:google-cloud-dataflow-java:worker:compileJava FROM-CACHE
> Task :runners:google-cloud-dataflow-java:worker:classes
> Task :sdks:java:io:google-cloud-platform:compileTestJava FROM-CACHE
> Task :sdks:java:io:google-cloud-platform:testClasses
> Task :runners:google-cloud-dataflow-java:worker:shadowJar FROM-CACHE
> Task :runners:google-cloud-dataflow-java:coreSDKJavaLegacyWorkerIntegrationTest NO-SOURCE
> Task :sdks:java:io:google-cloud-platform:testJar
> Task :runners:google-cloud-dataflow-java:examplesJavaLegacyWorkerIntegrationTest FROM-CACHE
> Task :runners:google-cloud-dataflow-java:googleCloudPlatformLegacyWorkerIntegrationTest

org.apache.beam.sdk.io.gcp.firestore.it.FirestoreV1IT > batchWrite_partialFailureOutputsToDeadLetterQueue FAILED
    java.util.concurrent.ExecutionException at FirestoreV1IT.java:96
        Caused by: com.google.api.gax.rpc.InvalidArgumentException at ApiExceptionFactory.java:92
            Caused by: io.grpc.StatusRuntimeException at Status.java:539

org.apache.beam.sdk.io.gcp.firestore.it.FirestoreV1IT > batchGet FAILED
    java.util.concurrent.ExecutionException at AbstractFuture.java:588
        Caused by: com.google.api.gax.rpc.InvalidArgumentException at ApiExceptionFactory.java:92
            Caused by: io.grpc.StatusRuntimeException at Status.java:539

org.apache.beam.sdk.io.gcp.firestore.it.FirestoreV1IT > partitionQuery FAILED
    java.util.concurrent.ExecutionException at AbstractFuture.java:588
        Caused by: com.google.api.gax.rpc.InvalidArgumentException at ApiExceptionFactory.java:92
            Caused by: io.grpc.StatusRuntimeException at Status.java:539

org.apache.beam.sdk.io.gcp.firestore.it.FirestoreV1IT > listCollections FAILED
    java.util.concurrent.ExecutionException at AbstractFuture.java:588
        Caused by: com.google.api.gax.rpc.InvalidArgumentException at ApiExceptionFactory.java:92
            Caused by: io.grpc.StatusRuntimeException at Status.java:539

org.apache.beam.sdk.io.gcp.firestore.it.FirestoreV1IT > write FAILED
    java.lang.RuntimeException at TestDataflowRunner.java:141

org.apache.beam.sdk.io.gcp.firestore.it.FirestoreV1IT > runQuery FAILED
    java.util.concurrent.ExecutionException at AbstractFuture.java:588
        Caused by: com.google.api.gax.rpc.InvalidArgumentException at ApiExceptionFactory.java:92
            Caused by: io.grpc.StatusRuntimeException at Status.java:539

105 tests completed, 6 failed, 3 skipped

> Task :runners:google-cloud-dataflow-java:googleCloudPlatformLegacyWorkerIntegrationTest FAILED
> Task :runners:google-cloud-dataflow-java:googleCloudPlatformLegacyWorkerKmsIntegrationTest FROM-CACHE

FAILURE: Build failed with an exception.

* What went wrong:
Execution failed for task ':runners:google-cloud-dataflow-java:googleCloudPlatformLegacyWorkerIntegrationTest'.
> There were failing tests. See the report at: file://<https://ci-beam.apache.org/job/beam_PostCommit_Java_DataflowV1/ws/src/runners/google-cloud-dataflow-java/build/reports/tests/googleCloudPlatformLegacyWorkerIntegrationTest/index.html>

* Try:
> Run with --stacktrace option to get the stack trace.
> Run with --info or --debug option to get more log output.

* Get more help at https://help.gradle.org

Deprecated Gradle features were used in this build, making it incompatible with Gradle 8.0.

You can use '--warning-mode all' to show the individual deprecation warnings and determine if they come from your own scripts or plugins.

See https://docs.gradle.org/7.5.1/userguide/command_line_interface.html#sec:command_line_warnings

BUILD FAILED in 2h 13m 55s
149 actionable tasks: 88 executed, 59 from cache, 2 up-to-date

Publishing build scan...
https://ge.apache.org/s/emba6glspzigs

Build step 'Invoke Gradle script' changed build result to FAILURE
Build step 'Invoke Gradle script' marked build as failure

---------------------------------------------------------------------
To unsubscribe, e-mail: builds-unsubscribe@beam.apache.org
For additional commands, e-mail: builds-help@beam.apache.org


Build failed in Jenkins: beam_PostCommit_Java_DataflowV1 #3219

Posted by Apache Jenkins Server <je...@builds.apache.org>.
See <https://ci-beam.apache.org/job/beam_PostCommit_Java_DataflowV1/3219/display/redirect>

Changes:


------------------------------------------
[...truncated 13.15 KB...]
> Task :sdks:java:extensions:google-cloud-platform-core:processResources NO-SOURCE
> Task :runners:java-fn-execution:processResources NO-SOURCE
> Task :runners:core-java:processResources NO-SOURCE
> Task :sdks:java:harness:createCheckerFrameworkManifest
> Task :sdks:java:expansion-service:createCheckerFrameworkManifest
> Task :sdks:java:extensions:arrow:createCheckerFrameworkManifest
> Task :sdks:java:harness:processResources NO-SOURCE
> Task :sdks:java:expansion-service:processResources NO-SOURCE
> Task :sdks:java:extensions:arrow:processResources NO-SOURCE
> Task :sdks:java:core:generateGrammarSource FROM-CACHE
> Task :model:job-management:processResources
> Task :sdks:java:extensions:protobuf:createCheckerFrameworkManifest
> Task :model:fn-execution:processResources
> Task :sdks:java:extensions:protobuf:extractProto
> Task :sdks:java:io:kafka:createCheckerFrameworkManifest
> Task :runners:google-cloud-dataflow-java:worker:windmill:createCheckerFrameworkManifest
> Task :runners:google-cloud-dataflow-java:worker:createCheckerFrameworkManifest
> Task :sdks:java:io:google-cloud-platform:createCheckerFrameworkManifest
> Task :sdks:java:io:kafka:processResources NO-SOURCE
> Task :sdks:java:extensions:protobuf:processResources NO-SOURCE
> Task :sdks:java:io:google-cloud-platform:processResources NO-SOURCE
> Task :runners:google-cloud-dataflow-java:worker:processResources
> Task :examples:java:createCheckerFrameworkManifest
> Task :sdks:java:extensions:ml:createCheckerFrameworkManifest
> Task :sdks:java:extensions:python:createCheckerFrameworkManifest
> Task :examples:java:processResources NO-SOURCE
> Task :sdks:java:extensions:ml:processResources NO-SOURCE
> Task :runners:direct-java:createCheckerFrameworkManifest
> Task :sdks:java:transform-service:launcher:createCheckerFrameworkManifest
> Task :runners:local-java:createCheckerFrameworkManifest
> Task :sdks:java:extensions:python:processResources
> Task :runners:direct-java:processResources NO-SOURCE
> Task :runners:local-java:processResources NO-SOURCE
> Task :runners:core-java:processTestResources NO-SOURCE
> Task :runners:direct-java:processTestResources NO-SOURCE
> Task :sdks:java:core:processResources
> Task :runners:google-cloud-dataflow-java:processResources
> Task :sdks:java:extensions:google-cloud-platform-core:processTestResources NO-SOURCE
> Task :sdks:java:core:generateTestAvroProtocol NO-SOURCE
> Task :sdks:java:extensions:avro:generateTestAvroProtocol NO-SOURCE
> Task :examples:java:processTestResources
> Task :sdks:java:extensions:protobuf:extractTestProto
> Task :sdks:java:io:common:createCheckerFrameworkManifest
> Task :sdks:java:io:common:compileJava NO-SOURCE
> Task :sdks:java:io:common:processResources NO-SOURCE
> Task :sdks:java:io:common:classes UP-TO-DATE
> Task :sdks:java:extensions:protobuf:processTestResources
> Task :sdks:java:testing:test-utils:createCheckerFrameworkManifest
> Task :sdks:java:io:common:jar
> Task :sdks:java:testing:test-utils:processResources NO-SOURCE
> Task :sdks:java:io:common:processTestResources NO-SOURCE
> Task :sdks:java:testing:test-utils:processTestResources NO-SOURCE
> Task :sdks:java:transform-service:launcher:compileJava FROM-CACHE
> Task :runners:google-cloud-dataflow-java:copyGoogleCloudPlatformTestResources
> Task :sdks:java:io:google-cloud-platform:processTestResources
> Task :sdks:java:transform-service:launcher:processResources
> Task :sdks:java:transform-service:launcher:classes
> Task :sdks:java:transform-service:launcher:shadowJar FROM-CACHE
> Task :sdks:java:core:generateTestAvroJava
> Task :sdks:java:extensions:avro:generateTestAvroJava
> Task :sdks:java:core:generateTestGrammarSource NO-SOURCE
> Task :sdks:java:extensions:avro:processTestResources NO-SOURCE
> Task :sdks:java:core:processTestResources
> Task :model:pipeline:extractIncludeProto
> Task :runners:google-cloud-dataflow-java:worker:windmill:extractIncludeProto
> Task :runners:google-cloud-dataflow-java:worker:windmill:extractProto
> Task :model:pipeline:extractProto
> Task :runners:google-cloud-dataflow-java:worker:windmill:generateProto FROM-CACHE
> Task :model:pipeline:generateProto FROM-CACHE
> Task :runners:google-cloud-dataflow-java:worker:windmill:compileJava FROM-CACHE
> Task :runners:google-cloud-dataflow-java:worker:windmill:processResources
> Task :runners:google-cloud-dataflow-java:worker:windmill:classes
> Task :runners:google-cloud-dataflow-java:worker:windmill:shadowJar FROM-CACHE
> Task :model:pipeline:compileJava FROM-CACHE
> Task :model:pipeline:processResources
> Task :model:pipeline:classes
> Task :model:pipeline:jar
> Task :model:pipeline:shadowJar FROM-CACHE
> Task :model:fn-execution:extractIncludeProto
> Task :model:job-management:extractIncludeProto
> Task :model:job-management:generateProto FROM-CACHE
> Task :model:fn-execution:generateProto FROM-CACHE
> Task :model:job-management:compileJava FROM-CACHE
> Task :model:job-management:classes
> Task :model:fn-execution:compileJava FROM-CACHE
> Task :model:fn-execution:classes
> Task :model:job-management:shadowJar FROM-CACHE
> Task :model:fn-execution:shadowJar FROM-CACHE
> Task :sdks:java:core:compileJava FROM-CACHE
> Task :sdks:java:core:classes
> Task :sdks:java:core:shadowJar FROM-CACHE
> Task :sdks:java:testing:test-utils:compileJava FROM-CACHE
> Task :sdks:java:testing:test-utils:classes UP-TO-DATE
> Task :sdks:java:testing:test-utils:jar
> Task :runners:local-java:compileJava FROM-CACHE
> Task :runners:local-java:classes UP-TO-DATE
> Task :runners:local-java:jar
> Task :sdks:java:io:common:compileTestJava FROM-CACHE
> Task :sdks:java:io:common:testClasses UP-TO-DATE
> Task :sdks:java:testing:test-utils:compileTestJava FROM-CACHE
> Task :sdks:java:testing:test-utils:testClasses UP-TO-DATE
> Task :sdks:java:io:common:testJar
> Task :sdks:java:extensions:arrow:compileJava FROM-CACHE
> Task :sdks:java:extensions:arrow:classes UP-TO-DATE
> Task :sdks:java:testing:test-utils:testJar
> Task :sdks:java:extensions:arrow:jar
> Task :sdks:java:extensions:avro:compileJava FROM-CACHE
> Task :sdks:java:extensions:avro:classes UP-TO-DATE
> Task :sdks:java:fn-execution:compileJava FROM-CACHE
> Task :sdks:java:fn-execution:classes UP-TO-DATE
> Task :sdks:java:extensions:avro:jar
> Task :sdks:java:fn-execution:jar
> Task :sdks:java:extensions:protobuf:extractIncludeProto
> Task :sdks:java:extensions:protobuf:generateProto NO-SOURCE
> Task :sdks:java:extensions:protobuf:compileJava FROM-CACHE
> Task :sdks:java:extensions:protobuf:classes UP-TO-DATE
> Task :runners:core-construction-java:compileJava FROM-CACHE
> Task :runners:core-construction-java:classes UP-TO-DATE
> Task :sdks:java:extensions:protobuf:jar
> Task :runners:core-construction-java:jar
> Task :runners:core-java:compileJava FROM-CACHE
> Task :runners:core-java:classes UP-TO-DATE
> Task :sdks:java:extensions:python:compileJava FROM-CACHE
> Task :sdks:java:extensions:python:classes
> Task :sdks:java:extensions:python:jar
> Task :runners:core-java:jar
> Task :sdks:java:core:compileTestJava FROM-CACHE
> Task :sdks:java:core:testClasses
> Task :sdks:java:extensions:google-cloud-platform-core:compileJava FROM-CACHE
> Task :sdks:java:extensions:google-cloud-platform-core:classes UP-TO-DATE
> Task :sdks:java:extensions:google-cloud-platform-core:jar
> Task :sdks:java:harness:compileJava FROM-CACHE
> Task :sdks:java:harness:classes UP-TO-DATE
> Task :sdks:java:core:shadowTestJar FROM-CACHE
> Task :sdks:java:harness:jar
> Task :runners:java-fn-execution:compileJava FROM-CACHE
> Task :runners:java-fn-execution:classes UP-TO-DATE
> Task :runners:java-fn-execution:jar
> Task :sdks:java:expansion-service:compileJava FROM-CACHE
> Task :sdks:java:expansion-service:classes UP-TO-DATE
> Task :sdks:java:expansion-service:jar
> Task :sdks:java:extensions:google-cloud-platform-core:compileTestJava FROM-CACHE
> Task :runners:direct-java:compileJava FROM-CACHE
> Task :runners:direct-java:classes UP-TO-DATE
> Task :sdks:java:extensions:avro:compileTestJava FROM-CACHE
> Task :sdks:java:extensions:avro:testClasses UP-TO-DATE
> Task :runners:direct-java:shadowJar FROM-CACHE
> Task :sdks:java:extensions:google-cloud-platform-core:testClasses UP-TO-DATE
> Task :sdks:java:harness:shadowJar FROM-CACHE
> Task :sdks:java:extensions:avro:testJar
> Task :sdks:java:extensions:ml:compileJava FROM-CACHE
> Task :sdks:java:extensions:ml:classes UP-TO-DATE
> Task :sdks:java:extensions:google-cloud-platform-core:testJar
> Task :sdks:java:io:kafka:compileJava FROM-CACHE
> Task :sdks:java:io:kafka:classes UP-TO-DATE
> Task :sdks:java:extensions:ml:jar
> Task :runners:core-java:compileTestJava FROM-CACHE
> Task :runners:core-java:testClasses UP-TO-DATE
> Task :sdks:java:io:kafka:jar
> Task :runners:core-java:testJar
> Task :runners:direct-java:compileTestJava FROM-CACHE
> Task :runners:direct-java:testClasses UP-TO-DATE
> Task :sdks:java:io:google-cloud-platform:compileJava FROM-CACHE
> Task :sdks:java:io:google-cloud-platform:classes UP-TO-DATE
> Task :runners:direct-java:shadowTestJar FROM-CACHE
> Task :sdks:java:io:google-cloud-platform:jar
> Task :sdks:java:extensions:protobuf:extractIncludeTestProto
> Task :sdks:java:extensions:protobuf:generateTestProto FROM-CACHE
> Task :runners:google-cloud-dataflow-java:compileJava FROM-CACHE
> Task :runners:google-cloud-dataflow-java:classes
> Task :sdks:java:extensions:protobuf:compileTestJava FROM-CACHE
> Task :sdks:java:extensions:protobuf:testClasses
> Task :examples:java:compileJava FROM-CACHE
> Task :examples:java:classes UP-TO-DATE
> Task :runners:google-cloud-dataflow-java:jar
> Task :sdks:java:extensions:protobuf:testJar
> Task :examples:java:jar
> Task :examples:java:compileTestJava FROM-CACHE
> Task :examples:java:testClasses
> Task :examples:java:testJar
> Task :runners:google-cloud-dataflow-java:worker:compileJava FROM-CACHE
> Task :runners:google-cloud-dataflow-java:worker:classes
> Task :sdks:java:io:google-cloud-platform:compileTestJava FROM-CACHE
> Task :sdks:java:io:google-cloud-platform:testClasses
> Task :runners:google-cloud-dataflow-java:worker:shadowJar FROM-CACHE
> Task :runners:google-cloud-dataflow-java:coreSDKJavaLegacyWorkerIntegrationTest NO-SOURCE
> Task :sdks:java:io:google-cloud-platform:testJar
> Task :runners:google-cloud-dataflow-java:examplesJavaLegacyWorkerIntegrationTest FROM-CACHE
> Task :runners:google-cloud-dataflow-java:googleCloudPlatformLegacyWorkerIntegrationTest

org.apache.beam.sdk.io.gcp.firestore.it.FirestoreV1IT > batchWrite_partialFailureOutputsToDeadLetterQueue FAILED
    java.util.concurrent.ExecutionException at FirestoreV1IT.java:96
        Caused by: com.google.api.gax.rpc.InvalidArgumentException at ApiExceptionFactory.java:92
            Caused by: io.grpc.StatusRuntimeException at Status.java:539

org.apache.beam.sdk.io.gcp.firestore.it.FirestoreV1IT > batchGet FAILED
    java.util.concurrent.ExecutionException at AbstractFuture.java:588
        Caused by: com.google.api.gax.rpc.InvalidArgumentException at ApiExceptionFactory.java:92
            Caused by: io.grpc.StatusRuntimeException at Status.java:539

org.apache.beam.sdk.io.gcp.firestore.it.FirestoreV1IT > partitionQuery FAILED
    java.util.concurrent.ExecutionException at AbstractFuture.java:588
        Caused by: com.google.api.gax.rpc.InvalidArgumentException at ApiExceptionFactory.java:92
            Caused by: io.grpc.StatusRuntimeException at Status.java:539

org.apache.beam.sdk.io.gcp.firestore.it.FirestoreV1IT > listCollections FAILED
    java.util.concurrent.ExecutionException at AbstractFuture.java:588
        Caused by: com.google.api.gax.rpc.InvalidArgumentException at ApiExceptionFactory.java:92
            Caused by: io.grpc.StatusRuntimeException at Status.java:539

org.apache.beam.sdk.io.gcp.firestore.it.FirestoreV1IT > write FAILED
    java.lang.RuntimeException at TestDataflowRunner.java:141

org.apache.beam.sdk.io.gcp.firestore.it.FirestoreV1IT > runQuery FAILED
    java.util.concurrent.ExecutionException at AbstractFuture.java:588
        Caused by: com.google.api.gax.rpc.InvalidArgumentException at ApiExceptionFactory.java:92
            Caused by: io.grpc.StatusRuntimeException at Status.java:539

105 tests completed, 6 failed, 3 skipped

> Task :runners:google-cloud-dataflow-java:googleCloudPlatformLegacyWorkerIntegrationTest FAILED
> Task :runners:google-cloud-dataflow-java:googleCloudPlatformLegacyWorkerKmsIntegrationTest FROM-CACHE

FAILURE: Build failed with an exception.

* What went wrong:
Execution failed for task ':runners:google-cloud-dataflow-java:googleCloudPlatformLegacyWorkerIntegrationTest'.
> There were failing tests. See the report at: file://<https://ci-beam.apache.org/job/beam_PostCommit_Java_DataflowV1/ws/src/runners/google-cloud-dataflow-java/build/reports/tests/googleCloudPlatformLegacyWorkerIntegrationTest/index.html>

* Try:
> Run with --stacktrace option to get the stack trace.
> Run with --info or --debug option to get more log output.

* Get more help at https://help.gradle.org

Deprecated Gradle features were used in this build, making it incompatible with Gradle 8.0.

You can use '--warning-mode all' to show the individual deprecation warnings and determine if they come from your own scripts or plugins.

See https://docs.gradle.org/7.5.1/userguide/command_line_interface.html#sec:command_line_warnings

BUILD FAILED in 2h 16m 50s
149 actionable tasks: 88 executed, 59 from cache, 2 up-to-date

Publishing build scan...
https://ge.apache.org/s/q25c3atjt7mis

Build step 'Invoke Gradle script' changed build result to FAILURE
Build step 'Invoke Gradle script' marked build as failure

---------------------------------------------------------------------
To unsubscribe, e-mail: builds-unsubscribe@beam.apache.org
For additional commands, e-mail: builds-help@beam.apache.org