You are viewing a plain text version of this content. The canonical link for it is here.
Posted to builds@hbase.apache.org by Apache Jenkins Server <je...@builds.apache.org> on 2014/08/05 03:53:16 UTC

Build failed in Jenkins: HBase-TRUNK #5368

See <https://builds.apache.org/job/HBase-TRUNK/5368/changes>

Changes:

[ddas] HBASE-10674. HBCK should be updated to do replica related checks

------------------------------------------
[...truncated 568 lines...]
Running org.apache.hadoop.hbase.util.vint.TestVLongTool
Tests run: 6, Failures: 0, Errors: 0, Skipped: 0, Time elapsed: 1.245 sec

Results :

Tests run: 248, Failures: 0, Errors: 0, Skipped: 0

[INFO] 
[INFO] --- maven-surefire-plugin:2.12-TRUNK-HBASE-2:test (secondPartTestsExecution) @ hbase-prefix-tree ---
[INFO] Tests are skipped.
[INFO] 
[INFO] --- maven-source-plugin:2.2.1:jar-no-fork (attach-sources) @ hbase-prefix-tree ---
[INFO] Building jar: <https://builds.apache.org/job/HBase-TRUNK/ws/hbase-prefix-tree/target/hbase-prefix-tree-2.0.0-SNAPSHOT-sources.jar>
[INFO] 
[INFO] --- maven-jar-plugin:2.4:test-jar (default) @ hbase-prefix-tree ---
[INFO] Building jar: <https://builds.apache.org/job/HBase-TRUNK/ws/hbase-prefix-tree/target/hbase-prefix-tree-2.0.0-SNAPSHOT-tests.jar>
[INFO] 
[INFO] --- maven-jar-plugin:2.4:jar (default-jar) @ hbase-prefix-tree ---
[INFO] Building jar: <https://builds.apache.org/job/HBase-TRUNK/ws/hbase-prefix-tree/target/hbase-prefix-tree-2.0.0-SNAPSHOT.jar>
[INFO] 
[INFO] --- maven-install-plugin:2.3.1:install (default-install) @ hbase-prefix-tree ---
[INFO] Installing <https://builds.apache.org/job/HBase-TRUNK/ws/hbase-prefix-tree/target/hbase-prefix-tree-2.0.0-SNAPSHOT.jar> to /home/jenkins/.m2/repository/org/apache/hbase/hbase-prefix-tree/2.0.0-SNAPSHOT/hbase-prefix-tree-2.0.0-SNAPSHOT.jar
[INFO] Installing <https://builds.apache.org/job/HBase-TRUNK/ws/hbase-prefix-tree/pom.xml> to /home/jenkins/.m2/repository/org/apache/hbase/hbase-prefix-tree/2.0.0-SNAPSHOT/hbase-prefix-tree-2.0.0-SNAPSHOT.pom
[INFO] Installing <https://builds.apache.org/job/HBase-TRUNK/ws/hbase-prefix-tree/target/hbase-prefix-tree-2.0.0-SNAPSHOT-sources.jar> to /home/jenkins/.m2/repository/org/apache/hbase/hbase-prefix-tree/2.0.0-SNAPSHOT/hbase-prefix-tree-2.0.0-SNAPSHOT-sources.jar
[INFO] Installing <https://builds.apache.org/job/HBase-TRUNK/ws/hbase-prefix-tree/target/hbase-prefix-tree-2.0.0-SNAPSHOT-tests.jar> to /home/jenkins/.m2/repository/org/apache/hbase/hbase-prefix-tree/2.0.0-SNAPSHOT/hbase-prefix-tree-2.0.0-SNAPSHOT-tests.jar
[INFO]                                                                         
[INFO] ------------------------------------------------------------------------
[INFO] Building HBase - Server 2.0.0-SNAPSHOT
[INFO] ------------------------------------------------------------------------
[INFO] 
[INFO] --- maven-antrun-plugin:1.6:run (generate) @ hbase-server ---
[INFO] Executing tasks

main:
    [mkdir] Created dir: <https://builds.apache.org/job/HBase-TRUNK/ws/hbase-server/target/hbase-webapps>
     [copy] Copying 20 files to <https://builds.apache.org/job/HBase-TRUNK/ws/hbase-server/target/hbase-webapps>
log4j:WARN No appenders could be found for logger (org.mortbay.log).
log4j:WARN Please initialize the log4j system properly.
log4j:WARN See http://logging.apache.org/log4j/1.2/faq.html#noconfig for more info.
    [mkdir] Created dir: <https://builds.apache.org/job/HBase-TRUNK/ws/hbase-server/target/hbase-webapps/master/WEB-INF>
    [mkdir] Created dir: <https://builds.apache.org/job/HBase-TRUNK/ws/hbase-server/target/hbase-webapps/regionserver/WEB-INF>
    [mkdir] Created dir: <https://builds.apache.org/job/HBase-TRUNK/ws/hbase-server/target/hbase-webapps/rest/WEB-INF>
[INFO] Executed tasks
[INFO] 
[INFO] --- build-helper-maven-plugin:1.5:add-source (jspcSource-packageInfo-source) @ hbase-server ---
[INFO] Source directory: <https://builds.apache.org/job/HBase-TRUNK/ws/hbase-server/target/generated-jamon> added.
[INFO] Source directory: <https://builds.apache.org/job/HBase-TRUNK/ws/hbase-server/target/generated-sources/java> added.
[INFO] 
[INFO] --- jamon-maven-plugin:2.3.4:translate (default) @ hbase-server ---
[INFO] Translating 10 templates from <https://builds.apache.org/job/HBase-TRUNK/ws/hbase-server/src/main/jamon> to <https://builds.apache.org/job/HBase-TRUNK/ws/hbase-server/target/generated-jamon>
[INFO] 
[INFO] --- maven-remote-resources-plugin:1.4:process (default) @ hbase-server ---
[INFO] 
[INFO] --- maven-resources-plugin:2.6:resources (default-resources) @ hbase-server ---
[INFO] Using 'UTF-8' encoding to copy filtered resources.
[INFO] Copying 23 resources
[INFO] Copying 3 resources
[INFO] 
[INFO] --- maven-compiler-plugin:2.5.1:compile (default-compile) @ hbase-server ---
[INFO] Compiling 753 source files to <https://builds.apache.org/job/HBase-TRUNK/ws/hbase-server/target/classes>
[INFO] 
[INFO] --- maven-dependency-plugin:2.1:build-classpath (create-mrapp-generated-classpath) @ hbase-server ---
[INFO] Wrote classpath file '<https://builds.apache.org/job/HBase-TRUNK/ws/hbase-server/target/test-classes/mrapp-generated-classpath'.>
[INFO] 
[INFO] --- maven-resources-plugin:2.6:testResources (default-testResources) @ hbase-server ---
[INFO] Using 'UTF-8' encoding to copy filtered resources.
[INFO] Copying 11 resources
[INFO] Copying 3 resources
[INFO] 
[INFO] --- maven-compiler-plugin:2.5.1:testCompile (default-testCompile) @ hbase-server ---
[INFO] Compiling 643 source files to <https://builds.apache.org/job/HBase-TRUNK/ws/hbase-server/target/test-classes>
[INFO] -------------------------------------------------------------
[ERROR] COMPILATION ERROR : 
[INFO] -------------------------------------------------------------
[ERROR] <https://builds.apache.org/job/HBase-TRUNK/ws/hbase-server/src/test/java/org/apache/hadoop/hbase/http/ssl/KeyStoreTestUtil.java>:[46,24] AlgorithmId is internal proprietary API and may be removed in a future release
[ERROR] <https://builds.apache.org/job/HBase-TRUNK/ws/hbase-server/src/test/java/org/apache/hadoop/hbase/http/ssl/KeyStoreTestUtil.java>:[47,24] CertificateAlgorithmId is internal proprietary API and may be removed in a future release
[ERROR] <https://builds.apache.org/job/HBase-TRUNK/ws/hbase-server/src/test/java/org/apache/hadoop/hbase/http/ssl/KeyStoreTestUtil.java>:[48,24] CertificateIssuerName is internal proprietary API and may be removed in a future release
[ERROR] <https://builds.apache.org/job/HBase-TRUNK/ws/hbase-server/src/test/java/org/apache/hadoop/hbase/http/ssl/KeyStoreTestUtil.java>:[49,24] CertificateSerialNumber is internal proprietary API and may be removed in a future release
[ERROR] <https://builds.apache.org/job/HBase-TRUNK/ws/hbase-server/src/test/java/org/apache/hadoop/hbase/http/ssl/KeyStoreTestUtil.java>:[50,24] CertificateSubjectName is internal proprietary API and may be removed in a future release
[ERROR] <https://builds.apache.org/job/HBase-TRUNK/ws/hbase-server/src/test/java/org/apache/hadoop/hbase/http/ssl/KeyStoreTestUtil.java>:[51,24] CertificateValidity is internal proprietary API and may be removed in a future release
[ERROR] <https://builds.apache.org/job/HBase-TRUNK/ws/hbase-server/src/test/java/org/apache/hadoop/hbase/http/ssl/KeyStoreTestUtil.java>:[52,24] CertificateVersion is internal proprietary API and may be removed in a future release
[ERROR] <https://builds.apache.org/job/HBase-TRUNK/ws/hbase-server/src/test/java/org/apache/hadoop/hbase/http/ssl/KeyStoreTestUtil.java>:[53,24] CertificateX509Key is internal proprietary API and may be removed in a future release
[ERROR] <https://builds.apache.org/job/HBase-TRUNK/ws/hbase-server/src/test/java/org/apache/hadoop/hbase/http/ssl/KeyStoreTestUtil.java>:[54,24] X500Name is internal proprietary API and may be removed in a future release
[ERROR] <https://builds.apache.org/job/HBase-TRUNK/ws/hbase-server/src/test/java/org/apache/hadoop/hbase/http/ssl/KeyStoreTestUtil.java>:[55,24] X509CertImpl is internal proprietary API and may be removed in a future release
[ERROR] <https://builds.apache.org/job/HBase-TRUNK/ws/hbase-server/src/test/java/org/apache/hadoop/hbase/http/ssl/KeyStoreTestUtil.java>:[56,24] X509CertInfo is internal proprietary API and may be removed in a future release
[ERROR] <https://builds.apache.org/job/HBase-TRUNK/ws/hbase-server/src/test/java/org/apache/hadoop/hbase/http/ssl/KeyStoreTestUtil.java>:[85,4] X509CertInfo is internal proprietary API and may be removed in a future release
[ERROR] <https://builds.apache.org/job/HBase-TRUNK/ws/hbase-server/src/test/java/org/apache/hadoop/hbase/http/ssl/KeyStoreTestUtil.java>:[85,28] X509CertInfo is internal proprietary API and may be removed in a future release
[ERROR] <https://builds.apache.org/job/HBase-TRUNK/ws/hbase-server/src/test/java/org/apache/hadoop/hbase/http/ssl/KeyStoreTestUtil.java>:[88,4] CertificateValidity is internal proprietary API and may be removed in a future release
[ERROR] <https://builds.apache.org/job/HBase-TRUNK/ws/hbase-server/src/test/java/org/apache/hadoop/hbase/http/ssl/KeyStoreTestUtil.java>:[88,39] CertificateValidity is internal proprietary API and may be removed in a future release
[ERROR] <https://builds.apache.org/job/HBase-TRUNK/ws/hbase-server/src/test/java/org/apache/hadoop/hbase/http/ssl/KeyStoreTestUtil.java>:[90,4] X500Name is internal proprietary API and may be removed in a future release
[ERROR] <https://builds.apache.org/job/HBase-TRUNK/ws/hbase-server/src/test/java/org/apache/hadoop/hbase/http/ssl/KeyStoreTestUtil.java>:[90,25] X500Name is internal proprietary API and may be removed in a future release
[ERROR] <https://builds.apache.org/job/HBase-TRUNK/ws/hbase-server/src/test/java/org/apache/hadoop/hbase/http/ssl/KeyStoreTestUtil.java>:[92,13] X509CertInfo is internal proprietary API and may be removed in a future release
[ERROR] <https://builds.apache.org/job/HBase-TRUNK/ws/hbase-server/src/test/java/org/apache/hadoop/hbase/http/ssl/KeyStoreTestUtil.java>:[93,13] X509CertInfo is internal proprietary API and may be removed in a future release
[ERROR] <https://builds.apache.org/job/HBase-TRUNK/ws/hbase-server/src/test/java/org/apache/hadoop/hbase/http/ssl/KeyStoreTestUtil.java>:[93,45] CertificateSerialNumber is internal proprietary API and may be removed in a future release
[ERROR] <https://builds.apache.org/job/HBase-TRUNK/ws/hbase-server/src/test/java/org/apache/hadoop/hbase/http/ssl/KeyStoreTestUtil.java>:[94,13] X509CertInfo is internal proprietary API and may be removed in a future release
[ERROR] <https://builds.apache.org/job/HBase-TRUNK/ws/hbase-server/src/test/java/org/apache/hadoop/hbase/http/ssl/KeyStoreTestUtil.java>:[94,39] CertificateSubjectName is internal proprietary API and may be removed in a future release
[ERROR] <https://builds.apache.org/job/HBase-TRUNK/ws/hbase-server/src/test/java/org/apache/hadoop/hbase/http/ssl/KeyStoreTestUtil.java>:[95,13] X509CertInfo is internal proprietary API and may be removed in a future release
[ERROR] <https://builds.apache.org/job/HBase-TRUNK/ws/hbase-server/src/test/java/org/apache/hadoop/hbase/http/ssl/KeyStoreTestUtil.java>:[95,38] CertificateIssuerName is internal proprietary API and may be removed in a future release
[ERROR] <https://builds.apache.org/job/HBase-TRUNK/ws/hbase-server/src/test/java/org/apache/hadoop/hbase/http/ssl/KeyStoreTestUtil.java>:[96,13] X509CertInfo is internal proprietary API and may be removed in a future release
[ERROR] <https://builds.apache.org/job/HBase-TRUNK/ws/hbase-server/src/test/java/org/apache/hadoop/hbase/http/ssl/KeyStoreTestUtil.java>:[96,35] CertificateX509Key is internal proprietary API and may be removed in a future release
[ERROR] <https://builds.apache.org/job/HBase-TRUNK/ws/hbase-server/src/test/java/org/apache/hadoop/hbase/http/ssl/KeyStoreTestUtil.java>:[98,11] X509CertInfo is internal proprietary API and may be removed in a future release
[ERROR] <https://builds.apache.org/job/HBase-TRUNK/ws/hbase-server/src/test/java/org/apache/hadoop/hbase/http/ssl/KeyStoreTestUtil.java>:[98,37] CertificateVersion is internal proprietary API and may be removed in a future release
[ERROR] <https://builds.apache.org/job/HBase-TRUNK/ws/hbase-server/src/test/java/org/apache/hadoop/hbase/http/ssl/KeyStoreTestUtil.java>:[98,56] CertificateVersion is internal proprietary API and may be removed in a future release
[ERROR] <https://builds.apache.org/job/HBase-TRUNK/ws/hbase-server/src/test/java/org/apache/hadoop/hbase/http/ssl/KeyStoreTestUtil.java>:[99,4] AlgorithmId is internal proprietary API and may be removed in a future release
[ERROR] <https://builds.apache.org/job/HBase-TRUNK/ws/hbase-server/src/test/java/org/apache/hadoop/hbase/http/ssl/KeyStoreTestUtil.java>:[99,27] AlgorithmId is internal proprietary API and may be removed in a future release
[ERROR] <https://builds.apache.org/job/HBase-TRUNK/ws/hbase-server/src/test/java/org/apache/hadoop/hbase/http/ssl/KeyStoreTestUtil.java>:[99,39] AlgorithmId is internal proprietary API and may be removed in a future release
[ERROR] <https://builds.apache.org/job/HBase-TRUNK/ws/hbase-server/src/test/java/org/apache/hadoop/hbase/http/ssl/KeyStoreTestUtil.java>:[100,13] X509CertInfo is internal proprietary API and may be removed in a future release
[ERROR] <https://builds.apache.org/job/HBase-TRUNK/ws/hbase-server/src/test/java/org/apache/hadoop/hbase/http/ssl/KeyStoreTestUtil.java>:[100,44] CertificateAlgorithmId is internal proprietary API and may be removed in a future release
[ERROR] <https://builds.apache.org/job/HBase-TRUNK/ws/hbase-server/src/test/java/org/apache/hadoop/hbase/http/ssl/KeyStoreTestUtil.java>:[103,4] X509CertImpl is internal proprietary API and may be removed in a future release
[ERROR] <https://builds.apache.org/job/HBase-TRUNK/ws/hbase-server/src/test/java/org/apache/hadoop/hbase/http/ssl/KeyStoreTestUtil.java>:[103,28] X509CertImpl is internal proprietary API and may be removed in a future release
[ERROR] <https://builds.apache.org/job/HBase-TRUNK/ws/hbase-server/src/test/java/org/apache/hadoop/hbase/http/ssl/KeyStoreTestUtil.java>:[107,12] AlgorithmId is internal proprietary API and may be removed in a future release
[ERROR] <https://builds.apache.org/job/HBase-TRUNK/ws/hbase-server/src/test/java/org/apache/hadoop/hbase/http/ssl/KeyStoreTestUtil.java>:[107,34] X509CertImpl is internal proprietary API and may be removed in a future release
[ERROR] <https://builds.apache.org/job/HBase-TRUNK/ws/hbase-server/src/test/java/org/apache/hadoop/hbase/http/ssl/KeyStoreTestUtil.java>:[109,11] CertificateAlgorithmId is internal proprietary API and may be removed in a future release
[ERROR] <https://builds.apache.org/job/HBase-TRUNK/ws/hbase-server/src/test/java/org/apache/hadoop/hbase/http/ssl/KeyStoreTestUtil.java>:[109,47] CertificateAlgorithmId is internal proprietary API and may be removed in a future release
[ERROR] <https://builds.apache.org/job/HBase-TRUNK/ws/hbase-server/src/test/java/org/apache/hadoop/hbase/http/ssl/KeyStoreTestUtil.java>:[111,15] X509CertImpl is internal proprietary API and may be removed in a future release
[ERROR] <https://builds.apache.org/job/HBase-TRUNK/ws/hbase-server/src/test/java/org/apache/hadoop/hbase/util/TestHBaseFsck.java>:[660,21] error: method fixUnassigned in class HBaseFsckRepair cannot be applied to given types;
[ERROR]   required: HBaseAdmin,HRegionInfo
  found: Admin,HRegionInfo
  reason: actual argument Admin cannot be converted to HBaseAdmin by method invocation conversion
<https://builds.apache.org/job/HBase-TRUNK/ws/hbase-server/src/test/java/org/apache/hadoop/hbase/util/TestHBaseFsck.java>:[661,21] error: method waitUntilAssigned in class HBaseFsckRepair cannot be applied to given types;
[INFO] 43 errors 
[INFO] -------------------------------------------------------------
[INFO] ------------------------------------------------------------------------
[INFO] Reactor Summary:
[INFO] 
[INFO] HBase ............................................. SUCCESS [2.426s]
[INFO] HBase - Common .................................... SUCCESS [28.927s]
[INFO] HBase - Protocol .................................. SUCCESS [8.773s]
[INFO] HBase - Client .................................... SUCCESS [54.240s]
[INFO] HBase - Hadoop Compatibility ...................... SUCCESS [5.289s]
[INFO] HBase - Hadoop Two Compatibility .................. SUCCESS [1.532s]
[INFO] HBase - Prefix Tree ............................... SUCCESS [3.256s]
[INFO] HBase - Server .................................... FAILURE [9.893s]
[INFO] HBase - Testing Util .............................. SKIPPED
[INFO] HBase - Thrift .................................... SKIPPED
[INFO] HBase - Shell ..................................... SKIPPED
[INFO] HBase - Integration Tests ......................... SKIPPED
[INFO] HBase - Examples .................................. SKIPPED
[INFO] HBase - Assembly .................................. SKIPPED
[INFO] ------------------------------------------------------------------------
[INFO] BUILD FAILURE
[INFO] ------------------------------------------------------------------------
[INFO] Total time: 1:55.093s
[INFO] Finished at: Tue Aug 05 01:50:36 UTC 2014
[INFO] Final Memory: 82M/1131M
[INFO] ------------------------------------------------------------------------
[ERROR] Failed to execute goal org.apache.maven.plugins:maven-compiler-plugin:2.5.1:testCompile (default-testCompile) on project hbase-server: Compilation failure: Compilation failure:
[ERROR] <https://builds.apache.org/job/HBase-TRUNK/ws/hbase-server/src/test/java/org/apache/hadoop/hbase/http/ssl/KeyStoreTestUtil.java>:[46,24] AlgorithmId is internal proprietary API and may be removed in a future release
[ERROR] <https://builds.apache.org/job/HBase-TRUNK/ws/hbase-server/src/test/java/org/apache/hadoop/hbase/http/ssl/KeyStoreTestUtil.java>:[47,24] CertificateAlgorithmId is internal proprietary API and may be removed in a future release
[ERROR] <https://builds.apache.org/job/HBase-TRUNK/ws/hbase-server/src/test/java/org/apache/hadoop/hbase/http/ssl/KeyStoreTestUtil.java>:[48,24] CertificateIssuerName is internal proprietary API and may be removed in a future release
[ERROR] <https://builds.apache.org/job/HBase-TRUNK/ws/hbase-server/src/test/java/org/apache/hadoop/hbase/http/ssl/KeyStoreTestUtil.java>:[49,24] CertificateSerialNumber is internal proprietary API and may be removed in a future release
[ERROR] <https://builds.apache.org/job/HBase-TRUNK/ws/hbase-server/src/test/java/org/apache/hadoop/hbase/http/ssl/KeyStoreTestUtil.java>:[50,24] CertificateSubjectName is internal proprietary API and may be removed in a future release
[ERROR] <https://builds.apache.org/job/HBase-TRUNK/ws/hbase-server/src/test/java/org/apache/hadoop/hbase/http/ssl/KeyStoreTestUtil.java>:[51,24] CertificateValidity is internal proprietary API and may be removed in a future release
[ERROR] <https://builds.apache.org/job/HBase-TRUNK/ws/hbase-server/src/test/java/org/apache/hadoop/hbase/http/ssl/KeyStoreTestUtil.java>:[52,24] CertificateVersion is internal proprietary API and may be removed in a future release
[ERROR] <https://builds.apache.org/job/HBase-TRUNK/ws/hbase-server/src/test/java/org/apache/hadoop/hbase/http/ssl/KeyStoreTestUtil.java>:[53,24] CertificateX509Key is internal proprietary API and may be removed in a future release
[ERROR] <https://builds.apache.org/job/HBase-TRUNK/ws/hbase-server/src/test/java/org/apache/hadoop/hbase/http/ssl/KeyStoreTestUtil.java>:[54,24] X500Name is internal proprietary API and may be removed in a future release
[ERROR] <https://builds.apache.org/job/HBase-TRUNK/ws/hbase-server/src/test/java/org/apache/hadoop/hbase/http/ssl/KeyStoreTestUtil.java>:[55,24] X509CertImpl is internal proprietary API and may be removed in a future release
[ERROR] <https://builds.apache.org/job/HBase-TRUNK/ws/hbase-server/src/test/java/org/apache/hadoop/hbase/http/ssl/KeyStoreTestUtil.java>:[56,24] X509CertInfo is internal proprietary API and may be removed in a future release
[ERROR] <https://builds.apache.org/job/HBase-TRUNK/ws/hbase-server/src/test/java/org/apache/hadoop/hbase/http/ssl/KeyStoreTestUtil.java>:[85,4] X509CertInfo is internal proprietary API and may be removed in a future release
[ERROR] <https://builds.apache.org/job/HBase-TRUNK/ws/hbase-server/src/test/java/org/apache/hadoop/hbase/http/ssl/KeyStoreTestUtil.java>:[85,28] X509CertInfo is internal proprietary API and may be removed in a future release
[ERROR] <https://builds.apache.org/job/HBase-TRUNK/ws/hbase-server/src/test/java/org/apache/hadoop/hbase/http/ssl/KeyStoreTestUtil.java>:[88,4] CertificateValidity is internal proprietary API and may be removed in a future release
[ERROR] <https://builds.apache.org/job/HBase-TRUNK/ws/hbase-server/src/test/java/org/apache/hadoop/hbase/http/ssl/KeyStoreTestUtil.java>:[88,39] CertificateValidity is internal proprietary API and may be removed in a future release
[ERROR] <https://builds.apache.org/job/HBase-TRUNK/ws/hbase-server/src/test/java/org/apache/hadoop/hbase/http/ssl/KeyStoreTestUtil.java>:[90,4] X500Name is internal proprietary API and may be removed in a future release
[ERROR] <https://builds.apache.org/job/HBase-TRUNK/ws/hbase-server/src/test/java/org/apache/hadoop/hbase/http/ssl/KeyStoreTestUtil.java>:[90,25] X500Name is internal proprietary API and may be removed in a future release
[ERROR] <https://builds.apache.org/job/HBase-TRUNK/ws/hbase-server/src/test/java/org/apache/hadoop/hbase/http/ssl/KeyStoreTestUtil.java>:[92,13] X509CertInfo is internal proprietary API and may be removed in a future release
[ERROR] <https://builds.apache.org/job/HBase-TRUNK/ws/hbase-server/src/test/java/org/apache/hadoop/hbase/http/ssl/KeyStoreTestUtil.java>:[93,13] X509CertInfo is internal proprietary API and may be removed in a future release
[ERROR] <https://builds.apache.org/job/HBase-TRUNK/ws/hbase-server/src/test/java/org/apache/hadoop/hbase/http/ssl/KeyStoreTestUtil.java>:[93,45] CertificateSerialNumber is internal proprietary API and may be removed in a future release
[ERROR] <https://builds.apache.org/job/HBase-TRUNK/ws/hbase-server/src/test/java/org/apache/hadoop/hbase/http/ssl/KeyStoreTestUtil.java>:[94,13] X509CertInfo is internal proprietary API and may be removed in a future release
[ERROR] <https://builds.apache.org/job/HBase-TRUNK/ws/hbase-server/src/test/java/org/apache/hadoop/hbase/http/ssl/KeyStoreTestUtil.java>:[94,39] CertificateSubjectName is internal proprietary API and may be removed in a future release
[ERROR] <https://builds.apache.org/job/HBase-TRUNK/ws/hbase-server/src/test/java/org/apache/hadoop/hbase/http/ssl/KeyStoreTestUtil.java>:[95,13] X509CertInfo is internal proprietary API and may be removed in a future release
[ERROR] <https://builds.apache.org/job/HBase-TRUNK/ws/hbase-server/src/test/java/org/apache/hadoop/hbase/http/ssl/KeyStoreTestUtil.java>:[95,38] CertificateIssuerName is internal proprietary API and may be removed in a future release
[ERROR] <https://builds.apache.org/job/HBase-TRUNK/ws/hbase-server/src/test/java/org/apache/hadoop/hbase/http/ssl/KeyStoreTestUtil.java>:[96,13] X509CertInfo is internal proprietary API and may be removed in a future release
[ERROR] <https://builds.apache.org/job/HBase-TRUNK/ws/hbase-server/src/test/java/org/apache/hadoop/hbase/http/ssl/KeyStoreTestUtil.java>:[96,35] CertificateX509Key is internal proprietary API and may be removed in a future release
[ERROR] <https://builds.apache.org/job/HBase-TRUNK/ws/hbase-server/src/test/java/org/apache/hadoop/hbase/http/ssl/KeyStoreTestUtil.java>:[98,11] X509CertInfo is internal proprietary API and may be removed in a future release
[ERROR] <https://builds.apache.org/job/HBase-TRUNK/ws/hbase-server/src/test/java/org/apache/hadoop/hbase/http/ssl/KeyStoreTestUtil.java>:[98,37] CertificateVersion is internal proprietary API and may be removed in a future release
[ERROR] <https://builds.apache.org/job/HBase-TRUNK/ws/hbase-server/src/test/java/org/apache/hadoop/hbase/http/ssl/KeyStoreTestUtil.java>:[98,56] CertificateVersion is internal proprietary API and may be removed in a future release
[ERROR] <https://builds.apache.org/job/HBase-TRUNK/ws/hbase-server/src/test/java/org/apache/hadoop/hbase/http/ssl/KeyStoreTestUtil.java>:[99,4] AlgorithmId is internal proprietary API and may be removed in a future release
[ERROR] <https://builds.apache.org/job/HBase-TRUNK/ws/hbase-server/src/test/java/org/apache/hadoop/hbase/http/ssl/KeyStoreTestUtil.java>:[99,27] AlgorithmId is internal proprietary API and may be removed in a future release
[ERROR] <https://builds.apache.org/job/HBase-TRUNK/ws/hbase-server/src/test/java/org/apache/hadoop/hbase/http/ssl/KeyStoreTestUtil.java>:[99,39] AlgorithmId is internal proprietary API and may be removed in a future release
[ERROR] <https://builds.apache.org/job/HBase-TRUNK/ws/hbase-server/src/test/java/org/apache/hadoop/hbase/http/ssl/KeyStoreTestUtil.java>:[100,13] X509CertInfo is internal proprietary API and may be removed in a future release
[ERROR] <https://builds.apache.org/job/HBase-TRUNK/ws/hbase-server/src/test/java/org/apache/hadoop/hbase/http/ssl/KeyStoreTestUtil.java>:[100,44] CertificateAlgorithmId is internal proprietary API and may be removed in a future release
[ERROR] <https://builds.apache.org/job/HBase-TRUNK/ws/hbase-server/src/test/java/org/apache/hadoop/hbase/http/ssl/KeyStoreTestUtil.java>:[103,4] X509CertImpl is internal proprietary API and may be removed in a future release
[ERROR] <https://builds.apache.org/job/HBase-TRUNK/ws/hbase-server/src/test/java/org/apache/hadoop/hbase/http/ssl/KeyStoreTestUtil.java>:[103,28] X509CertImpl is internal proprietary API and may be removed in a future release
[ERROR] <https://builds.apache.org/job/HBase-TRUNK/ws/hbase-server/src/test/java/org/apache/hadoop/hbase/http/ssl/KeyStoreTestUtil.java>:[107,12] AlgorithmId is internal proprietary API and may be removed in a future release
[ERROR] <https://builds.apache.org/job/HBase-TRUNK/ws/hbase-server/src/test/java/org/apache/hadoop/hbase/http/ssl/KeyStoreTestUtil.java>:[107,34] X509CertImpl is internal proprietary API and may be removed in a future release
[ERROR] <https://builds.apache.org/job/HBase-TRUNK/ws/hbase-server/src/test/java/org/apache/hadoop/hbase/http/ssl/KeyStoreTestUtil.java>:[109,11] CertificateAlgorithmId is internal proprietary API and may be removed in a future release
[ERROR] <https://builds.apache.org/job/HBase-TRUNK/ws/hbase-server/src/test/java/org/apache/hadoop/hbase/http/ssl/KeyStoreTestUtil.java>:[109,47] CertificateAlgorithmId is internal proprietary API and may be removed in a future release
[ERROR] <https://builds.apache.org/job/HBase-TRUNK/ws/hbase-server/src/test/java/org/apache/hadoop/hbase/http/ssl/KeyStoreTestUtil.java>:[111,15] X509CertImpl is internal proprietary API and may be removed in a future release
[ERROR] <https://builds.apache.org/job/HBase-TRUNK/ws/hbase-server/src/test/java/org/apache/hadoop/hbase/util/TestHBaseFsck.java>:[660,21] error: method fixUnassigned in class HBaseFsckRepair cannot be applied to given types;
[ERROR] required: HBaseAdmin,HRegionInfo
[ERROR] found: Admin,HRegionInfo
[ERROR] reason: actual argument Admin cannot be converted to HBaseAdmin by method invocation conversion
[ERROR] <https://builds.apache.org/job/HBase-TRUNK/ws/hbase-server/src/test/java/org/apache/hadoop/hbase/util/TestHBaseFsck.java>:[661,21] error: method waitUntilAssigned in class HBaseFsckRepair cannot be applied to given types;
[ERROR] -> [Help 1]
[ERROR] 
[ERROR] To see the full stack trace of the errors, re-run Maven with the -e switch.
[ERROR] Re-run Maven using the -X switch to enable full debug logging.
[ERROR] 
[ERROR] For more information about the errors and possible solutions, please read the following articles:
[ERROR] [Help 1] http://cwiki.apache.org/confluence/display/MAVEN/MojoFailureException
[ERROR] 
[ERROR] After correcting the problems, you can resume the build with the command
[ERROR]   mvn <goals> -rf :hbase-server
Build step 'Invoke top-level Maven targets' marked build as failure
Performing Post build task...
Match found for :.* : True
Logical operation result is TRUE
Running script  :   ZOMBIE_TESTS_COUNT=`jps | grep surefirebooter | wc -l`
  if [[ $ZOMBIE_TESTS_COUNT != 0 ]] ; then
    #It seems sometimes the tests are not dying immediately. Let's give them 10s
    echo "Suspicious java process found - waiting 10s to see if there are just slow to stop"
    sleep 10   
    ZOMBIE_TESTS_COUNT=`jps | grep surefirebooter | wc -l`
    if [[ $ZOMBIE_TESTS_COUNT != 0 ]] ; then
      echo "There are $ZOMBIE_TESTS_COUNT zombie tests, they should have been killed by surefire but survived"
      echo "************ BEGIN zombies jstack extract"
      ZB_STACK=`jps | grep surefirebooter | cut -d ' ' -f 1 | xargs -n 1 jstack | grep ".test" | grep "\.java"`
      jps | grep surefirebooter | cut -d ' ' -f 1 | xargs -n 1 jstack
      echo "************ END  zombies jstack extract"
      JIRA_COMMENT="$JIRA_COMMENT

     {color:red}-1 core zombie tests{color}.  There are ${ZOMBIE_TESTS_COUNT} zombie test(s): ${ZB_STACK}"
      BAD=1
      jps | grep surefirebooter | cut -d ' ' -f 1 | xargs kill -9
    else
      echo "We're ok: there is no zombie test, but some tests took some time to stop"
    fi
  else
    echo "We're ok: there is no zombie test"
  fi
[HBase-TRUNK] $ /bin/bash -xe /tmp/hudson4481831483986699270.sh
++ jps
++ wc -l
++ grep surefirebooter
+ ZOMBIE_TESTS_COUNT=0
+ [[ 0 != 0 ]]
+ echo 'We'\''re ok: there is no zombie test'
We're ok: there is no zombie test
POST BUILD TASK : SUCCESS
END OF POST BUILD TASK : 0
Archiving artifacts
Sending artifact delta relative to HBase-TRUNK #5346
Archived 191 artifacts
Archive block size is 32768
Received 7 blocks and 646392 bytes
Compression is 26.2%
Took 45 sec
Recording test results
Updating HBASE-10674

Build failed in Jenkins: HBase-TRUNK #5378

Posted by Apache Jenkins Server <je...@builds.apache.org>.
See <https://builds.apache.org/job/HBase-TRUNK/5378/changes>

Changes:

[anoopsamjohn] HBASE-11527 Cluster free memory limit check should consider L2 block cache size also when L2 cache is onheap. (Anoop)

------------------------------------------
[...truncated 1568 lines...]
Tests run: 1, Failures: 0, Errors: 0, Skipped: 0, Time elapsed: 17.409 sec
Running org.apache.hadoop.hbase.client.TestHCM
Tests run: 21, Failures: 0, Errors: 0, Skipped: 2, Time elapsed: 156.943 sec
Running org.apache.hadoop.hbase.client.TestRpcControllerFactory
Tests run: 1, Failures: 0, Errors: 0, Skipped: 0, Time elapsed: 10.687 sec
Running org.apache.hadoop.hbase.client.TestScannersFromClientSide
Tests run: 5, Failures: 0, Errors: 0, Skipped: 0, Time elapsed: 15.139 sec
Running org.apache.hadoop.hbase.client.TestClientOperationInterrupt
Tests run: 1, Failures: 0, Errors: 0, Skipped: 0, Time elapsed: 63.597 sec
Running org.apache.hadoop.hbase.client.TestFromClientSide
Tests run: 79, Failures: 0, Errors: 0, Skipped: 4, Time elapsed: 103.756 sec
Running org.apache.hadoop.hbase.client.TestRestoreSnapshotFromClientWithRegionReplicas
Tests run: 5, Failures: 0, Errors: 0, Skipped: 0, Time elapsed: 92.178 sec
Running org.apache.hadoop.hbase.client.TestReplicaWithCluster
Tests run: 4, Failures: 0, Errors: 0, Skipped: 0, Time elapsed: 37.793 sec
Running org.apache.hadoop.hbase.client.TestHTableMultiplexer
Tests run: 1, Failures: 0, Errors: 0, Skipped: 0, Time elapsed: 14.833 sec
Running org.apache.hadoop.hbase.client.TestScannerTimeout
Tests run: 4, Failures: 0, Errors: 0, Skipped: 0, Time elapsed: 48.211 sec
Running org.apache.hadoop.hbase.client.TestAdmin
Tests run: 46, Failures: 0, Errors: 0, Skipped: 0, Time elapsed: 497.829 sec
Running org.apache.hadoop.hbase.client.TestTableSnapshotScanner
Tests run: 3, Failures: 0, Errors: 0, Skipped: 0, Time elapsed: 40.347 sec
Running org.apache.hadoop.hbase.client.TestFromClientSide3
Tests run: 6, Failures: 0, Errors: 0, Skipped: 0, Time elapsed: 39.794 sec
Running org.apache.hadoop.hbase.client.TestRestoreSnapshotFromClient
Tests run: 5, Failures: 0, Errors: 0, Skipped: 0, Time elapsed: 81.841 sec
Running org.apache.hadoop.hbase.client.TestSnapshotMetadata
Tests run: 4, Failures: 0, Errors: 0, Skipped: 0, Time elapsed: 20.782 sec
Running org.apache.hadoop.hbase.TestMultiVersions
Tests run: 3, Failures: 0, Errors: 0, Skipped: 0, Time elapsed: 14.36 sec
Running org.apache.hadoop.hbase.TestHColumnDescriptorDefaultVersions
Tests run: 3, Failures: 0, Errors: 0, Skipped: 0, Time elapsed: 20.822 sec
Running org.apache.hadoop.hbase.procedure.TestZKProcedure
Tests run: 4, Failures: 0, Errors: 0, Skipped: 0, Time elapsed: 3.177 sec
Running org.apache.hadoop.hbase.procedure.TestZKProcedureControllers
Tests run: 4, Failures: 0, Errors: 0, Skipped: 0, Time elapsed: 2.691 sec
Running org.apache.hadoop.hbase.TestNamespace
Tests run: 9, Failures: 0, Errors: 0, Skipped: 1, Time elapsed: 16.471 sec
Running org.apache.hadoop.hbase.constraint.TestConstraint
Tests run: 5, Failures: 0, Errors: 0, Skipped: 0, Time elapsed: 14.488 sec
Running org.apache.hadoop.hbase.rest.TestDeleteRow
Tests run: 2, Failures: 0, Errors: 0, Skipped: 0, Time elapsed: 13.931 sec
Running org.apache.hadoop.hbase.rest.TestTableResource
Tests run: 8, Failures: 0, Errors: 0, Skipped: 0, Time elapsed: 27.096 sec
Running org.apache.hadoop.hbase.rest.TestScannersWithLabels
Tests run: 2, Failures: 0, Errors: 0, Skipped: 0, Time elapsed: 12.588 sec
Running org.apache.hadoop.hbase.rest.TestTableScan
Tests run: 10, Failures: 0, Errors: 0, Skipped: 0, Time elapsed: 36.339 sec
Running org.apache.hadoop.hbase.rest.TestSchemaResource
Tests run: 2, Failures: 0, Errors: 0, Skipped: 0, Time elapsed: 12.928 sec
Running org.apache.hadoop.hbase.rest.TestGetAndPutResource
Tests run: 18, Failures: 0, Errors: 0, Skipped: 0, Time elapsed: 29.173 sec
Running org.apache.hadoop.hbase.rest.TestStatusResource
Tests run: 2, Failures: 0, Errors: 0, Skipped: 0, Time elapsed: 12.996 sec
Running org.apache.hadoop.hbase.rest.TestResourceFilter
Tests run: 1, Failures: 0, Errors: 0, Skipped: 0, Time elapsed: 10.982 sec
Running org.apache.hadoop.hbase.rest.client.TestRemoteTable
Tests run: 9, Failures: 0, Errors: 0, Skipped: 0, Time elapsed: 19.251 sec
Running org.apache.hadoop.hbase.rest.TestVersionResource
Tests run: 7, Failures: 0, Errors: 0, Skipped: 0, Time elapsed: 11.804 sec
Running org.apache.hadoop.hbase.rest.TestScannersWithFilters
Tests run: 10, Failures: 0, Errors: 0, Skipped: 0, Time elapsed: 16.185 sec
Running org.apache.hadoop.hbase.rest.TestMultiRowResource
Tests run: 3, Failures: 0, Errors: 0, Skipped: 0, Time elapsed: 12.927 sec
Running org.apache.hadoop.hbase.rest.TestGzipFilter
Tests run: 2, Failures: 0, Errors: 0, Skipped: 0, Time elapsed: 11.831 sec
Running org.apache.hadoop.hbase.rest.TestScannerResource
Tests run: 5, Failures: 0, Errors: 0, Skipped: 0, Time elapsed: 31.573 sec
Running org.apache.hadoop.hbase.TestZooKeeper
Tests run: 11, Failures: 0, Errors: 0, Skipped: 0, Time elapsed: 217.849 sec
Running org.apache.hadoop.hbase.snapshot.TestFlushSnapshotFromClient
Tests run: 9, Failures: 0, Errors: 0, Skipped: 0, Time elapsed: 51.718 sec
Running org.apache.hadoop.hbase.snapshot.TestExportSnapshot
Tests run: 9, Failures: 0, Errors: 0, Skipped: 0, Time elapsed: 317.06 sec
Running org.apache.hadoop.hbase.snapshot.TestRestoreFlushSnapshotFromClient
Tests run: 5, Failures: 0, Errors: 0, Skipped: 0, Time elapsed: 56.698 sec
Running org.apache.hadoop.hbase.snapshot.TestSnapshotDescriptionUtils
Tests run: 2, Failures: 0, Errors: 0, Skipped: 0, Time elapsed: 1.536 sec
Running org.apache.hadoop.hbase.snapshot.TestSecureExportSnapshot
Tests run: 9, Failures: 0, Errors: 0, Skipped: 0, Time elapsed: 321.385 sec
Running org.apache.hadoop.hbase.coprocessor.TestRegionObserverScannerOpenHook
Tests run: 3, Failures: 0, Errors: 0, Skipped: 0, Time elapsed: 10.927 sec
Running org.apache.hadoop.hbase.TestIOFencing
Tests run: 2, Failures: 0, Errors: 0, Skipped: 0, Time elapsed: 198.576 sec
Running org.apache.hadoop.hbase.coprocessor.TestOpenTableInCoprocessor
Tests run: 2, Failures: 0, Errors: 0, Skipped: 0, Time elapsed: 14.21 sec
Running org.apache.hadoop.hbase.coprocessor.TestMasterCoprocessorExceptionWithAbort
Tests run: 1, Failures: 0, Errors: 0, Skipped: 0, Time elapsed: 25.735 sec
Running org.apache.hadoop.hbase.coprocessor.TestMasterCoprocessorExceptionWithRemove
Tests run: 1, Failures: 0, Errors: 0, Skipped: 0, Time elapsed: 13.081 sec
Running org.apache.hadoop.hbase.coprocessor.TestRegionObserverInterface
Tests run: 12, Failures: 0, Errors: 0, Skipped: 0, Time elapsed: 43.995 sec
Running org.apache.hadoop.hbase.coprocessor.TestAggregateProtocol
Tests run: 44, Failures: 0, Errors: 0, Skipped: 0, Time elapsed: 14.618 sec
Running org.apache.hadoop.hbase.coprocessor.TestBatchCoprocessorEndpoint
Tests run: 4, Failures: 0, Errors: 0, Skipped: 0, Time elapsed: 12.29 sec
Running org.apache.hadoop.hbase.coprocessor.TestHTableWrapper
Tests run: 1, Failures: 0, Errors: 0, Skipped: 0, Time elapsed: 12.212 sec
Running org.apache.hadoop.hbase.coprocessor.TestRegionServerObserver
Tests run: 1, Failures: 0, Errors: 0, Skipped: 0, Time elapsed: 13.624 sec
Running org.apache.hadoop.hbase.coprocessor.TestClassLoading
Tests run: 8, Failures: 0, Errors: 0, Skipped: 0, Time elapsed: 22.997 sec
Running org.apache.hadoop.hbase.coprocessor.TestRegionServerCoprocessorExceptionWithAbort
Tests run: 2, Failures: 0, Errors: 0, Skipped: 0, Time elapsed: 17.658 sec
Running org.apache.hadoop.hbase.coprocessor.TestDoubleColumnInterpreter
Tests run: 38, Failures: 0, Errors: 0, Skipped: 0, Time elapsed: 14.334 sec
Running org.apache.hadoop.hbase.coprocessor.TestRegionObserverBypass
Tests run: 2, Failures: 0, Errors: 0, Skipped: 0, Time elapsed: 11.239 sec
Running org.apache.hadoop.hbase.coprocessor.TestRowProcessorEndpoint
Tests run: 4, Failures: 0, Errors: 0, Skipped: 0, Time elapsed: 16.222 sec
Running org.apache.hadoop.hbase.coprocessor.TestCoprocessorStop
Tests run: 1, Failures: 0, Errors: 0, Skipped: 0, Time elapsed: 25.1 sec
Running org.apache.hadoop.hbase.coprocessor.TestRegionServerCoprocessorExceptionWithRemove
Tests run: 1, Failures: 0, Errors: 0, Skipped: 0, Time elapsed: 21.427 sec
Running org.apache.hadoop.hbase.coprocessor.TestBigDecimalColumnInterpreter
Tests run: 38, Failures: 0, Errors: 0, Skipped: 0, Time elapsed: 13.613 sec
Running org.apache.hadoop.hbase.coprocessor.TestCoprocessorEndpoint
Tests run: 6, Failures: 0, Errors: 0, Skipped: 0, Time elapsed: 12.748 sec
Running org.apache.hadoop.hbase.coprocessor.TestMasterObserver
Tests run: 6, Failures: 0, Errors: 0, Skipped: 0, Time elapsed: 18.714 sec
Running org.apache.hadoop.hbase.TestGlobalMemStoreSize
Tests run: 1, Failures: 0, Errors: 0, Skipped: 0, Time elapsed: 12.912 sec
Running org.apache.hadoop.hbase.coprocessor.TestWALObserver
Tests run: 3, Failures: 0, Errors: 0, Skipped: 0, Time elapsed: 19.732 sec
Running org.apache.hadoop.hbase.TestMetaTableLocator
Tests run: 6, Failures: 0, Errors: 0, Skipped: 0, Time elapsed: 2.941 sec
Running org.apache.hadoop.hbase.zookeeper.TestZooKeeperACL
Tests run: 6, Failures: 0, Errors: 0, Skipped: 0, Time elapsed: 9.62 sec
Running org.apache.hadoop.hbase.zookeeper.TestZKTableStateManager
Tests run: 1, Failures: 0, Errors: 0, Skipped: 0, Time elapsed: 1.734 sec
Running org.apache.hadoop.hbase.TestJMXListener
Tests run: 2, Failures: 0, Errors: 0, Skipped: 0, Time elapsed: 24.856 sec
Running org.apache.hadoop.hbase.zookeeper.TestZKMulti
Tests run: 6, Failures: 0, Errors: 0, Skipped: 0, Time elapsed: 1.386 sec
Running org.apache.hadoop.hbase.zookeeper.TestZKLeaderManager
Tests run: 1, Failures: 0, Errors: 0, Skipped: 0, Time elapsed: 1.331 sec
Running org.apache.hadoop.hbase.zookeeper.TestRecoverableZooKeeper
Tests run: 1, Failures: 0, Errors: 0, Skipped: 0, Time elapsed: 2.115 sec
Running org.apache.hadoop.hbase.zookeeper.TestZooKeeperNodeTracker
Tests run: 3, Failures: 0, Errors: 0, Skipped: 0, Time elapsed: 1.968 sec
Running org.apache.hadoop.hbase.zookeeper.TestHQuorumPeer
Tests run: 3, Failures: 0, Errors: 0, Skipped: 0, Time elapsed: 2.38 sec
Running org.apache.hadoop.hbase.zookeeper.lock.TestZKInterProcessReadWriteLock
Tests run: 6, Failures: 0, Errors: 0, Skipped: 0, Time elapsed: 25.556 sec
Running org.apache.hadoop.hbase.TestClusterBootOrder
Tests run: 2, Failures: 0, Errors: 0, Skipped: 0, Time elapsed: 26.93 sec

Results :

Tests run: 1975, Failures: 0, Errors: 0, Skipped: 19

[INFO] ------------------------------------------------------------------------
[INFO] Reactor Summary:
[INFO] 
[INFO] HBase ............................................. SUCCESS [3.174s]
[INFO] HBase - Common .................................... SUCCESS [38.626s]
[INFO] HBase - Protocol .................................. SUCCESS [10.457s]
[INFO] HBase - Client .................................... SUCCESS [55.411s]
[INFO] HBase - Hadoop Compatibility ...................... SUCCESS [5.373s]
[INFO] HBase - Hadoop Two Compatibility .................. SUCCESS [1.832s]
[INFO] HBase - Prefix Tree ............................... SUCCESS [4.137s]
[INFO] HBase - Server .................................... FAILURE [2:33:19.311s]
[INFO] HBase - Testing Util .............................. SKIPPED
[INFO] HBase - Thrift .................................... SKIPPED
[INFO] HBase - Shell ..................................... SKIPPED
[INFO] HBase - Integration Tests ......................... SKIPPED
[INFO] HBase - Examples .................................. SKIPPED
[INFO] HBase - Assembly .................................. SKIPPED
[INFO] ------------------------------------------------------------------------
[INFO] BUILD FAILURE
[INFO] ------------------------------------------------------------------------
[INFO] Total time: 2:35:19.340s
[INFO] Finished at: Thu Aug 07 14:39:50 UTC 2014
[INFO] Final Memory: 117M/690M
[INFO] ------------------------------------------------------------------------
[ERROR] Failed to execute goal org.apache.maven.plugins:maven-surefire-plugin:2.12-TRUNK-HBASE-2:test (secondPartTestsExecution) on project hbase-server: Failure or timeout -> [Help 1]
[ERROR] 
[ERROR] To see the full stack trace of the errors, re-run Maven with the -e switch.
[ERROR] Re-run Maven using the -X switch to enable full debug logging.
[ERROR] 
[ERROR] For more information about the errors and possible solutions, please read the following articles:
[ERROR] [Help 1] http://cwiki.apache.org/confluence/display/MAVEN/MojoExecutionException
[ERROR] 
[ERROR] After correcting the problems, you can resume the build with the command
[ERROR]   mvn <goals> -rf :hbase-server
Build step 'Invoke top-level Maven targets' marked build as failure
Performing Post build task...
Match found for :.* : True
Logical operation result is TRUE
Running script  :   ZOMBIE_TESTS_COUNT=`jps | grep surefirebooter | wc -l`
  if [[ $ZOMBIE_TESTS_COUNT != 0 ]] ; then
    #It seems sometimes the tests are not dying immediately. Let's give them 10s
    echo "Suspicious java process found - waiting 10s to see if there are just slow to stop"
    sleep 10   
    ZOMBIE_TESTS_COUNT=`jps | grep surefirebooter | wc -l`
    if [[ $ZOMBIE_TESTS_COUNT != 0 ]] ; then
      echo "There are $ZOMBIE_TESTS_COUNT zombie tests, they should have been killed by surefire but survived"
      echo "************ BEGIN zombies jstack extract"
      ZB_STACK=`jps | grep surefirebooter | cut -d ' ' -f 1 | xargs -n 1 jstack | grep ".test" | grep "\.java"`
      jps | grep surefirebooter | cut -d ' ' -f 1 | xargs -n 1 jstack
      echo "************ END  zombies jstack extract"
      JIRA_COMMENT="$JIRA_COMMENT

     {color:red}-1 core zombie tests{color}.  There are ${ZOMBIE_TESTS_COUNT} zombie test(s): ${ZB_STACK}"
      BAD=1
      jps | grep surefirebooter | cut -d ' ' -f 1 | xargs kill -9
    else
      echo "We're ok: there is no zombie test, but some tests took some time to stop"
    fi
  else
    echo "We're ok: there is no zombie test"
  fi
[HBase-TRUNK] $ /bin/bash -xe /tmp/hudson1355844985046581171.sh
++ jps
++ grep surefirebooter
++ wc -l
+ ZOMBIE_TESTS_COUNT=3
+ [[ 3 != 0 ]]
+ echo 'Suspicious java process found - waiting 10s to see if there are just slow to stop'
Suspicious java process found - waiting 10s to see if there are just slow to stop
+ sleep 10
++ jps
++ grep surefirebooter
++ wc -l
+ ZOMBIE_TESTS_COUNT=3
+ [[ 3 != 0 ]]
+ echo 'There are 3 zombie tests, they should have been killed by surefire but survived'
There are 3 zombie tests, they should have been killed by surefire but survived
+ echo '************ BEGIN zombies jstack extract'
************ BEGIN zombies jstack extract
++ jps
++ grep surefirebooter
++ cut -d ' ' -f 1
++ grep '\.java'
++ xargs -n 1 jstack
++ grep .test
+ ZB_STACK=
POST BUILD TASK : FAILURE
END OF POST BUILD TASK : 0
Archiving artifacts
Sending artifact delta relative to HBase-TRUNK #5346
Archived 1704 artifacts
Archive block size is 32768
Received 74 blocks and 909422755 bytes
Compression is 0.3%
Took 6 min 15 sec
Recording test results
Updating HBASE-11527

Build failed in Jenkins: HBase-TRUNK #5377

Posted by Apache Jenkins Server <je...@builds.apache.org>.
See <https://builds.apache.org/job/HBase-TRUNK/5377/changes>

Changes:

[stack] HBASE-11603 Apply version of HADOOP-8027 to our JMXJsonServlet

[stack] HBASE-10205 ConcurrentModificationException in BucketAllocator (Arjen Roodselaar and Chunhui Shen)

[jxiang] HBASE-11611 Clean up ZK-based region assignment

------------------------------------------
[...truncated 1571 lines...]
Running org.apache.hadoop.hbase.security.visibility.TestVisibilityLabels
Tests run: 19, Failures: 0, Errors: 0, Skipped: 0, Time elapsed: 20.398 sec
Running org.apache.hadoop.hbase.security.visibility.TestVisibilityLabelsWithACL
Tests run: 5, Failures: 0, Errors: 0, Skipped: 0, Time elapsed: 12.785 sec
Running org.apache.hadoop.hbase.security.visibility.TestEnforcingScanLabelGenerator
Tests run: 1, Failures: 0, Errors: 0, Skipped: 0, Time elapsed: 10.408 sec
Running org.apache.hadoop.hbase.security.visibility.TestVisibilityLabelsWithSLGStack
Tests run: 1, Failures: 0, Errors: 0, Skipped: 0, Time elapsed: 10.687 sec
Running org.apache.hadoop.hbase.security.visibility.TestVisibilityLabelsWithDeletes
Tests run: 37, Failures: 0, Errors: 0, Skipped: 0, Time elapsed: 46.276 sec
Running org.apache.hadoop.hbase.security.visibility.TestVisibilityWithCheckAuths
Tests run: 2, Failures: 0, Errors: 0, Skipped: 0, Time elapsed: 11.149 sec
Running org.apache.hadoop.hbase.rest.TestDeleteRow
Tests run: 2, Failures: 0, Errors: 0, Skipped: 0, Time elapsed: 13.015 sec
Running org.apache.hadoop.hbase.rest.TestResourceFilter
Tests run: 1, Failures: 0, Errors: 0, Skipped: 0, Time elapsed: 8.688 sec
Running org.apache.hadoop.hbase.rest.TestVersionResource
Tests run: 7, Failures: 0, Errors: 0, Skipped: 0, Time elapsed: 10.542 sec
Running org.apache.hadoop.hbase.rest.TestStatusResource
Tests run: 2, Failures: 0, Errors: 0, Skipped: 0, Time elapsed: 10.362 sec
Running org.apache.hadoop.hbase.rest.TestTableResource
Tests run: 8, Failures: 0, Errors: 0, Skipped: 0, Time elapsed: 26.105 sec
Running org.apache.hadoop.hbase.rest.TestScannersWithFilters
Tests run: 10, Failures: 0, Errors: 0, Skipped: 0, Time elapsed: 14.904 sec
Running org.apache.hadoop.hbase.rest.TestMultiRowResource
Tests run: 3, Failures: 0, Errors: 0, Skipped: 0, Time elapsed: 11.556 sec
Running org.apache.hadoop.hbase.rest.TestScannerResource
Tests run: 5, Failures: 0, Errors: 0, Skipped: 0, Time elapsed: 31.636 sec
Running org.apache.hadoop.hbase.rest.client.TestRemoteTable
Tests run: 9, Failures: 0, Errors: 0, Skipped: 0, Time elapsed: 16.922 sec
Running org.apache.hadoop.hbase.rest.TestScannersWithLabels
Tests run: 2, Failures: 0, Errors: 0, Skipped: 0, Time elapsed: 11.348 sec
Running org.apache.hadoop.hbase.rest.TestGzipFilter
Tests run: 2, Failures: 0, Errors: 0, Skipped: 0, Time elapsed: 10.493 sec
Running org.apache.hadoop.hbase.rest.TestTableScan
Tests run: 10, Failures: 0, Errors: 0, Skipped: 0, Time elapsed: 36.254 sec
Running org.apache.hadoop.hbase.rest.TestGetAndPutResource
Tests run: 18, Failures: 0, Errors: 0, Skipped: 0, Time elapsed: 25.043 sec
Running org.apache.hadoop.hbase.rest.TestSchemaResource
Tests run: 2, Failures: 0, Errors: 0, Skipped: 0, Time elapsed: 11.742 sec
Running org.apache.hadoop.hbase.backup.example.TestZooKeeperTableArchiveClient
Tests run: 3, Failures: 0, Errors: 0, Skipped: 0, Time elapsed: 5.22 sec
Running org.apache.hadoop.hbase.TestHColumnDescriptorDefaultVersions
Tests run: 3, Failures: 0, Errors: 0, Skipped: 0, Time elapsed: 17.774 sec
Running org.apache.hadoop.hbase.filter.TestFuzzyRowAndColumnRangeFilter
Tests run: 1, Failures: 0, Errors: 0, Skipped: 0, Time elapsed: 9.404 sec
Running org.apache.hadoop.hbase.filter.TestFilterWrapper
Tests run: 1, Failures: 0, Errors: 0, Skipped: 0, Time elapsed: 10.547 sec
Running org.apache.hadoop.hbase.filter.TestColumnRangeFilter
Tests run: 1, Failures: 0, Errors: 0, Skipped: 0, Time elapsed: 15.09 sec
Running org.apache.hadoop.hbase.backup.TestHFileArchiving
Tests run: 5, Failures: 0, Errors: 0, Skipped: 0, Time elapsed: 45.489 sec
Running org.apache.hadoop.hbase.filter.TestFilterWithScanLimits
Tests run: 1, Failures: 0, Errors: 0, Skipped: 0, Time elapsed: 9.374 sec
Running org.apache.hadoop.hbase.trace.TestHTraceHooks
Tests run: 1, Failures: 0, Errors: 0, Skipped: 0, Time elapsed: 10.164 sec
Running org.apache.hadoop.hbase.constraint.TestConstraint
Tests run: 5, Failures: 0, Errors: 0, Skipped: 0, Time elapsed: 12.493 sec
Running org.apache.hadoop.hbase.TestLocalHBaseCluster
Tests run: 1, Failures: 0, Errors: 0, Skipped: 0, Time elapsed: 8.155 sec
Running org.apache.hadoop.hbase.TestMetaMigrationConvertingToPB
Tests run: 3, Failures: 0, Errors: 0, Skipped: 0, Time elapsed: 11.768 sec
Running org.apache.hadoop.hbase.replication.TestReplicationKillSlaveRS
Tests run: 1, Failures: 0, Errors: 0, Skipped: 0, Time elapsed: 29.379 sec
Running org.apache.hadoop.hbase.replication.regionserver.TestReplicationSink
Tests run: 5, Failures: 0, Errors: 0, Skipped: 0, Time elapsed: 10.203 sec
Running org.apache.hadoop.hbase.replication.TestReplicationSyncUpTool
Tests run: 1, Failures: 0, Errors: 0, Skipped: 0, Time elapsed: 62.228 sec
Running org.apache.hadoop.hbase.replication.regionserver.TestReplicationSourceManager
Tests run: 4, Failures: 0, Errors: 0, Skipped: 0, Time elapsed: 4.856 sec
Running org.apache.hadoop.hbase.replication.TestPerTableCFReplication
Tests run: 2, Failures: 0, Errors: 0, Skipped: 0, Time elapsed: 36.671 sec
Running org.apache.hadoop.hbase.replication.TestReplicationChangingPeerRegionservers
Tests run: 1, Failures: 0, Errors: 0, Skipped: 0, Time elapsed: 20.715 sec
Running org.apache.hadoop.hbase.replication.TestReplicationKillMasterRS
Tests run: 1, Failures: 0, Errors: 0, Skipped: 0, Time elapsed: 29.885 sec
Running org.apache.hadoop.hbase.replication.TestReplicationKillMasterRSCompressed
Tests run: 1, Failures: 0, Errors: 0, Skipped: 0, Time elapsed: 30.482 sec
Running org.apache.hadoop.hbase.replication.TestReplicationStateZKImpl
Tests run: 6, Failures: 0, Errors: 0, Skipped: 0, Time elapsed: 2.466 sec
Running org.apache.hadoop.hbase.replication.TestMultiSlaveReplication
Tests run: 1, Failures: 0, Errors: 0, Skipped: 0, Time elapsed: 21.901 sec
Running org.apache.hadoop.hbase.replication.TestReplicationWithTags
Tests run: 1, Failures: 0, Errors: 0, Skipped: 0, Time elapsed: 17.209 sec
Running org.apache.hadoop.hbase.replication.TestReplicationSmallTests
Tests run: 9, Failures: 0, Errors: 0, Skipped: 0, Time elapsed: 51.116 sec
Running org.apache.hadoop.hbase.replication.TestReplicationSource
Tests run: 1, Failures: 0, Errors: 0, Skipped: 0, Time elapsed: 4.621 sec
Running org.apache.hadoop.hbase.replication.regionserver.TestReplicationHLogReaderManager
Tests run: 8, Failures: 0, Errors: 0, Skipped: 0, Time elapsed: 283.543 sec
Running org.apache.hadoop.hbase.replication.TestMasterReplication
Tests run: 3, Failures: 0, Errors: 0, Skipped: 0, Time elapsed: 45.629 sec
Running org.apache.hadoop.hbase.replication.TestReplicationTrackerZKImpl
Tests run: 4, Failures: 0, Errors: 0, Skipped: 2, Time elapsed: 1.722 sec
Running org.apache.hadoop.hbase.replication.TestReplicationEndpoint
Tests run: 3, Failures: 0, Errors: 0, Skipped: 0, Time elapsed: 17.806 sec
Running org.apache.hadoop.hbase.replication.TestReplicationDisableInactivePeer
Tests run: 1, Failures: 0, Errors: 0, Skipped: 0, Time elapsed: 34.017 sec
Running org.apache.hadoop.hbase.coprocessor.TestMasterCoprocessorExceptionWithRemove
Tests run: 1, Failures: 0, Errors: 0, Skipped: 0, Time elapsed: 12.491 sec
Running org.apache.hadoop.hbase.coprocessor.TestWALObserver
Tests run: 3, Failures: 0, Errors: 0, Skipped: 0, Time elapsed: 17.397 sec
Running org.apache.hadoop.hbase.coprocessor.TestBatchCoprocessorEndpoint
Tests run: 4, Failures: 0, Errors: 0, Skipped: 0, Time elapsed: 10.711 sec
Running org.apache.hadoop.hbase.coprocessor.TestRegionServerObserver
Tests run: 1, Failures: 0, Errors: 0, Skipped: 0, Time elapsed: 12.607 sec
Running org.apache.hadoop.hbase.coprocessor.TestRegionObserverInterface
Tests run: 12, Failures: 0, Errors: 0, Skipped: 0, Time elapsed: 39.343 sec
Running org.apache.hadoop.hbase.coprocessor.TestHTableWrapper
Tests run: 1, Failures: 0, Errors: 0, Skipped: 0, Time elapsed: 10.728 sec
Running org.apache.hadoop.hbase.coprocessor.TestDoubleColumnInterpreter
Tests run: 38, Failures: 0, Errors: 0, Skipped: 0, Time elapsed: 11.968 sec
Running org.apache.hadoop.hbase.coprocessor.TestRegionObserverScannerOpenHook
Tests run: 3, Failures: 0, Errors: 0, Skipped: 0, Time elapsed: 9.727 sec
Running org.apache.hadoop.hbase.coprocessor.TestAggregateProtocol
Tests run: 44, Failures: 0, Errors: 0, Skipped: 0, Time elapsed: 12.339 sec
Running org.apache.hadoop.hbase.coprocessor.TestCoprocessorStop
Tests run: 1, Failures: 0, Errors: 0, Skipped: 0, Time elapsed: 23.367 sec
Running org.apache.hadoop.hbase.coprocessor.TestMasterCoprocessorExceptionWithAbort
Tests run: 1, Failures: 0, Errors: 0, Skipped: 0, Time elapsed: 24.332 sec
Running org.apache.hadoop.hbase.coprocessor.TestOpenTableInCoprocessor
Tests run: 2, Failures: 0, Errors: 0, Skipped: 0, Time elapsed: 11.773 sec
Running org.apache.hadoop.hbase.coprocessor.TestMasterObserver
Tests run: 6, Failures: 0, Errors: 0, Skipped: 0, Time elapsed: 15.037 sec
Running org.apache.hadoop.hbase.coprocessor.TestCoprocessorEndpoint
Tests run: 6, Failures: 0, Errors: 0, Skipped: 0, Time elapsed: 10.381 sec
Running org.apache.hadoop.hbase.coprocessor.TestRegionServerCoprocessorExceptionWithAbort
Tests run: 2, Failures: 0, Errors: 0, Skipped: 0, Time elapsed: 14.718 sec
Running org.apache.hadoop.hbase.coprocessor.TestBigDecimalColumnInterpreter
Tests run: 38, Failures: 0, Errors: 0, Skipped: 0, Time elapsed: 12.368 sec
Running org.apache.hadoop.hbase.coprocessor.TestRegionObserverBypass
Tests run: 2, Failures: 0, Errors: 0, Skipped: 0, Time elapsed: 10.659 sec
Running org.apache.hadoop.hbase.coprocessor.TestClassLoading
Tests run: 8, Failures: 0, Errors: 0, Skipped: 0, Time elapsed: 20.707 sec
Running org.apache.hadoop.hbase.coprocessor.TestRowProcessorEndpoint
Tests run: 4, Failures: 0, Errors: 0, Skipped: 0, Time elapsed: 14.375 sec
Running org.apache.hadoop.hbase.coprocessor.TestRegionServerCoprocessorExceptionWithRemove
Tests run: 1, Failures: 0, Errors: 0, Skipped: 0, Time elapsed: 20.392 sec
Running org.apache.hadoop.hbase.TestMetaTableLocator
Tests run: 6, Failures: 0, Errors: 0, Skipped: 0, Time elapsed: 2.447 sec
Running org.apache.hadoop.hbase.TestJMXListener
Tests run: 2, Failures: 0, Errors: 0, Skipped: 0, Time elapsed: 23.555 sec
Running org.apache.hadoop.hbase.TestHBaseTestingUtility
Tests run: 7, Failures: 0, Errors: 0, Skipped: 0, Time elapsed: 27.726 sec

Results :

Tests run: 1929, Failures: 0, Errors: 0, Skipped: 19

[INFO] ------------------------------------------------------------------------
[INFO] Reactor Summary:
[INFO] 
[INFO] HBase ............................................. SUCCESS [2.504s]
[INFO] HBase - Common .................................... SUCCESS [28.881s]
[INFO] HBase - Protocol .................................. SUCCESS [9.058s]
[INFO] HBase - Client .................................... SUCCESS [54.629s]
[INFO] HBase - Hadoop Compatibility ...................... SUCCESS [5.302s]
[INFO] HBase - Hadoop Two Compatibility .................. SUCCESS [1.604s]
[INFO] HBase - Prefix Tree ............................... SUCCESS [3.390s]
[INFO] HBase - Server .................................... FAILURE [2:20:55.849s]
[INFO] HBase - Testing Util .............................. SKIPPED
[INFO] HBase - Thrift .................................... SKIPPED
[INFO] HBase - Shell ..................................... SKIPPED
[INFO] HBase - Integration Tests ......................... SKIPPED
[INFO] HBase - Examples .................................. SKIPPED
[INFO] HBase - Assembly .................................. SKIPPED
[INFO] ------------------------------------------------------------------------
[INFO] BUILD FAILURE
[INFO] ------------------------------------------------------------------------
[INFO] Total time: 2:22:41.985s
[INFO] Finished at: Thu Aug 07 04:04:53 UTC 2014
[INFO] Final Memory: 117M/592M
[INFO] ------------------------------------------------------------------------
[ERROR] Failed to execute goal org.apache.maven.plugins:maven-surefire-plugin:2.12-TRUNK-HBASE-2:test (secondPartTestsExecution) on project hbase-server: Failure or timeout -> [Help 1]
[ERROR] 
[ERROR] To see the full stack trace of the errors, re-run Maven with the -e switch.
[ERROR] Re-run Maven using the -X switch to enable full debug logging.
[ERROR] 
[ERROR] For more information about the errors and possible solutions, please read the following articles:
[ERROR] [Help 1] http://cwiki.apache.org/confluence/display/MAVEN/MojoExecutionException
[ERROR] 
[ERROR] After correcting the problems, you can resume the build with the command
[ERROR]   mvn <goals> -rf :hbase-server
Build step 'Invoke top-level Maven targets' marked build as failure
Performing Post build task...
Match found for :.* : True
Logical operation result is TRUE
Running script  :   ZOMBIE_TESTS_COUNT=`jps | grep surefirebooter | wc -l`
  if [[ $ZOMBIE_TESTS_COUNT != 0 ]] ; then
    #It seems sometimes the tests are not dying immediately. Let's give them 10s
    echo "Suspicious java process found - waiting 10s to see if there are just slow to stop"
    sleep 10   
    ZOMBIE_TESTS_COUNT=`jps | grep surefirebooter | wc -l`
    if [[ $ZOMBIE_TESTS_COUNT != 0 ]] ; then
      echo "There are $ZOMBIE_TESTS_COUNT zombie tests, they should have been killed by surefire but survived"
      echo "************ BEGIN zombies jstack extract"
      ZB_STACK=`jps | grep surefirebooter | cut -d ' ' -f 1 | xargs -n 1 jstack | grep ".test" | grep "\.java"`
      jps | grep surefirebooter | cut -d ' ' -f 1 | xargs -n 1 jstack
      echo "************ END  zombies jstack extract"
      JIRA_COMMENT="$JIRA_COMMENT

     {color:red}-1 core zombie tests{color}.  There are ${ZOMBIE_TESTS_COUNT} zombie test(s): ${ZB_STACK}"
      BAD=1
      jps | grep surefirebooter | cut -d ' ' -f 1 | xargs kill -9
    else
      echo "We're ok: there is no zombie test, but some tests took some time to stop"
    fi
  else
    echo "We're ok: there is no zombie test"
  fi
[HBase-TRUNK] $ /bin/bash -xe /tmp/hudson8375166547313025617.sh
++ jps
++ grep surefirebooter
++ wc -l
+ ZOMBIE_TESTS_COUNT=4
+ [[ 4 != 0 ]]
+ echo 'Suspicious java process found - waiting 10s to see if there are just slow to stop'
Suspicious java process found - waiting 10s to see if there are just slow to stop
+ sleep 10
++ jps
++ grep surefirebooter
++ wc -l
+ ZOMBIE_TESTS_COUNT=4
+ [[ 4 != 0 ]]
+ echo 'There are 4 zombie tests, they should have been killed by surefire but survived'
There are 4 zombie tests, they should have been killed by surefire but survived
+ echo '************ BEGIN zombies jstack extract'
************ BEGIN zombies jstack extract
++ jps
++ grep surefirebooter
++ cut -d ' ' -f 1
++ xargs -n 1 jstack
++ grep .test
++ grep '\.java'
+ ZB_STACK=
POST BUILD TASK : FAILURE
END OF POST BUILD TASK : 0
Archiving artifacts
Sending artifact delta relative to HBase-TRUNK #5346
Archived 1699 artifacts
Archive block size is 32768
Received 75 blocks and 900635878 bytes
Compression is 0.3%
Took 5 min 50 sec
Recording test results
Updating HBASE-11611
Updating HBASE-11603
Updating HADOOP-8027
Updating HBASE-10205

Build failed in Jenkins: HBase-TRUNK #5376

Posted by Apache Jenkins Server <je...@builds.apache.org>.
See <https://builds.apache.org/job/HBase-TRUNK/5376/changes>

Changes:

[jmhsieh] HBASE-11681 Update and move doc about disabling the WAL (Misty Stanley-Jones)

------------------------------------------
[...truncated 1590 lines...]
Tests run: 4, Failures: 0, Errors: 0, Skipped: 0, Time elapsed: 121.846 sec
Running org.apache.hadoop.hbase.mapreduce.TestHFileOutputFormat
Tests run: 13, Failures: 0, Errors: 0, Skipped: 1, Time elapsed: 253.626 sec
Running org.apache.hadoop.hbase.mapreduce.TestTableMapReduce
Tests run: 2, Failures: 0, Errors: 0, Skipped: 0, Time elapsed: 162.669 sec
Running org.apache.hadoop.hbase.mapreduce.TestSecureLoadIncrementalHFilesSplitRecovery
Tests run: 5, Failures: 0, Errors: 0, Skipped: 0, Time elapsed: 20.467 sec
Running org.apache.hadoop.hbase.mapreduce.TestImportTSVWithVisibilityLabels
Tests run: 5, Failures: 0, Errors: 0, Skipped: 0, Time elapsed: 175.069 sec
Running org.apache.hadoop.hbase.mapreduce.TestImportExport
Tests run: 11, Failures: 0, Errors: 0, Skipped: 0, Time elapsed: 341.787 sec
Running org.apache.hadoop.hbase.coprocessor.TestRowProcessorEndpoint
Tests run: 4, Failures: 0, Errors: 0, Skipped: 0, Time elapsed: 13.984 sec
Running org.apache.hadoop.hbase.coprocessor.TestHTableWrapper
Tests run: 1, Failures: 0, Errors: 0, Skipped: 0, Time elapsed: 10.473 sec
Running org.apache.hadoop.hbase.coprocessor.TestBigDecimalColumnInterpreter
Tests run: 38, Failures: 0, Errors: 0, Skipped: 0, Time elapsed: 11.53 sec
Running org.apache.hadoop.hbase.coprocessor.TestCoprocessorEndpoint
Tests run: 6, Failures: 0, Errors: 0, Skipped: 0, Time elapsed: 10.906 sec
Running org.apache.hadoop.hbase.coprocessor.TestAggregateProtocol
Tests run: 44, Failures: 0, Errors: 0, Skipped: 0, Time elapsed: 12.67 sec
Running org.apache.hadoop.hbase.coprocessor.TestRegionServerCoprocessorExceptionWithRemove
Tests run: 1, Failures: 0, Errors: 0, Skipped: 0, Time elapsed: 20.562 sec
Running org.apache.hadoop.hbase.coprocessor.TestMasterObserver
Tests run: 6, Failures: 0, Errors: 0, Skipped: 0, Time elapsed: 15.172 sec
Running org.apache.hadoop.hbase.coprocessor.TestRegionServerCoprocessorExceptionWithAbort
Tests run: 2, Failures: 0, Errors: 0, Skipped: 0, Time elapsed: 14.821 sec
Running org.apache.hadoop.hbase.coprocessor.TestRegionObserverBypass
Tests run: 2, Failures: 0, Errors: 0, Skipped: 0, Time elapsed: 10.023 sec
Running org.apache.hadoop.hbase.coprocessor.TestRegionObserverInterface
Tests run: 12, Failures: 0, Errors: 0, Skipped: 0, Time elapsed: 40.09 sec
Running org.apache.hadoop.hbase.coprocessor.TestMasterCoprocessorExceptionWithRemove
Running org.apache.hadoop.hbase.coprocessor.TestRegionObserverScannerOpenHook
Tests run: 1, Failures: 0, Errors: 0, Skipped: 0, Time elapsed: 12.176 sec
Tests run: 3, Failures: 0, Errors: 0, Skipped: 0, Time elapsed: 9.713 sec
Running org.apache.hadoop.hbase.coprocessor.TestDoubleColumnInterpreter
Tests run: 38, Failures: 0, Errors: 0, Skipped: 0, Time elapsed: 11.402 sec
Running org.apache.hadoop.hbase.coprocessor.TestWALObserver
Tests run: 3, Failures: 0, Errors: 0, Skipped: 0, Time elapsed: 17.376 sec
Running org.apache.hadoop.hbase.coprocessor.TestRegionServerObserver
Tests run: 1, Failures: 0, Errors: 0, Skipped: 0, Time elapsed: 12.264 sec
Running org.apache.hadoop.hbase.coprocessor.TestBatchCoprocessorEndpoint
Tests run: 4, Failures: 0, Errors: 0, Skipped: 0, Time elapsed: 10.58 sec
Running org.apache.hadoop.hbase.coprocessor.TestMasterCoprocessorExceptionWithAbort
Tests run: 1, Failures: 0, Errors: 0, Skipped: 0, Time elapsed: 24.303 sec
Running org.apache.hadoop.hbase.coprocessor.TestOpenTableInCoprocessor
Tests run: 2, Failures: 0, Errors: 0, Skipped: 0, Time elapsed: 11.253 sec
Running org.apache.hadoop.hbase.coprocessor.TestCoprocessorStop
Tests run: 1, Failures: 0, Errors: 0, Skipped: 0, Time elapsed: 23.659 sec
Running org.apache.hadoop.hbase.coprocessor.TestClassLoading
Tests run: 8, Failures: 0, Errors: 0, Skipped: 0, Time elapsed: 21.204 sec
Running org.apache.hadoop.hbase.TestLocalHBaseCluster
Tests run: 1, Failures: 0, Errors: 0, Skipped: 0, Time elapsed: 8.597 sec
Running org.apache.hadoop.hbase.TestNamespace
Tests run: 9, Failures: 0, Errors: 0, Skipped: 1, Time elapsed: 14.368 sec
Running org.apache.hadoop.hbase.TestMultiVersions
Tests run: 3, Failures: 0, Errors: 0, Skipped: 0, Time elapsed: 12.982 sec
Running org.apache.hadoop.hbase.TestMetaTableAccessor
Tests run: 8, Failures: 0, Errors: 0, Skipped: 0, Time elapsed: 12.246 sec
Running org.apache.hadoop.hbase.trace.TestHTraceHooks
Tests run: 1, Failures: 0, Errors: 0, Skipped: 0, Time elapsed: 10.364 sec
Running org.apache.hadoop.hbase.rest.client.TestRemoteTable
Tests run: 9, Failures: 0, Errors: 0, Skipped: 0, Time elapsed: 16.894 sec
Running org.apache.hadoop.hbase.rest.TestScannersWithFilters
Tests run: 10, Failures: 0, Errors: 0, Skipped: 0, Time elapsed: 14.019 sec
Running org.apache.hadoop.hbase.rest.TestMultiRowResource
Tests run: 3, Failures: 0, Errors: 0, Skipped: 0, Time elapsed: 10.578 sec
Running org.apache.hadoop.hbase.rest.TestDeleteRow
Tests run: 2, Failures: 0, Errors: 0, Skipped: 0, Time elapsed: 12.876 sec
Running org.apache.hadoop.hbase.rest.TestVersionResource
Tests run: 7, Failures: 0, Errors: 0, Skipped: 0, Time elapsed: 10.235 sec
Running org.apache.hadoop.hbase.rest.TestStatusResource
Tests run: 2, Failures: 0, Errors: 0, Skipped: 0, Time elapsed: 10.604 sec
Running org.apache.hadoop.hbase.rest.TestScannersWithLabels
Tests run: 2, Failures: 0, Errors: 0, Skipped: 0, Time elapsed: 11.103 sec
Running org.apache.hadoop.hbase.rest.TestGetAndPutResource
Tests run: 18, Failures: 0, Errors: 0, Skipped: 0, Time elapsed: 24.027 sec
Running org.apache.hadoop.hbase.rest.TestGzipFilter
Tests run: 2, Failures: 0, Errors: 0, Skipped: 0, Time elapsed: 11.048 sec
Running org.apache.hadoop.hbase.rest.TestScannerResource
Tests run: 5, Failures: 0, Errors: 0, Skipped: 0, Time elapsed: 32.16 sec
Running org.apache.hadoop.hbase.rest.TestSchemaResource
Tests run: 2, Failures: 0, Errors: 0, Skipped: 0, Time elapsed: 12.537 sec
Running org.apache.hadoop.hbase.rest.TestTableScan
Tests run: 10, Failures: 0, Errors: 0, Skipped: 0, Time elapsed: 35.602 sec
Running org.apache.hadoop.hbase.rest.TestTableResource
Tests run: 8, Failures: 0, Errors: 0, Skipped: 0, Time elapsed: 27.037 sec
Running org.apache.hadoop.hbase.TestMetaTableLocator
Tests run: 6, Failures: 0, Errors: 0, Skipped: 0, Time elapsed: 2.472 sec
Running org.apache.hadoop.hbase.rest.TestResourceFilter
Tests run: 1, Failures: 0, Errors: 0, Skipped: 0, Time elapsed: 9.069 sec
Running org.apache.hadoop.hbase.snapshot.TestFlushSnapshotFromClient
Tests run: 9, Failures: 0, Errors: 0, Skipped: 0, Time elapsed: 42.092 sec
Running org.apache.hadoop.hbase.snapshot.TestRestoreFlushSnapshotFromClient
Tests run: 5, Failures: 0, Errors: 0, Skipped: 0, Time elapsed: 45.001 sec
Running org.apache.hadoop.hbase.snapshot.TestExportSnapshot
Running org.apache.hadoop.hbase.snapshot.TestSecureExportSnapshot
Tests run: 9, Failures: 0, Errors: 0, Skipped: 0, Time elapsed: 291.232 sec
Tests run: 9, Failures: 0, Errors: 0, Skipped: 0, Time elapsed: 290.264 sec
Running org.apache.hadoop.hbase.snapshot.TestSnapshotDescriptionUtils
Tests run: 2, Failures: 0, Errors: 0, Skipped: 0, Time elapsed: 1.176 sec
Running org.apache.hadoop.hbase.TestMetaMigrationConvertingToPB
Tests run: 3, Failures: 0, Errors: 0, Skipped: 0, Time elapsed: 12.256 sec
Running org.apache.hadoop.hbase.util.TestIdLock
Tests run: 1, Failures: 0, Errors: 0, Skipped: 0, Time elapsed: 15.565 sec
Running org.apache.hadoop.hbase.util.TestMiniClusterLoadParallel
Tests run: 4, Failures: 0, Errors: 0, Skipped: 0, Time elapsed: 36.09 sec
Running org.apache.hadoop.hbase.util.TestMergeTable
Tests run: 1, Failures: 0, Errors: 0, Skipped: 0, Time elapsed: 18.434 sec
Running org.apache.hadoop.hbase.util.TestFSTableDescriptors
Tests run: 12, Failures: 0, Errors: 0, Skipped: 0, Time elapsed: 2.207 sec
Running org.apache.hadoop.hbase.util.TestMiniClusterLoadSequential
Tests run: 4, Failures: 0, Errors: 0, Skipped: 0, Time elapsed: 40.666 sec
Running org.apache.hadoop.hbase.util.TestDefaultEnvironmentEdge
Tests run: 1, Failures: 0, Errors: 0, Skipped: 0, Time elapsed: 0.358 sec
Running org.apache.hadoop.hbase.util.TestFSVisitor
Tests run: 3, Failures: 0, Errors: 0, Skipped: 0, Time elapsed: 4.192 sec
Running org.apache.hadoop.hbase.util.TestHBaseFsckEncryption
Tests run: 1, Failures: 0, Errors: 0, Skipped: 0, Time elapsed: 10.988 sec
Running org.apache.hadoop.hbase.util.TestFSHDFSUtils
Tests run: 3, Failures: 0, Errors: 0, Skipped: 0, Time elapsed: 5.764 sec
Running org.apache.hadoop.hbase.util.TestMiniClusterLoadEncoded
Tests run: 5, Failures: 0, Errors: 0, Skipped: 0, Time elapsed: 40.397 sec
Running org.apache.hadoop.hbase.util.TestProcessBasedCluster
Tests run: 1, Failures: 0, Errors: 0, Skipped: 0, Time elapsed: 0.642 sec
Running org.apache.hadoop.hbase.util.hbck.TestOfflineMetaRebuildOverlap
Tests run: 1, Failures: 0, Errors: 0, Skipped: 0, Time elapsed: 17.858 sec
Running org.apache.hadoop.hbase.util.hbck.TestOfflineMetaRebuildBase
Tests run: 1, Failures: 0, Errors: 0, Skipped: 0, Time elapsed: 18.177 sec
Running org.apache.hadoop.hbase.util.hbck.TestOfflineMetaRebuildHole
Tests run: 1, Failures: 0, Errors: 0, Skipped: 0, Time elapsed: 17.77 sec
Running org.apache.hadoop.hbase.util.TestMergeTool
Tests run: 1, Failures: 0, Errors: 0, Skipped: 0, Time elapsed: 18.762 sec
Running org.apache.hadoop.hbase.util.TestFSUtils
Tests run: 7, Failures: 0, Errors: 0, Skipped: 0, Time elapsed: 11.121 sec
Running org.apache.hadoop.hbase.util.TestCoprocessorScanPolicy
Tests run: 4, Failures: 0, Errors: 0, Skipped: 0, Time elapsed: 10.891 sec
Running org.apache.hadoop.hbase.util.TestHBaseFsck
Tests run: 46, Failures: 0, Errors: 0, Skipped: 1, Time elapsed: 243.499 sec
Running org.apache.hadoop.hbase.util.TestRegionSplitter
Tests run: 5, Failures: 0, Errors: 0, Skipped: 0, Time elapsed: 13.948 sec
Running org.apache.hadoop.hbase.TestFullLogReconstruction
Tests run: 1, Failures: 0, Errors: 0, Skipped: 0, Time elapsed: 43.929 sec
Running org.apache.hadoop.hbase.filter.TestFilterWithScanLimits
Tests run: 1, Failures: 0, Errors: 0, Skipped: 0, Time elapsed: 9.397 sec
Running org.apache.hadoop.hbase.filter.TestColumnRangeFilter
Tests run: 1, Failures: 0, Errors: 0, Skipped: 0, Time elapsed: 14.202 sec
Running org.apache.hadoop.hbase.filter.TestFilterWrapper
Tests run: 1, Failures: 0, Errors: 0, Skipped: 0, Time elapsed: 9.213 sec
Running org.apache.hadoop.hbase.filter.TestFuzzyRowAndColumnRangeFilter
Tests run: 1, Failures: 0, Errors: 0, Skipped: 0, Time elapsed: 9.309 sec
Running org.apache.hadoop.hbase.TestZooKeeper
Tests run: 11, Failures: 0, Errors: 0, Skipped: 0, Time elapsed: 209.68 sec

Results :

Failed tests:   testFencingAroundCompactionAfterWALSync(org.apache.hadoop.hbase.TestIOFencing): Timed out waiting for the region to flush
  testRetainAssignmentOnRestart(org.apache.hadoop.hbase.master.TestRestartCluster): expected:<...5.gq1.ygridcore.net:[5368]0> but was:<...5.gq1.ygridcore.net:[3359]0>
  testCreateTableWithMultipleReplicas(org.apache.hadoop.hbase.master.TestMasterOperationsForRegionReplicas): expected:<3> but was:<2>

Tests in error: 
  org.apache.hadoop.hbase.client.TestReplicasClient: KeeperErrorCode = NoNode for /hbase/region-in-transition/1588230740
  org.apache.hadoop.hbase.regionserver.TestRegionReplicas: KeeperErrorCode = NoNode for /hbase/region-in-transition/1588230740

Tests run: 2073, Failures: 3, Errors: 2, Skipped: 19

[INFO] ------------------------------------------------------------------------
[INFO] Reactor Summary:
[INFO] 
[INFO] HBase ............................................. SUCCESS [2.450s]
[INFO] HBase - Common .................................... SUCCESS [27.183s]
[INFO] HBase - Protocol .................................. SUCCESS [9.145s]
[INFO] HBase - Client .................................... SUCCESS [54.712s]
[INFO] HBase - Hadoop Compatibility ...................... SUCCESS [5.303s]
[INFO] HBase - Hadoop Two Compatibility .................. SUCCESS [1.575s]
[INFO] HBase - Prefix Tree ............................... SUCCESS [3.344s]
[INFO] HBase - Server .................................... FAILURE [1:58:44.146s]
[INFO] HBase - Testing Util .............................. SKIPPED
[INFO] HBase - Thrift .................................... SKIPPED
[INFO] HBase - Shell ..................................... SKIPPED
[INFO] HBase - Integration Tests ......................... SKIPPED
[INFO] HBase - Examples .................................. SKIPPED
[INFO] HBase - Assembly .................................. SKIPPED
[INFO] ------------------------------------------------------------------------
[INFO] BUILD FAILURE
[INFO] ------------------------------------------------------------------------
[INFO] Total time: 2:00:28.630s
[INFO] Finished at: Thu Aug 07 00:40:14 UTC 2014
[INFO] Final Memory: 39M/689M
[INFO] ------------------------------------------------------------------------
[ERROR] Failed to execute goal org.apache.maven.plugins:maven-surefire-plugin:2.12-TRUNK-HBASE-2:test (secondPartTestsExecution) on project hbase-server: There are test failures.
[ERROR] 
[ERROR] Please refer to <https://builds.apache.org/job/HBase-TRUNK/ws/hbase-server/target/surefire-reports> for the individual test results.
[ERROR] -> [Help 1]
[ERROR] 
[ERROR] To see the full stack trace of the errors, re-run Maven with the -e switch.
[ERROR] Re-run Maven using the -X switch to enable full debug logging.
[ERROR] 
[ERROR] For more information about the errors and possible solutions, please read the following articles:
[ERROR] [Help 1] http://cwiki.apache.org/confluence/display/MAVEN/MojoFailureException
[ERROR] 
[ERROR] After correcting the problems, you can resume the build with the command
[ERROR]   mvn <goals> -rf :hbase-server
Build step 'Invoke top-level Maven targets' marked build as failure
Performing Post build task...
Match found for :.* : True
Logical operation result is TRUE
Running script  :   ZOMBIE_TESTS_COUNT=`jps | grep surefirebooter | wc -l`
  if [[ $ZOMBIE_TESTS_COUNT != 0 ]] ; then
    #It seems sometimes the tests are not dying immediately. Let's give them 10s
    echo "Suspicious java process found - waiting 10s to see if there are just slow to stop"
    sleep 10   
    ZOMBIE_TESTS_COUNT=`jps | grep surefirebooter | wc -l`
    if [[ $ZOMBIE_TESTS_COUNT != 0 ]] ; then
      echo "There are $ZOMBIE_TESTS_COUNT zombie tests, they should have been killed by surefire but survived"
      echo "************ BEGIN zombies jstack extract"
      ZB_STACK=`jps | grep surefirebooter | cut -d ' ' -f 1 | xargs -n 1 jstack | grep ".test" | grep "\.java"`
      jps | grep surefirebooter | cut -d ' ' -f 1 | xargs -n 1 jstack
      echo "************ END  zombies jstack extract"
      JIRA_COMMENT="$JIRA_COMMENT

     {color:red}-1 core zombie tests{color}.  There are ${ZOMBIE_TESTS_COUNT} zombie test(s): ${ZB_STACK}"
      BAD=1
      jps | grep surefirebooter | cut -d ' ' -f 1 | xargs kill -9
    else
      echo "We're ok: there is no zombie test, but some tests took some time to stop"
    fi
  else
    echo "We're ok: there is no zombie test"
  fi
[HBase-TRUNK] $ /bin/bash -xe /tmp/hudson8675781852744087493.sh
++ jps
++ grep surefirebooter
++ wc -l
+ ZOMBIE_TESTS_COUNT=0
+ [[ 0 != 0 ]]
+ echo 'We'\''re ok: there is no zombie test'
We're ok: there is no zombie test
POST BUILD TASK : SUCCESS
END OF POST BUILD TASK : 0
Archiving artifacts
Sending artifact delta relative to HBase-TRUNK #5346
Archived 1743 artifacts
Archive block size is 32768
Received 74 blocks and 898591581 bytes
Compression is 0.3%
Took 5 min 35 sec
Recording test results
Updating HBASE-11681

Build failed in Jenkins: HBase-TRUNK #5375

Posted by Apache Jenkins Server <je...@builds.apache.org>.
See <https://builds.apache.org/job/HBase-TRUNK/5375/changes>

Changes:

[jmhsieh] HBASE-11535 ReplicationPeer map is not thread safe (Virag Kothari)

[larsh] HBASE-11667 Comment ClientScanner logic for NSREs.

------------------------------------------
[...truncated 1590 lines...]
Tests run: 6, Failures: 0, Errors: 0, Skipped: 0, Time elapsed: 47.964 sec
Running org.apache.hadoop.hbase.master.TestActiveMasterManager
Tests run: 2, Failures: 0, Errors: 0, Skipped: 0, Time elapsed: 2.001 sec
Running org.apache.hadoop.hbase.master.TestZKLessAMOnCluster
Tests run: 16, Failures: 0, Errors: 0, Skipped: 0, Time elapsed: 72.085 sec
Running org.apache.hadoop.hbase.master.TestDeadServer
Tests run: 3, Failures: 0, Errors: 0, Skipped: 0, Time elapsed: 0.417 sec
Running org.apache.hadoop.hbase.master.TestSplitLogManager
Tests run: 14, Failures: 0, Errors: 0, Skipped: 0, Time elapsed: 82.27 sec
Running org.apache.hadoop.hbase.master.balancer.TestDefaultLoadBalancer
Tests run: 2, Failures: 0, Errors: 0, Skipped: 0, Time elapsed: 6.307 sec
Running org.apache.hadoop.hbase.master.balancer.TestBaseLoadBalancer
Tests run: 8, Failures: 0, Errors: 0, Skipped: 0, Time elapsed: 126.379 sec
Running org.apache.hadoop.hbase.master.TestMasterRestartAfterDisablingTable
Tests run: 1, Failures: 0, Errors: 0, Skipped: 0, Time elapsed: 13.724 sec
Running org.apache.hadoop.hbase.master.TestMasterNoCluster
Tests run: 3, Failures: 0, Errors: 0, Skipped: 0, Time elapsed: 14.285 sec
Running org.apache.hadoop.hbase.master.TestClusterStatusPublisher
Tests run: 3, Failures: 0, Errors: 0, Skipped: 0, Time elapsed: 0.41 sec
Running org.apache.hadoop.hbase.master.TestZKBasedOpenCloseRegion
Tests run: 3, Failures: 0, Errors: 0, Skipped: 0, Time elapsed: 12.561 sec
Running org.apache.hadoop.hbase.master.TestAssignmentManagerOnCluster
Tests run: 16, Failures: 0, Errors: 0, Skipped: 0, Time elapsed: 72.577 sec
Running org.apache.hadoop.hbase.master.TestMasterTransitions
Tests run: 3, Failures: 0, Errors: 0, Skipped: 3, Time elapsed: 11.041 sec
Running org.apache.hadoop.hbase.master.TestMasterOperationsForRegionReplicas
Tests run: 2, Failures: 0, Errors: 0, Skipped: 0, Time elapsed: 18.399 sec
Running org.apache.hadoop.hbase.master.TestRestartCluster
Tests run: 3, Failures: 1, Errors: 0, Skipped: 0, Time elapsed: 34.605 sec <<< FAILURE!
Running org.apache.hadoop.hbase.master.cleaner.TestSnapshotFromMaster
Tests run: 4, Failures: 0, Errors: 0, Skipped: 0, Time elapsed: 17.47 sec
Running org.apache.hadoop.hbase.master.cleaner.TestLogsCleaner
Tests run: 1, Failures: 0, Errors: 0, Skipped: 0, Time elapsed: 11.993 sec
Running org.apache.hadoop.hbase.master.cleaner.TestHFileCleaner
Tests run: 3, Failures: 0, Errors: 0, Skipped: 0, Time elapsed: 4.834 sec
Running org.apache.hadoop.hbase.master.TestMasterMetrics
Tests run: 2, Failures: 0, Errors: 0, Skipped: 0, Time elapsed: 12.946 sec
Running org.apache.hadoop.hbase.master.TestAssignmentListener
Tests run: 2, Failures: 0, Errors: 0, Skipped: 0, Time elapsed: 12.458 sec
Running org.apache.hadoop.hbase.TestLocalHBaseCluster
Tests run: 1, Failures: 0, Errors: 0, Skipped: 0, Time elapsed: 8.359 sec
Running org.apache.hadoop.hbase.trace.TestHTraceHooks
Tests run: 1, Failures: 0, Errors: 0, Skipped: 0, Time elapsed: 9.599 sec
Running org.apache.hadoop.hbase.io.encoding.TestLoadAndSwitchEncodeOnDisk
Tests run: 1, Failures: 0, Errors: 0, Skipped: 0, Time elapsed: 21.064 sec
Running org.apache.hadoop.hbase.io.encoding.TestChangingEncoding
Tests run: 3, Failures: 0, Errors: 0, Skipped: 0, Time elapsed: 61.755 sec
Running org.apache.hadoop.hbase.master.balancer.TestStochasticLoadBalancer
Tests run: 23, Failures: 0, Errors: 0, Skipped: 0, Time elapsed: 526.701 sec
Running org.apache.hadoop.hbase.io.encoding.TestEncodedSeekers
Tests run: 20, Failures: 0, Errors: 0, Skipped: 0, Time elapsed: 141.851 sec
Running org.apache.hadoop.hbase.io.encoding.TestBufferedDataBlockEncoder
Tests run: 1, Failures: 0, Errors: 0, Skipped: 0, Time elapsed: 22.657 sec
Running org.apache.hadoop.hbase.io.hfile.TestCacheOnWrite
Tests run: 36, Failures: 0, Errors: 0, Skipped: 0, Time elapsed: 73.61 sec
Running org.apache.hadoop.hbase.io.hfile.TestHFileBlockIndex
Tests run: 2, Failures: 0, Errors: 0, Skipped: 0, Time elapsed: 0.909 sec
Running org.apache.hadoop.hbase.io.hfile.TestScannerSelectionUsingTTL
Tests run: 6, Failures: 0, Errors: 0, Skipped: 0, Time elapsed: 62.574 sec
Running org.apache.hadoop.hbase.io.hfile.TestCacheConfig
Tests run: 6, Failures: 0, Errors: 0, Skipped: 0, Time elapsed: 1.768 sec
Running org.apache.hadoop.hbase.io.encoding.TestDataBlockEncoders
Tests run: 28, Failures: 0, Errors: 0, Skipped: 0, Time elapsed: 223.007 sec
Running org.apache.hadoop.hbase.io.hfile.TestForceCacheImportantBlocks
Tests run: 2, Failures: 0, Errors: 0, Skipped: 0, Time elapsed: 26.488 sec
Running org.apache.hadoop.hbase.io.hfile.TestHFileSeek
Tests run: 1, Failures: 0, Errors: 0, Skipped: 0, Time elapsed: 4.335 sec
Running org.apache.hadoop.hbase.io.TestFileLink
Tests run: 3, Failures: 0, Errors: 0, Skipped: 0, Time elapsed: 16.903 sec
Running org.apache.hadoop.hbase.constraint.TestConstraint
Tests run: 5, Failures: 0, Errors: 0, Skipped: 0, Time elapsed: 16.691 sec
Running org.apache.hadoop.hbase.io.hfile.TestHFileBlock
Tests run: 28, Failures: 0, Errors: 0, Skipped: 0, Time elapsed: 93.842 sec
Running org.apache.hadoop.hbase.filter.TestColumnRangeFilter
Tests run: 1, Failures: 0, Errors: 0, Skipped: 0, Time elapsed: 18.625 sec
Running org.apache.hadoop.hbase.filter.TestFuzzyRowAndColumnRangeFilter
Tests run: 1, Failures: 0, Errors: 0, Skipped: 0, Time elapsed: 9.4 sec
Running org.apache.hadoop.hbase.filter.TestFilterWithScanLimits
Tests run: 1, Failures: 0, Errors: 0, Skipped: 0, Time elapsed: 9.754 sec
Running org.apache.hadoop.hbase.filter.TestFilterWrapper
Tests run: 1, Failures: 0, Errors: 0, Skipped: 0, Time elapsed: 9.118 sec
Running org.apache.hadoop.hbase.TestGlobalMemStoreSize
Tests run: 1, Failures: 0, Errors: 0, Skipped: 0, Time elapsed: 10.455 sec
Running org.apache.hadoop.hbase.migration.TestUpgradeTo96
Tests run: 5, Failures: 0, Errors: 0, Skipped: 0, Time elapsed: 8.188 sec
Running org.apache.hadoop.hbase.TestNamespace
Tests run: 9, Failures: 0, Errors: 0, Skipped: 1, Time elapsed: 14.55 sec
Running org.apache.hadoop.hbase.rest.TestResourceFilter
Tests run: 1, Failures: 0, Errors: 0, Skipped: 0, Time elapsed: 8.969 sec
Running org.apache.hadoop.hbase.rest.TestStatusResource
Tests run: 2, Failures: 0, Errors: 0, Skipped: 0, Time elapsed: 10.393 sec
Running org.apache.hadoop.hbase.migration.TestNamespaceUpgrade
Tests run: 5, Failures: 0, Errors: 0, Skipped: 0, Time elapsed: 24.309 sec
Running org.apache.hadoop.hbase.rest.TestMultiRowResource
Tests run: 3, Failures: 0, Errors: 0, Skipped: 0, Time elapsed: 11.041 sec
Running org.apache.hadoop.hbase.rest.TestDeleteRow
Tests run: 2, Failures: 0, Errors: 0, Skipped: 0, Time elapsed: 12.747 sec
Running org.apache.hadoop.hbase.rest.TestSchemaResource
Tests run: 2, Failures: 0, Errors: 0, Skipped: 0, Time elapsed: 11.276 sec
Running org.apache.hadoop.hbase.rest.client.TestRemoteTable
Tests run: 9, Failures: 0, Errors: 0, Skipped: 0, Time elapsed: 18.191 sec
Running org.apache.hadoop.hbase.rest.TestVersionResource
Tests run: 7, Failures: 0, Errors: 0, Skipped: 0, Time elapsed: 11.059 sec
Running org.apache.hadoop.hbase.rest.TestGetAndPutResource
Tests run: 18, Failures: 0, Errors: 0, Skipped: 0, Time elapsed: 24.859 sec
Running org.apache.hadoop.hbase.rest.TestScannerResource
Tests run: 5, Failures: 0, Errors: 0, Skipped: 0, Time elapsed: 31.87 sec
Running org.apache.hadoop.hbase.rest.TestScannersWithLabels
Tests run: 2, Failures: 0, Errors: 0, Skipped: 0, Time elapsed: 11.403 sec
Running org.apache.hadoop.hbase.rest.TestScannersWithFilters
Tests run: 10, Failures: 0, Errors: 0, Skipped: 0, Time elapsed: 14.47 sec
Running org.apache.hadoop.hbase.rest.TestTableResource
Tests run: 8, Failures: 0, Errors: 0, Skipped: 0, Time elapsed: 26.818 sec
Running org.apache.hadoop.hbase.rest.TestGzipFilter
Tests run: 2, Failures: 0, Errors: 0, Skipped: 0, Time elapsed: 11.046 sec
Running org.apache.hadoop.hbase.replication.TestReplicationSource
Tests run: 1, Failures: 0, Errors: 0, Skipped: 0, Time elapsed: 4.745 sec
Running org.apache.hadoop.hbase.rest.TestTableScan
Tests run: 10, Failures: 0, Errors: 0, Skipped: 0, Time elapsed: 35.021 sec
Running org.apache.hadoop.hbase.replication.TestReplicationWithTags
Tests run: 1, Failures: 0, Errors: 0, Skipped: 0, Time elapsed: 16.529 sec
Running org.apache.hadoop.hbase.replication.TestReplicationChangingPeerRegionservers
Tests run: 1, Failures: 0, Errors: 0, Skipped: 0, Time elapsed: 18.876 sec
Running org.apache.hadoop.hbase.replication.TestPerTableCFReplication
Tests run: 2, Failures: 0, Errors: 0, Skipped: 0, Time elapsed: 35.941 sec
Running org.apache.hadoop.hbase.replication.TestMultiSlaveReplication
Tests run: 1, Failures: 0, Errors: 0, Skipped: 0, Time elapsed: 23.439 sec
Running org.apache.hadoop.hbase.replication.TestReplicationSmallTests
Tests run: 9, Failures: 0, Errors: 0, Skipped: 0, Time elapsed: 50.748 sec
Running org.apache.hadoop.hbase.replication.TestReplicationKillSlaveRS
Tests run: 1, Failures: 0, Errors: 0, Skipped: 0, Time elapsed: 26.935 sec
Running org.apache.hadoop.hbase.replication.TestMasterReplication
Tests run: 3, Failures: 0, Errors: 0, Skipped: 0, Time elapsed: 46.373 sec
Running org.apache.hadoop.hbase.replication.regionserver.TestReplicationSourceManager
Tests run: 4, Failures: 0, Errors: 0, Skipped: 0, Time elapsed: 5.924 sec
Running org.apache.hadoop.hbase.replication.regionserver.TestReplicationSink
Tests run: 5, Failures: 0, Errors: 0, Skipped: 0, Time elapsed: 11.066 sec
Running org.apache.hadoop.hbase.replication.TestReplicationStateZKImpl
Tests run: 6, Failures: 0, Errors: 0, Skipped: 0, Time elapsed: 2.408 sec
Running org.apache.hadoop.hbase.replication.TestReplicationEndpoint
Tests run: 3, Failures: 0, Errors: 0, Skipped: 0, Time elapsed: 18.114 sec
Running org.apache.hadoop.hbase.replication.TestReplicationSyncUpTool
Tests run: 1, Failures: 0, Errors: 0, Skipped: 0, Time elapsed: 60.185 sec
Running org.apache.hadoop.hbase.replication.TestReplicationTrackerZKImpl
Tests run: 4, Failures: 0, Errors: 0, Skipped: 2, Time elapsed: 1.718 sec
Running org.apache.hadoop.hbase.replication.TestReplicationKillMasterRS
Tests run: 1, Failures: 0, Errors: 0, Skipped: 0, Time elapsed: 29.399 sec
Running org.apache.hadoop.hbase.replication.TestReplicationKillMasterRSCompressed
Tests run: 1, Failures: 0, Errors: 0, Skipped: 0, Time elapsed: 30.822 sec
Running org.apache.hadoop.hbase.replication.TestReplicationDisableInactivePeer
Tests run: 1, Failures: 0, Errors: 0, Skipped: 0, Time elapsed: 33.4 sec
Running org.apache.hadoop.hbase.replication.regionserver.TestReplicationHLogReaderManager
Tests run: 8, Failures: 0, Errors: 0, Skipped: 0, Time elapsed: 285.807 sec

Results :

Failed tests:   testFencingAroundCompactionAfterWALSync(org.apache.hadoop.hbase.TestIOFencing): Timed out waiting for the region to flush
  testRetainAssignmentOnRestart(org.apache.hadoop.hbase.master.TestRestartCluster): expected:<...1.gq1.ygridcore.net:[36100]> but was:<...1.gq1.ygridcore.net:[41902]>

Tests in error: 
  org.apache.hadoop.hbase.client.TestReplicasClient: KeeperErrorCode = NoNode for /hbase/region-in-transition/1588230740
  org.apache.hadoop.hbase.regionserver.TestRegionReplicas: KeeperErrorCode = NoNode for /hbase/region-in-transition/1588230740

Tests run: 2073, Failures: 2, Errors: 2, Skipped: 19

[INFO] ------------------------------------------------------------------------
[INFO] Reactor Summary:
[INFO] 
[INFO] HBase ............................................. SUCCESS [2.461s]
[INFO] HBase - Common .................................... SUCCESS [31.434s]
[INFO] HBase - Protocol .................................. SUCCESS [9.260s]
[INFO] HBase - Client .................................... SUCCESS [54.383s]
[INFO] HBase - Hadoop Compatibility ...................... SUCCESS [5.288s]
[INFO] HBase - Hadoop Two Compatibility .................. SUCCESS [1.599s]
[INFO] HBase - Prefix Tree ............................... SUCCESS [3.265s]
[INFO] HBase - Server .................................... FAILURE [1:57:37.433s]
[INFO] HBase - Testing Util .............................. SKIPPED
[INFO] HBase - Thrift .................................... SKIPPED
[INFO] HBase - Shell ..................................... SKIPPED
[INFO] HBase - Integration Tests ......................... SKIPPED
[INFO] HBase - Examples .................................. SKIPPED
[INFO] HBase - Assembly .................................. SKIPPED
[INFO] ------------------------------------------------------------------------
[INFO] BUILD FAILURE
[INFO] ------------------------------------------------------------------------
[INFO] Total time: 1:59:25.900s
[INFO] Finished at: Wed Aug 06 21:08:30 UTC 2014
[INFO] Final Memory: 38M/510M
[INFO] ------------------------------------------------------------------------
[ERROR] Failed to execute goal org.apache.maven.plugins:maven-surefire-plugin:2.12-TRUNK-HBASE-2:test (secondPartTestsExecution) on project hbase-server: There are test failures.
[ERROR] 
[ERROR] Please refer to <https://builds.apache.org/job/HBase-TRUNK/ws/hbase-server/target/surefire-reports> for the individual test results.
[ERROR] -> [Help 1]
[ERROR] 
[ERROR] To see the full stack trace of the errors, re-run Maven with the -e switch.
[ERROR] Re-run Maven using the -X switch to enable full debug logging.
[ERROR] 
[ERROR] For more information about the errors and possible solutions, please read the following articles:
[ERROR] [Help 1] http://cwiki.apache.org/confluence/display/MAVEN/MojoFailureException
[ERROR] 
[ERROR] After correcting the problems, you can resume the build with the command
[ERROR]   mvn <goals> -rf :hbase-server
Build step 'Invoke top-level Maven targets' marked build as failure
Performing Post build task...
Match found for :.* : True
Logical operation result is TRUE
Running script  :   ZOMBIE_TESTS_COUNT=`jps | grep surefirebooter | wc -l`
  if [[ $ZOMBIE_TESTS_COUNT != 0 ]] ; then
    #It seems sometimes the tests are not dying immediately. Let's give them 10s
    echo "Suspicious java process found - waiting 10s to see if there are just slow to stop"
    sleep 10   
    ZOMBIE_TESTS_COUNT=`jps | grep surefirebooter | wc -l`
    if [[ $ZOMBIE_TESTS_COUNT != 0 ]] ; then
      echo "There are $ZOMBIE_TESTS_COUNT zombie tests, they should have been killed by surefire but survived"
      echo "************ BEGIN zombies jstack extract"
      ZB_STACK=`jps | grep surefirebooter | cut -d ' ' -f 1 | xargs -n 1 jstack | grep ".test" | grep "\.java"`
      jps | grep surefirebooter | cut -d ' ' -f 1 | xargs -n 1 jstack
      echo "************ END  zombies jstack extract"
      JIRA_COMMENT="$JIRA_COMMENT

     {color:red}-1 core zombie tests{color}.  There are ${ZOMBIE_TESTS_COUNT} zombie test(s): ${ZB_STACK}"
      BAD=1
      jps | grep surefirebooter | cut -d ' ' -f 1 | xargs kill -9
    else
      echo "We're ok: there is no zombie test, but some tests took some time to stop"
    fi
  else
    echo "We're ok: there is no zombie test"
  fi
[HBase-TRUNK] $ /bin/bash -xe /tmp/hudson3884944423991292755.sh
++ jps
++ grep surefirebooter
++ wc -l
+ ZOMBIE_TESTS_COUNT=0
+ [[ 0 != 0 ]]
+ echo 'We'\''re ok: there is no zombie test'
We're ok: there is no zombie test
POST BUILD TASK : SUCCESS
END OF POST BUILD TASK : 0
Archiving artifacts
Sending artifact delta relative to HBase-TRUNK #5346
Archived 1742 artifacts
Archive block size is 32768
Received 74 blocks and 894604639 bytes
Compression is 0.3%
Took 5 min 38 sec
Recording test results
Updating HBASE-11535
Updating HBASE-11667

Build failed in Jenkins: HBase-TRUNK #5374

Posted by Apache Jenkins Server <je...@builds.apache.org>.
See <https://builds.apache.org/job/HBase-TRUNK/5374/changes>

Changes:

[stack] Add note on contributing to HBase under dev and the newly minted 'beginner' label

------------------------------------------
[...truncated 1584 lines...]
Tests run: 5, Failures: 0, Errors: 0, Skipped: 0, Time elapsed: 20.465 sec
Running org.apache.hadoop.hbase.client.replication.TestReplicationAdmin
Tests run: 3, Failures: 0, Errors: 0, Skipped: 0, Time elapsed: 2.018 sec
Running org.apache.hadoop.hbase.client.TestSnapshotCloneIndependence
Tests run: 6, Failures: 0, Errors: 0, Skipped: 0, Time elapsed: 30.998 sec
Running org.apache.hadoop.hbase.client.TestCloneSnapshotFromClientWithRegionReplicas
Tests run: 5, Failures: 0, Errors: 0, Skipped: 0, Time elapsed: 62.963 sec
Running org.apache.hadoop.hbase.client.TestClientScannerRPCTimeout
Tests run: 1, Failures: 0, Errors: 0, Skipped: 0, Time elapsed: 16.385 sec
Running org.apache.hadoop.hbase.client.TestHCM
Tests run: 21, Failures: 0, Errors: 0, Skipped: 2, Time elapsed: 157.338 sec
Running org.apache.hadoop.hbase.client.TestRpcControllerFactory
Tests run: 1, Failures: 0, Errors: 0, Skipped: 0, Time elapsed: 9.883 sec
Running org.apache.hadoop.hbase.client.TestScannersFromClientSide
Tests run: 5, Failures: 0, Errors: 0, Skipped: 0, Time elapsed: 13.202 sec
Running org.apache.hadoop.hbase.client.TestClientOperationInterrupt
Tests run: 1, Failures: 0, Errors: 0, Skipped: 0, Time elapsed: 62.712 sec
Running org.apache.hadoop.hbase.client.TestFromClientSide
Tests run: 79, Failures: 0, Errors: 0, Skipped: 4, Time elapsed: 97.123 sec
Running org.apache.hadoop.hbase.client.TestRestoreSnapshotFromClientWithRegionReplicas
Tests run: 5, Failures: 0, Errors: 0, Skipped: 0, Time elapsed: 84.968 sec
Running org.apache.hadoop.hbase.client.TestReplicaWithCluster
Tests run: 4, Failures: 0, Errors: 0, Skipped: 0, Time elapsed: 31.851 sec
Running org.apache.hadoop.hbase.client.TestHTableMultiplexer
Tests run: 1, Failures: 0, Errors: 0, Skipped: 0, Time elapsed: 13.899 sec
Running org.apache.hadoop.hbase.client.TestScannerTimeout
Tests run: 4, Failures: 0, Errors: 0, Skipped: 0, Time elapsed: 47.838 sec
Running org.apache.hadoop.hbase.client.TestReplicasClient
Tests run: 1, Failures: 0, Errors: 1, Skipped: 0, Time elapsed: 25.955 sec <<< FAILURE!
Running org.apache.hadoop.hbase.client.TestTableSnapshotScanner
Tests run: 3, Failures: 0, Errors: 0, Skipped: 0, Time elapsed: 39.823 sec
Running org.apache.hadoop.hbase.client.TestFromClientSide3
Tests run: 6, Failures: 0, Errors: 0, Skipped: 0, Time elapsed: 37.686 sec
Running org.apache.hadoop.hbase.client.TestRestoreSnapshotFromClient
Tests run: 5, Failures: 0, Errors: 0, Skipped: 0, Time elapsed: 86.859 sec
Running org.apache.hadoop.hbase.client.TestSnapshotMetadata
Tests run: 4, Failures: 0, Errors: 0, Skipped: 0, Time elapsed: 20.737 sec
Running org.apache.hadoop.hbase.TestMultiVersions
Tests run: 3, Failures: 0, Errors: 0, Skipped: 0, Time elapsed: 14.328 sec
Running org.apache.hadoop.hbase.TestHColumnDescriptorDefaultVersions
Tests run: 3, Failures: 0, Errors: 0, Skipped: 0, Time elapsed: 18.384 sec
Running org.apache.hadoop.hbase.procedure.TestZKProcedure
Tests run: 4, Failures: 0, Errors: 0, Skipped: 0, Time elapsed: 3.108 sec
Running org.apache.hadoop.hbase.procedure.TestZKProcedureControllers
Tests run: 4, Failures: 0, Errors: 0, Skipped: 0, Time elapsed: 2.575 sec
Running org.apache.hadoop.hbase.TestNamespace
Tests run: 9, Failures: 0, Errors: 0, Skipped: 1, Time elapsed: 14.883 sec
Running org.apache.hadoop.hbase.constraint.TestConstraint
Tests run: 5, Failures: 0, Errors: 0, Skipped: 0, Time elapsed: 14.313 sec
Running org.apache.hadoop.hbase.rest.TestDeleteRow
Tests run: 2, Failures: 0, Errors: 0, Skipped: 0, Time elapsed: 13.934 sec
Running org.apache.hadoop.hbase.rest.TestTableResource
Tests run: 8, Failures: 0, Errors: 0, Skipped: 0, Time elapsed: 25.588 sec
Running org.apache.hadoop.hbase.rest.TestScannersWithLabels
Tests run: 2, Failures: 0, Errors: 0, Skipped: 0, Time elapsed: 12.596 sec
Running org.apache.hadoop.hbase.rest.TestTableScan
Tests run: 10, Failures: 0, Errors: 0, Skipped: 0, Time elapsed: 34.837 sec
Running org.apache.hadoop.hbase.rest.TestSchemaResource
Tests run: 2, Failures: 0, Errors: 0, Skipped: 0, Time elapsed: 12.13 sec
Running org.apache.hadoop.hbase.rest.TestGetAndPutResource
Tests run: 18, Failures: 0, Errors: 0, Skipped: 0, Time elapsed: 24.084 sec
Running org.apache.hadoop.hbase.rest.TestStatusResource
Tests run: 2, Failures: 0, Errors: 0, Skipped: 0, Time elapsed: 11.751 sec
Running org.apache.hadoop.hbase.rest.TestResourceFilter
Tests run: 1, Failures: 0, Errors: 0, Skipped: 0, Time elapsed: 9.92 sec
Running org.apache.hadoop.hbase.client.TestAdmin
Tests run: 46, Failures: 0, Errors: 0, Skipped: 0, Time elapsed: 527.626 sec
Running org.apache.hadoop.hbase.rest.client.TestRemoteTable
Tests run: 9, Failures: 0, Errors: 0, Skipped: 0, Time elapsed: 20.216 sec
Running org.apache.hadoop.hbase.rest.TestVersionResource
Tests run: 7, Failures: 0, Errors: 0, Skipped: 0, Time elapsed: 11.473 sec
Running org.apache.hadoop.hbase.rest.TestMultiRowResource
Tests run: 3, Failures: 0, Errors: 0, Skipped: 0, Time elapsed: 13.341 sec
Running org.apache.hadoop.hbase.rest.TestScannersWithFilters
Tests run: 10, Failures: 0, Errors: 0, Skipped: 0, Time elapsed: 16.687 sec
Running org.apache.hadoop.hbase.rest.TestGzipFilter
Tests run: 2, Failures: 0, Errors: 0, Skipped: 0, Time elapsed: 12.973 sec
Running org.apache.hadoop.hbase.rest.TestScannerResource
Tests run: 5, Failures: 0, Errors: 0, Skipped: 0, Time elapsed: 30.703 sec
Running org.apache.hadoop.hbase.TestZooKeeper
Tests run: 11, Failures: 0, Errors: 0, Skipped: 0, Time elapsed: 219.299 sec
Running org.apache.hadoop.hbase.snapshot.TestFlushSnapshotFromClient
Tests run: 9, Failures: 0, Errors: 0, Skipped: 0, Time elapsed: 46.791 sec
Running org.apache.hadoop.hbase.snapshot.TestExportSnapshot
Tests run: 9, Failures: 0, Errors: 0, Skipped: 0, Time elapsed: 304.415 sec
Running org.apache.hadoop.hbase.snapshot.TestRestoreFlushSnapshotFromClient
Tests run: 5, Failures: 0, Errors: 0, Skipped: 0, Time elapsed: 53.157 sec
Running org.apache.hadoop.hbase.snapshot.TestSnapshotDescriptionUtils
Tests run: 2, Failures: 0, Errors: 0, Skipped: 0, Time elapsed: 1.59 sec
Running org.apache.hadoop.hbase.TestIOFencing
Tests run: 2, Failures: 1, Errors: 0, Skipped: 0, Time elapsed: 144.634 sec <<< FAILURE!
Running org.apache.hadoop.hbase.coprocessor.TestRegionObserverScannerOpenHook
Tests run: 3, Failures: 0, Errors: 0, Skipped: 0, Time elapsed: 10.946 sec
Running org.apache.hadoop.hbase.coprocessor.TestOpenTableInCoprocessor
Tests run: 2, Failures: 0, Errors: 0, Skipped: 0, Time elapsed: 13.134 sec
Running org.apache.hadoop.hbase.snapshot.TestSecureExportSnapshot
Tests run: 9, Failures: 0, Errors: 0, Skipped: 0, Time elapsed: 310.549 sec
Running org.apache.hadoop.hbase.coprocessor.TestMasterCoprocessorExceptionWithAbort
Tests run: 1, Failures: 0, Errors: 0, Skipped: 0, Time elapsed: 25.478 sec
Running org.apache.hadoop.hbase.coprocessor.TestMasterCoprocessorExceptionWithRemove
Tests run: 1, Failures: 0, Errors: 0, Skipped: 0, Time elapsed: 13.331 sec
Running org.apache.hadoop.hbase.coprocessor.TestAggregateProtocol
Tests run: 44, Failures: 0, Errors: 0, Skipped: 0, Time elapsed: 13.539 sec
Running org.apache.hadoop.hbase.coprocessor.TestBatchCoprocessorEndpoint
Tests run: 4, Failures: 0, Errors: 0, Skipped: 0, Time elapsed: 10.978 sec
Running org.apache.hadoop.hbase.coprocessor.TestRegionObserverInterface
Tests run: 12, Failures: 0, Errors: 0, Skipped: 0, Time elapsed: 42.681 sec
Running org.apache.hadoop.hbase.coprocessor.TestHTableWrapper
Tests run: 1, Failures: 0, Errors: 0, Skipped: 0, Time elapsed: 10.494 sec
Running org.apache.hadoop.hbase.coprocessor.TestRegionServerObserver
Tests run: 1, Failures: 0, Errors: 0, Skipped: 0, Time elapsed: 13.192 sec
Running org.apache.hadoop.hbase.coprocessor.TestRegionServerCoprocessorExceptionWithAbort
Tests run: 2, Failures: 0, Errors: 0, Skipped: 0, Time elapsed: 16.511 sec
Running org.apache.hadoop.hbase.coprocessor.TestClassLoading
Tests run: 8, Failures: 0, Errors: 0, Skipped: 0, Time elapsed: 24.074 sec
Running org.apache.hadoop.hbase.coprocessor.TestDoubleColumnInterpreter
Tests run: 38, Failures: 0, Errors: 0, Skipped: 0, Time elapsed: 14.304 sec
Running org.apache.hadoop.hbase.coprocessor.TestRegionObserverBypass
Tests run: 2, Failures: 0, Errors: 0, Skipped: 0, Time elapsed: 11.464 sec
Running org.apache.hadoop.hbase.coprocessor.TestRowProcessorEndpoint
Tests run: 4, Failures: 0, Errors: 0, Skipped: 0, Time elapsed: 15.929 sec
Running org.apache.hadoop.hbase.coprocessor.TestCoprocessorStop
Tests run: 1, Failures: 0, Errors: 0, Skipped: 0, Time elapsed: 24.667 sec
Running org.apache.hadoop.hbase.coprocessor.TestRegionServerCoprocessorExceptionWithRemove
Tests run: 1, Failures: 0, Errors: 0, Skipped: 0, Time elapsed: 21.374 sec
Running org.apache.hadoop.hbase.coprocessor.TestBigDecimalColumnInterpreter
Tests run: 38, Failures: 0, Errors: 0, Skipped: 0, Time elapsed: 13.255 sec
Running org.apache.hadoop.hbase.coprocessor.TestCoprocessorEndpoint
Tests run: 6, Failures: 0, Errors: 0, Skipped: 0, Time elapsed: 12.164 sec
Running org.apache.hadoop.hbase.coprocessor.TestMasterObserver
Tests run: 6, Failures: 0, Errors: 0, Skipped: 0, Time elapsed: 17.167 sec
Running org.apache.hadoop.hbase.TestGlobalMemStoreSize
Tests run: 1, Failures: 0, Errors: 0, Skipped: 0, Time elapsed: 12.438 sec
Running org.apache.hadoop.hbase.coprocessor.TestWALObserver
Tests run: 3, Failures: 0, Errors: 0, Skipped: 0, Time elapsed: 18.839 sec
Running org.apache.hadoop.hbase.TestMetaTableLocator
Tests run: 6, Failures: 0, Errors: 0, Skipped: 0, Time elapsed: 2.757 sec
Running org.apache.hadoop.hbase.zookeeper.TestZooKeeperACL
Tests run: 6, Failures: 0, Errors: 0, Skipped: 0, Time elapsed: 8.848 sec
Running org.apache.hadoop.hbase.zookeeper.TestZKTableStateManager
Tests run: 1, Failures: 0, Errors: 0, Skipped: 0, Time elapsed: 1.675 sec
Running org.apache.hadoop.hbase.zookeeper.TestZKMulti
Tests run: 6, Failures: 0, Errors: 0, Skipped: 0, Time elapsed: 1.423 sec
Running org.apache.hadoop.hbase.TestJMXListener
Tests run: 2, Failures: 0, Errors: 0, Skipped: 0, Time elapsed: 25.31 sec
Running org.apache.hadoop.hbase.zookeeper.TestZKLeaderManager
Tests run: 1, Failures: 0, Errors: 0, Skipped: 0, Time elapsed: 1.133 sec
Running org.apache.hadoop.hbase.zookeeper.TestRecoverableZooKeeper
Tests run: 1, Failures: 0, Errors: 0, Skipped: 0, Time elapsed: 2.071 sec
Running org.apache.hadoop.hbase.zookeeper.TestZooKeeperNodeTracker
Tests run: 3, Failures: 0, Errors: 0, Skipped: 0, Time elapsed: 2.035 sec
Running org.apache.hadoop.hbase.zookeeper.TestHQuorumPeer
Tests run: 3, Failures: 0, Errors: 0, Skipped: 0, Time elapsed: 2.285 sec
Running org.apache.hadoop.hbase.zookeeper.lock.TestZKInterProcessReadWriteLock
Tests run: 6, Failures: 0, Errors: 0, Skipped: 0, Time elapsed: 25.477 sec
Running org.apache.hadoop.hbase.TestClusterBootOrder
Tests run: 2, Failures: 0, Errors: 0, Skipped: 0, Time elapsed: 27.185 sec

Results :

Failed tests:   testCreateTableWithMultipleReplicas(org.apache.hadoop.hbase.master.TestMasterOperationsForRegionReplicas): expected:<3> but was:<2>
  testRetainAssignmentOnRestart(org.apache.hadoop.hbase.master.TestRestartCluster): expected:<...0.gq1.ygridcore.net:[59082]> but was:<...0.gq1.ygridcore.net:[49518]>
  testFencingAroundCompactionAfterWALSync(org.apache.hadoop.hbase.TestIOFencing): Timed out waiting for the region to flush

Tests in error: 
  org.apache.hadoop.hbase.regionserver.TestRegionReplicas: KeeperErrorCode = NoNode for /hbase/region-in-transition/1588230740
  org.apache.hadoop.hbase.client.TestReplicasClient: KeeperErrorCode = NoNode for /hbase/region-in-transition/1588230740

Tests run: 2070, Failures: 3, Errors: 2, Skipped: 19

[INFO] ------------------------------------------------------------------------
[INFO] Reactor Summary:
[INFO] 
[INFO] HBase ............................................. SUCCESS [2.967s]
[INFO] HBase - Common .................................... SUCCESS [38.107s]
[INFO] HBase - Protocol .................................. SUCCESS [11.122s]
[INFO] HBase - Client .................................... SUCCESS [55.552s]
[INFO] HBase - Hadoop Compatibility ...................... SUCCESS [5.369s]
[INFO] HBase - Hadoop Two Compatibility .................. SUCCESS [1.801s]
[INFO] HBase - Prefix Tree ............................... SUCCESS [4.196s]
[INFO] HBase - Server .................................... FAILURE [2:11:50.614s]
[INFO] HBase - Testing Util .............................. SKIPPED
[INFO] HBase - Thrift .................................... SKIPPED
[INFO] HBase - Shell ..................................... SKIPPED
[INFO] HBase - Integration Tests ......................... SKIPPED
[INFO] HBase - Examples .................................. SKIPPED
[INFO] HBase - Assembly .................................. SKIPPED
[INFO] ------------------------------------------------------------------------
[INFO] BUILD FAILURE
[INFO] ------------------------------------------------------------------------
[INFO] Total time: 2:13:50.620s
[INFO] Finished at: Wed Aug 06 18:18:21 UTC 2014
[INFO] Final Memory: 39M/758M
[INFO] ------------------------------------------------------------------------
[ERROR] Failed to execute goal org.apache.maven.plugins:maven-surefire-plugin:2.12-TRUNK-HBASE-2:test (secondPartTestsExecution) on project hbase-server: Failure or timeout -> [Help 1]
[ERROR] 
[ERROR] To see the full stack trace of the errors, re-run Maven with the -e switch.
[ERROR] Re-run Maven using the -X switch to enable full debug logging.
[ERROR] 
[ERROR] For more information about the errors and possible solutions, please read the following articles:
[ERROR] [Help 1] http://cwiki.apache.org/confluence/display/MAVEN/MojoExecutionException
[ERROR] 
[ERROR] After correcting the problems, you can resume the build with the command
[ERROR]   mvn <goals> -rf :hbase-server
Build step 'Invoke top-level Maven targets' marked build as failure
Performing Post build task...
Match found for :.* : True
Logical operation result is TRUE
Running script  :   ZOMBIE_TESTS_COUNT=`jps | grep surefirebooter | wc -l`
  if [[ $ZOMBIE_TESTS_COUNT != 0 ]] ; then
    #It seems sometimes the tests are not dying immediately. Let's give them 10s
    echo "Suspicious java process found - waiting 10s to see if there are just slow to stop"
    sleep 10   
    ZOMBIE_TESTS_COUNT=`jps | grep surefirebooter | wc -l`
    if [[ $ZOMBIE_TESTS_COUNT != 0 ]] ; then
      echo "There are $ZOMBIE_TESTS_COUNT zombie tests, they should have been killed by surefire but survived"
      echo "************ BEGIN zombies jstack extract"
      ZB_STACK=`jps | grep surefirebooter | cut -d ' ' -f 1 | xargs -n 1 jstack | grep ".test" | grep "\.java"`
      jps | grep surefirebooter | cut -d ' ' -f 1 | xargs -n 1 jstack
      echo "************ END  zombies jstack extract"
      JIRA_COMMENT="$JIRA_COMMENT

     {color:red}-1 core zombie tests{color}.  There are ${ZOMBIE_TESTS_COUNT} zombie test(s): ${ZB_STACK}"
      BAD=1
      jps | grep surefirebooter | cut -d ' ' -f 1 | xargs kill -9
    else
      echo "We're ok: there is no zombie test, but some tests took some time to stop"
    fi
  else
    echo "We're ok: there is no zombie test"
  fi
[HBase-TRUNK] $ /bin/bash -xe /tmp/hudson4507258370414833844.sh
++ jps
++ grep surefirebooter
++ wc -l
+ ZOMBIE_TESTS_COUNT=0
+ [[ 0 != 0 ]]
+ echo 'We'\''re ok: there is no zombie test'
We're ok: there is no zombie test
POST BUILD TASK : SUCCESS
END OF POST BUILD TASK : 0
Archiving artifacts
Sending artifact delta relative to HBase-TRUNK #5346
Archived 1741 artifacts
Archive block size is 32768
Received 74 blocks and 857407977 bytes
Compression is 0.3%
Took 5 min 42 sec
Recording test results

Build failed in Jenkins: HBase-TRUNK #5373

Posted by Apache Jenkins Server <je...@builds.apache.org>.
See <https://builds.apache.org/job/HBase-TRUNK/5373/changes>

Changes:

[tedyu] HBASE-11673 TestIOFencing#testFencingAroundCompactionAfterWALSync fails(Sergey Soldatov)

------------------------------------------
[...truncated 966 lines...]
Running org.apache.hadoop.hbase.io.hfile.TestFixedFileTrailer
Tests run: 4, Failures: 0, Errors: 0, Skipped: 0, Time elapsed: 0.122 sec
Running org.apache.hadoop.hbase.io.hfile.TestLruCachedBlock
Tests run: 1, Failures: 0, Errors: 0, Skipped: 0, Time elapsed: 0.026 sec
Running org.apache.hadoop.hbase.io.hfile.TestHFileInlineToRootChunkConversion
Tests run: 1, Failures: 0, Errors: 0, Skipped: 0, Time elapsed: 0.027 sec
Running org.apache.hadoop.hbase.io.hfile.TestHFile
Tests run: 7, Failures: 0, Errors: 0, Skipped: 0, Time elapsed: 0.477 sec
Running org.apache.hadoop.hbase.io.hfile.TestPrefetch
Tests run: 1, Failures: 0, Errors: 0, Skipped: 0, Time elapsed: 1.075 sec
Running org.apache.hadoop.hbase.io.hfile.TestCachedBlockQueue
Tests run: 2, Failures: 0, Errors: 0, Skipped: 0, Time elapsed: 0.045 sec
Running org.apache.hadoop.hbase.io.hfile.TestBlockCacheReporting
Tests run: 2, Failures: 0, Errors: 0, Skipped: 0, Time elapsed: 0.205 sec
Running org.apache.hadoop.hbase.io.hfile.TestSeekTo
Tests run: 4, Failures: 0, Errors: 0, Skipped: 0, Time elapsed: 0.409 sec
Running org.apache.hadoop.hbase.io.hfile.TestHFileWriterV3
Tests run: 4, Failures: 0, Errors: 0, Skipped: 0, Time elapsed: 1.561 sec
Running org.apache.hadoop.hbase.io.hfile.TestReseekTo
Tests run: 1, Failures: 0, Errors: 0, Skipped: 0, Time elapsed: 0.083 sec
Running org.apache.hadoop.hbase.io.hfile.TestHFileWriterV2
Tests run: 2, Failures: 0, Errors: 0, Skipped: 0, Time elapsed: 0.674 sec
Running org.apache.hadoop.hbase.io.hfile.TestHFileEncryption
Tests run: 3, Failures: 0, Errors: 0, Skipped: 0, Time elapsed: 2.008 sec
Running org.apache.hadoop.hbase.io.hfile.TestHFileDataBlockEncoder
Tests run: 30, Failures: 0, Errors: 0, Skipped: 0, Time elapsed: 0.761 sec
Running org.apache.hadoop.hbase.io.hfile.bucket.TestByteBufferIOEngine
Tests run: 1, Failures: 0, Errors: 0, Skipped: 0, Time elapsed: 0.092 sec
Running org.apache.hadoop.hbase.io.hfile.bucket.TestBucketCache
Tests run: 8, Failures: 0, Errors: 0, Skipped: 0, Time elapsed: 22.913 sec
Running org.apache.hadoop.hbase.io.hfile.bucket.TestFileIOEngine
Tests run: 1, Failures: 0, Errors: 0, Skipped: 0, Time elapsed: 0.034 sec
Running org.apache.hadoop.hbase.io.hfile.TestScannerSelectionUsingKeyRange
Tests run: 3, Failures: 0, Errors: 0, Skipped: 0, Time elapsed: 0.22 sec
Running org.apache.hadoop.hbase.io.hfile.TestChecksum
Tests run: 3, Failures: 0, Errors: 0, Skipped: 0, Time elapsed: 0.346 sec
Running org.apache.hadoop.hbase.io.TestImmutableBytesWritable
Tests run: 3, Failures: 0, Errors: 0, Skipped: 0, Time elapsed: 0.069 sec
Running org.apache.hadoop.hbase.io.TestHFileLink
Tests run: 2, Failures: 0, Errors: 0, Skipped: 0, Time elapsed: 0.044 sec
Running org.apache.hadoop.hbase.io.TestHeapSize
Tests run: 3, Failures: 0, Errors: 0, Skipped: 0, Time elapsed: 0.075 sec
Running org.apache.hadoop.hbase.io.TestReference
Tests run: 1, Failures: 0, Errors: 0, Skipped: 0, Time elapsed: 0.024 sec
Running org.apache.hadoop.hbase.constraint.TestConstraints
Tests run: 6, Failures: 0, Errors: 0, Skipped: 0, Time elapsed: 0.478 sec
Running org.apache.hadoop.hbase.TestServerLoad
Tests run: 2, Failures: 0, Errors: 0, Skipped: 0, Time elapsed: 0.05 sec
Running org.apache.hadoop.hbase.filter.TestInclusiveStopFilter
Tests run: 2, Failures: 0, Errors: 0, Skipped: 0, Time elapsed: 0.046 sec
Running org.apache.hadoop.hbase.filter.TestInvocationRecordFilter
Tests run: 1, Failures: 0, Errors: 0, Skipped: 0, Time elapsed: 0.062 sec
Running org.apache.hadoop.hbase.filter.TestFilterSerialization
Tests run: 25, Failures: 0, Errors: 0, Skipped: 0, Time elapsed: 0.705 sec
Running org.apache.hadoop.hbase.filter.TestFirstKeyValueMatchingQualifiersFilter
Tests run: 1, Failures: 0, Errors: 0, Skipped: 0, Time elapsed: 0.026 sec
Running org.apache.hadoop.hbase.filter.TestColumnPaginationFilter
Tests run: 1, Failures: 0, Errors: 0, Skipped: 0, Time elapsed: 0.024 sec
Running org.apache.hadoop.hbase.filter.TestRandomRowFilter
Tests run: 2, Failures: 0, Errors: 0, Skipped: 0, Time elapsed: 0.281 sec
Running org.apache.hadoop.hbase.filter.TestSingleColumnValueExcludeFilter
Tests run: 1, Failures: 0, Errors: 0, Skipped: 0, Time elapsed: 0.024 sec
Running org.apache.hadoop.hbase.filter.TestDependentColumnFilter
Tests run: 4, Failures: 0, Errors: 0, Skipped: 0, Time elapsed: 0.27 sec
Running org.apache.hadoop.hbase.filter.TestMultipleColumnPrefixFilter
Tests run: 3, Failures: 0, Errors: 0, Skipped: 0, Time elapsed: 3.365 sec
Running org.apache.hadoop.hbase.filter.TestSingleColumnValueFilter
Tests run: 2, Failures: 0, Errors: 0, Skipped: 0, Time elapsed: 0.055 sec
Running org.apache.hadoop.hbase.filter.TestNullComparator
Tests run: 3, Failures: 0, Errors: 0, Skipped: 0, Time elapsed: 0.072 sec
Running org.apache.hadoop.hbase.filter.TestColumnPrefixFilter
Tests run: 2, Failures: 0, Errors: 0, Skipped: 0, Time elapsed: 1.871 sec
Running org.apache.hadoop.hbase.filter.TestPrefixFilter
Tests run: 3, Failures: 0, Errors: 0, Skipped: 0, Time elapsed: 0.07 sec
Running org.apache.hadoop.hbase.filter.TestFilter
Tests run: 21, Failures: 0, Errors: 0, Skipped: 0, Time elapsed: 2.227 sec
Running org.apache.hadoop.hbase.filter.TestBitComparator
Tests run: 6, Failures: 0, Errors: 0, Skipped: 0, Time elapsed: 0.161 sec
Running org.apache.hadoop.hbase.filter.TestPageFilter
Tests run: 2, Failures: 0, Errors: 0, Skipped: 0, Time elapsed: 0.049 sec
Running org.apache.hadoop.hbase.filter.TestFuzzyRowFilter
Tests run: 2, Failures: 0, Errors: 0, Skipped: 0, Time elapsed: 0.049 sec
Running org.apache.hadoop.hbase.filter.TestFilterList
Tests run: 7, Failures: 0, Errors: 0, Skipped: 0, Time elapsed: 0.171 sec
Running org.apache.hadoop.hbase.filter.TestComparatorSerialization
Tests run: 6, Failures: 0, Errors: 0, Skipped: 0, Time elapsed: 0.144 sec
Running org.apache.hadoop.hbase.filter.TestParseFilter
Tests run: 34, Failures: 0, Errors: 0, Skipped: 0, Time elapsed: 0.828 sec
Running org.apache.hadoop.hbase.protobuf.TestProtobufUtil
Tests run: 7, Failures: 0, Errors: 0, Skipped: 0, Time elapsed: 0.18 sec
Running org.apache.hadoop.hbase.protobuf.TestReplicationProtobuf
Tests run: 1, Failures: 0, Errors: 0, Skipped: 0, Time elapsed: 0.027 sec
Running org.apache.hadoop.hbase.TestCompare
Tests run: 1, Failures: 0, Errors: 0, Skipped: 0, Time elapsed: 0.025 sec
Running org.apache.hadoop.hbase.codec.TestCellMessageCodec
Tests run: 3, Failures: 0, Errors: 0, Skipped: 0, Time elapsed: 0.079 sec
Running org.apache.hadoop.hbase.TestCheckTestClasses
Tests run: 1, Failures: 0, Errors: 0, Skipped: 0, Time elapsed: 0.838 sec
Running org.apache.hadoop.hbase.rest.TestGZIPResponseWrapper
Tests run: 4, Failures: 0, Errors: 0, Skipped: 0, Time elapsed: 0.102 sec
Running org.apache.hadoop.hbase.rest.client.TestRemoteHTableRetries
Tests run: 7, Failures: 0, Errors: 0, Skipped: 0, Time elapsed: 1.254 sec
Running org.apache.hadoop.hbase.rest.client.TestRemoteAdminRetries
Tests run: 7, Failures: 0, Errors: 0, Skipped: 0, Time elapsed: 1.237 sec
Running org.apache.hadoop.hbase.rest.model.TestTableRegionModel
Tests run: 8, Failures: 0, Errors: 0, Skipped: 0, Time elapsed: 0.268 sec
Running org.apache.hadoop.hbase.rest.model.TestScannerModel
Tests run: 6, Failures: 0, Errors: 0, Skipped: 0, Time elapsed: 0.176 sec
Running org.apache.hadoop.hbase.rest.model.TestCellSetModel
Tests run: 6, Failures: 0, Errors: 0, Skipped: 0, Time elapsed: 0.159 sec
Running org.apache.hadoop.hbase.rest.model.TestStorageClusterVersionModel
Tests run: 6, Failures: 0, Errors: 0, Skipped: 0, Time elapsed: 0.148 sec
Running org.apache.hadoop.hbase.rest.model.TestTableListModel
Tests run: 6, Failures: 0, Errors: 0, Skipped: 0, Time elapsed: 0.159 sec
Running org.apache.hadoop.hbase.rest.model.TestStorageClusterStatusModel
Tests run: 6, Failures: 0, Errors: 0, Skipped: 0, Time elapsed: 0.183 sec
Running org.apache.hadoop.hbase.rest.model.TestTableSchemaModel
Tests run: 6, Failures: 0, Errors: 0, Skipped: 0, Time elapsed: 0.164 sec
Running org.apache.hadoop.hbase.rest.model.TestTableInfoModel
Tests run: 6, Failures: 0, Errors: 0, Skipped: 0, Time elapsed: 0.165 sec
Running org.apache.hadoop.hbase.rest.model.TestRowModel
Tests run: 6, Failures: 0, Errors: 0, Skipped: 0, Time elapsed: 0.154 sec
Running org.apache.hadoop.hbase.rest.model.TestColumnSchemaModel
Tests run: 6, Failures: 0, Errors: 0, Skipped: 0, Time elapsed: 0.154 sec
Running org.apache.hadoop.hbase.rest.model.TestVersionModel
Tests run: 6, Failures: 0, Errors: 0, Skipped: 0, Time elapsed: 0.161 sec
Running org.apache.hadoop.hbase.rest.model.TestCellModel
Tests run: 6, Failures: 0, Errors: 0, Skipped: 0, Time elapsed: 0.149 sec
Running org.apache.hadoop.hbase.TestHTableDescriptor
Tests run: 11, Failures: 0, Errors: 0, Skipped: 0, Time elapsed: 0.268 sec
Running org.apache.hadoop.hbase.errorhandling.TestForeignExceptionSerialization
Tests run: 2, Failures: 0, Errors: 0, Skipped: 0, Time elapsed: 0.069 sec
Running org.apache.hadoop.hbase.errorhandling.TestTimeoutExceptionInjector
Tests run: 4, Failures: 0, Errors: 0, Skipped: 0, Time elapsed: 0.142 sec
Running org.apache.hadoop.hbase.errorhandling.TestForeignExceptionDispatcher
Tests run: 3, Failures: 0, Errors: 0, Skipped: 0, Time elapsed: 0.075 sec
Running org.apache.hadoop.hbase.replication.regionserver.TestReplicationSinkManager
Tests run: 5, Failures: 0, Errors: 0, Skipped: 0, Time elapsed: 0.218 sec
Running org.apache.hadoop.hbase.replication.regionserver.TestReplicationThrottler
Tests run: 1, Failures: 0, Errors: 0, Skipped: 0, Time elapsed: 0.019 sec
Running org.apache.hadoop.hbase.master.TestClockSkewDetection
Tests run: 1, Failures: 0, Errors: 1, Skipped: 0, Time elapsed: 246.479 sec <<< FAILURE!
Running org.apache.hadoop.hbase.procedure.TestProcedureManager
Tests run: 1, Failures: 0, Errors: 1, Skipped: 0, Time elapsed: 246.479 sec <<< FAILURE!
Running org.apache.hadoop.hbase.security.TestSecureRPC
Tests run: 1, Failures: 0, Errors: 0, Skipped: 1, Time elapsed: 246.479 sec
Running org.apache.hadoop.hbase.security.TestUsersOperationsWithSecureHadoop
Tests run: 1, Failures: 0, Errors: 0, Skipped: 1, Time elapsed: 246.479 sec
Running org.apache.hadoop.hbase.replication.TestReplicationWALEntryFilters
Tests run: 4, Failures: 0, Errors: 0, Skipped: 0, Time elapsed: 246.479 sec
Running org.apache.hadoop.hbase.ipc.TestIPC
Tests run: 4, Failures: 1, Errors: 3, Skipped: 0, Time elapsed: 246.479 sec <<< FAILURE!

Results :

Failed tests:   testRTEDuringConnectionSetup(org.apache.hadoop.hbase.ipc.TestIPC)

Tests in error: 
  testClockSkewDetection(org.apache.hadoop.hbase.master.TestClockSkewDetection): asf901.ygridcore.net: asf901.ygridcore.net
  org.apache.hadoop.hbase.procedure.TestProcedureManager: asf901.ygridcore.net: asf901.ygridcore.net
  testRpcScheduler(org.apache.hadoop.hbase.ipc.TestIPC): asf901.ygridcore.net: asf901.ygridcore.net
  testCompressCellBlock(org.apache.hadoop.hbase.ipc.TestIPC): asf901.ygridcore.net: asf901.ygridcore.net
  testNoCodec(org.apache.hadoop.hbase.ipc.TestIPC): asf901.ygridcore.net: asf901.ygridcore.net

Tests run: 907, Failures: 1, Errors: 5, Skipped: 6

[INFO] ------------------------------------------------------------------------
[INFO] Reactor Summary:
[INFO] 
[INFO] HBase ............................................. SUCCESS [2.423s]
[INFO] HBase - Common .................................... SUCCESS [29.727s]
[INFO] HBase - Protocol .................................. SUCCESS [9.441s]
[INFO] HBase - Client .................................... SUCCESS [55.232s]
[INFO] HBase - Hadoop Compatibility ...................... SUCCESS [5.537s]
[INFO] HBase - Hadoop Two Compatibility .................. SUCCESS [1.804s]
[INFO] HBase - Prefix Tree ............................... SUCCESS [3.430s]
[INFO] HBase - Server .................................... FAILURE [4:24.181s]
[INFO] HBase - Testing Util .............................. SKIPPED
[INFO] HBase - Thrift .................................... SKIPPED
[INFO] HBase - Shell ..................................... SKIPPED
[INFO] HBase - Integration Tests ......................... SKIPPED
[INFO] HBase - Examples .................................. SKIPPED
[INFO] HBase - Assembly .................................. SKIPPED
[INFO] ------------------------------------------------------------------------
[INFO] BUILD FAILURE
[INFO] ------------------------------------------------------------------------
[INFO] Total time: 6:12.576s
[INFO] Finished at: Wed Aug 06 03:29:32 UTC 2014
[INFO] Final Memory: 76M/1107M
[INFO] ------------------------------------------------------------------------
[ERROR] Failed to execute goal org.apache.maven.plugins:maven-surefire-plugin:2.12-TRUNK-HBASE-2:test (default-test) on project hbase-server: There are test failures.
[ERROR] 
[ERROR] Please refer to <https://builds.apache.org/job/HBase-TRUNK/ws/hbase-server/target/surefire-reports> for the individual test results.
[ERROR] -> [Help 1]
[ERROR] 
[ERROR] To see the full stack trace of the errors, re-run Maven with the -e switch.
[ERROR] Re-run Maven using the -X switch to enable full debug logging.
[ERROR] 
[ERROR] For more information about the errors and possible solutions, please read the following articles:
[ERROR] [Help 1] http://cwiki.apache.org/confluence/display/MAVEN/MojoFailureException
[ERROR] 
[ERROR] After correcting the problems, you can resume the build with the command
[ERROR]   mvn <goals> -rf :hbase-server
Build step 'Invoke top-level Maven targets' marked build as failure
Performing Post build task...
Match found for :.* : True
Logical operation result is TRUE
Running script  :   ZOMBIE_TESTS_COUNT=`jps | grep surefirebooter | wc -l`
  if [[ $ZOMBIE_TESTS_COUNT != 0 ]] ; then
    #It seems sometimes the tests are not dying immediately. Let's give them 10s
    echo "Suspicious java process found - waiting 10s to see if there are just slow to stop"
    sleep 10   
    ZOMBIE_TESTS_COUNT=`jps | grep surefirebooter | wc -l`
    if [[ $ZOMBIE_TESTS_COUNT != 0 ]] ; then
      echo "There are $ZOMBIE_TESTS_COUNT zombie tests, they should have been killed by surefire but survived"
      echo "************ BEGIN zombies jstack extract"
      ZB_STACK=`jps | grep surefirebooter | cut -d ' ' -f 1 | xargs -n 1 jstack | grep ".test" | grep "\.java"`
      jps | grep surefirebooter | cut -d ' ' -f 1 | xargs -n 1 jstack
      echo "************ END  zombies jstack extract"
      JIRA_COMMENT="$JIRA_COMMENT

     {color:red}-1 core zombie tests{color}.  There are ${ZOMBIE_TESTS_COUNT} zombie test(s): ${ZB_STACK}"
      BAD=1
      jps | grep surefirebooter | cut -d ' ' -f 1 | xargs kill -9
    else
      echo "We're ok: there is no zombie test, but some tests took some time to stop"
    fi
  else
    echo "We're ok: there is no zombie test"
  fi
[HBase-TRUNK] $ /bin/bash -xe /tmp/hudson1517723526412239706.sh
++ jps
++ grep surefirebooter
++ wc -l
+ ZOMBIE_TESTS_COUNT=0
+ [[ 0 != 0 ]]
+ echo 'We'\''re ok: there is no zombie test'
We're ok: there is no zombie test
POST BUILD TASK : SUCCESS
END OF POST BUILD TASK : 0
Archiving artifacts
Sending artifact delta relative to HBase-TRUNK #5346
Archived 832 artifacts
Archive block size is 32768
Received 7 blocks and 35972192 bytes
Compression is 0.6%
Took 1 min 17 sec
Recording test results
Updating HBASE-11673

Build failed in Jenkins: HBase-TRUNK #5372

Posted by Apache Jenkins Server <je...@builds.apache.org>.
See <https://builds.apache.org/job/HBase-TRUNK/5372/changes>

Changes:

[ndimiduk] HBASE-11674 LoadIncrementalHFiles should be more verbose after unrecoverable error (Jan Lukavsky)

------------------------------------------
[...truncated 1591 lines...]
Tests run: 6, Failures: 0, Errors: 0, Skipped: 0, Time elapsed: 29.887 sec
Running org.apache.hadoop.hbase.client.TestCloneSnapshotFromClientWithRegionReplicas
Tests run: 5, Failures: 0, Errors: 0, Skipped: 0, Time elapsed: 64.793 sec
Running org.apache.hadoop.hbase.client.TestClientScannerRPCTimeout
Tests run: 1, Failures: 0, Errors: 0, Skipped: 0, Time elapsed: 15.922 sec
Running org.apache.hadoop.hbase.client.TestHCM
Tests run: 21, Failures: 0, Errors: 0, Skipped: 2, Time elapsed: 166.969 sec
Running org.apache.hadoop.hbase.client.TestRpcControllerFactory
Tests run: 1, Failures: 0, Errors: 0, Skipped: 0, Time elapsed: 9.761 sec
Running org.apache.hadoop.hbase.client.TestScannersFromClientSide
Tests run: 5, Failures: 0, Errors: 0, Skipped: 0, Time elapsed: 12.859 sec
Running org.apache.hadoop.hbase.client.TestClientOperationInterrupt
Tests run: 1, Failures: 0, Errors: 0, Skipped: 0, Time elapsed: 62.712 sec
Running org.apache.hadoop.hbase.client.TestFromClientSide
Tests run: 79, Failures: 0, Errors: 0, Skipped: 4, Time elapsed: 99.984 sec
Running org.apache.hadoop.hbase.client.TestRestoreSnapshotFromClientWithRegionReplicas
Tests run: 5, Failures: 0, Errors: 0, Skipped: 0, Time elapsed: 92.605 sec
Running org.apache.hadoop.hbase.client.TestReplicaWithCluster
Tests run: 4, Failures: 0, Errors: 0, Skipped: 0, Time elapsed: 36.427 sec
Running org.apache.hadoop.hbase.client.TestHTableMultiplexer
Tests run: 1, Failures: 0, Errors: 0, Skipped: 0, Time elapsed: 13.813 sec
Running org.apache.hadoop.hbase.client.TestScannerTimeout
Tests run: 4, Failures: 0, Errors: 0, Skipped: 0, Time elapsed: 47.647 sec
Running org.apache.hadoop.hbase.client.TestReplicasClient
Tests run: 1, Failures: 0, Errors: 1, Skipped: 0, Time elapsed: 25.781 sec <<< FAILURE!
Running org.apache.hadoop.hbase.client.TestTableSnapshotScanner
Tests run: 3, Failures: 0, Errors: 0, Skipped: 0, Time elapsed: 37.016 sec
Running org.apache.hadoop.hbase.client.TestFromClientSide3
Tests run: 6, Failures: 0, Errors: 0, Skipped: 0, Time elapsed: 37.282 sec
Running org.apache.hadoop.hbase.client.TestRestoreSnapshotFromClient
Tests run: 5, Failures: 0, Errors: 0, Skipped: 0, Time elapsed: 87.064 sec
Running org.apache.hadoop.hbase.client.TestSnapshotMetadata
Tests run: 4, Failures: 0, Errors: 0, Skipped: 0, Time elapsed: 19.358 sec
Running org.apache.hadoop.hbase.TestMultiVersions
Tests run: 3, Failures: 0, Errors: 0, Skipped: 0, Time elapsed: 14.093 sec
Running org.apache.hadoop.hbase.TestHColumnDescriptorDefaultVersions
Tests run: 3, Failures: 0, Errors: 0, Skipped: 0, Time elapsed: 19.136 sec
Running org.apache.hadoop.hbase.procedure.TestZKProcedure
Tests run: 4, Failures: 0, Errors: 0, Skipped: 0, Time elapsed: 3.151 sec
Running org.apache.hadoop.hbase.procedure.TestZKProcedureControllers
Tests run: 4, Failures: 0, Errors: 0, Skipped: 0, Time elapsed: 2.606 sec
Running org.apache.hadoop.hbase.TestNamespace
Tests run: 9, Failures: 0, Errors: 0, Skipped: 1, Time elapsed: 14.908 sec
Running org.apache.hadoop.hbase.constraint.TestConstraint
Tests run: 5, Failures: 0, Errors: 0, Skipped: 0, Time elapsed: 14.392 sec
Running org.apache.hadoop.hbase.rest.TestDeleteRow
Tests run: 2, Failures: 0, Errors: 0, Skipped: 0, Time elapsed: 13.703 sec
Running org.apache.hadoop.hbase.rest.TestTableResource
Tests run: 8, Failures: 0, Errors: 0, Skipped: 0, Time elapsed: 25.449 sec
Running org.apache.hadoop.hbase.rest.TestScannersWithLabels
Tests run: 2, Failures: 0, Errors: 0, Skipped: 0, Time elapsed: 11.846 sec
Running org.apache.hadoop.hbase.rest.TestTableScan
Tests run: 10, Failures: 0, Errors: 0, Skipped: 0, Time elapsed: 33.919 sec
Running org.apache.hadoop.hbase.rest.TestSchemaResource
Tests run: 2, Failures: 0, Errors: 0, Skipped: 0, Time elapsed: 12.917 sec
Running org.apache.hadoop.hbase.rest.TestGetAndPutResource
Tests run: 18, Failures: 0, Errors: 0, Skipped: 0, Time elapsed: 24.319 sec
Running org.apache.hadoop.hbase.rest.TestStatusResource
Tests run: 2, Failures: 0, Errors: 0, Skipped: 0, Time elapsed: 11.353 sec
Running org.apache.hadoop.hbase.rest.TestResourceFilter
Tests run: 1, Failures: 0, Errors: 0, Skipped: 0, Time elapsed: 9.903 sec
Running org.apache.hadoop.hbase.client.TestAdmin
Tests run: 46, Failures: 0, Errors: 0, Skipped: 0, Time elapsed: 527.882 sec
Running org.apache.hadoop.hbase.rest.TestVersionResource
Tests run: 7, Failures: 0, Errors: 0, Skipped: 0, Time elapsed: 13.095 sec
Running org.apache.hadoop.hbase.rest.client.TestRemoteTable
Tests run: 9, Failures: 0, Errors: 0, Skipped: 0, Time elapsed: 18.757 sec
Running org.apache.hadoop.hbase.rest.TestMultiRowResource
Tests run: 3, Failures: 0, Errors: 0, Skipped: 0, Time elapsed: 12.365 sec
Running org.apache.hadoop.hbase.rest.TestScannersWithFilters
Tests run: 10, Failures: 0, Errors: 0, Skipped: 0, Time elapsed: 16.516 sec
Running org.apache.hadoop.hbase.rest.TestGzipFilter
Tests run: 2, Failures: 0, Errors: 0, Skipped: 0, Time elapsed: 13.152 sec
Running org.apache.hadoop.hbase.rest.TestScannerResource
Tests run: 5, Failures: 0, Errors: 0, Skipped: 0, Time elapsed: 31.944 sec
Running org.apache.hadoop.hbase.TestZooKeeper
Tests run: 11, Failures: 0, Errors: 0, Skipped: 0, Time elapsed: 219.463 sec
Running org.apache.hadoop.hbase.snapshot.TestFlushSnapshotFromClient
Tests run: 9, Failures: 0, Errors: 0, Skipped: 0, Time elapsed: 45.649 sec
Running org.apache.hadoop.hbase.snapshot.TestExportSnapshot
Tests run: 9, Failures: 0, Errors: 0, Skipped: 0, Time elapsed: 302.921 sec
Running org.apache.hadoop.hbase.snapshot.TestRestoreFlushSnapshotFromClient
Tests run: 5, Failures: 0, Errors: 0, Skipped: 0, Time elapsed: 53.298 sec
Running org.apache.hadoop.hbase.snapshot.TestSnapshotDescriptionUtils
Tests run: 2, Failures: 0, Errors: 0, Skipped: 0, Time elapsed: 1.578 sec
Running org.apache.hadoop.hbase.TestIOFencing
Tests run: 2, Failures: 0, Errors: 0, Skipped: 0, Time elapsed: 190.544 sec
Running org.apache.hadoop.hbase.snapshot.TestSecureExportSnapshot
Tests run: 9, Failures: 0, Errors: 0, Skipped: 0, Time elapsed: 315.492 sec
Running org.apache.hadoop.hbase.coprocessor.TestRegionObserverScannerOpenHook
Tests run: 3, Failures: 0, Errors: 0, Skipped: 0, Time elapsed: 11.106 sec
Running org.apache.hadoop.hbase.coprocessor.TestOpenTableInCoprocessor
Tests run: 2, Failures: 0, Errors: 0, Skipped: 0, Time elapsed: 14.179 sec
Running org.apache.hadoop.hbase.coprocessor.TestMasterCoprocessorExceptionWithAbort
Tests run: 1, Failures: 0, Errors: 0, Skipped: 0, Time elapsed: 25.425 sec
Running org.apache.hadoop.hbase.coprocessor.TestMasterCoprocessorExceptionWithRemove
Tests run: 1, Failures: 0, Errors: 0, Skipped: 0, Time elapsed: 13.653 sec
Running org.apache.hadoop.hbase.coprocessor.TestRegionObserverInterface
Tests run: 12, Failures: 0, Errors: 0, Skipped: 0, Time elapsed: 42.206 sec
Running org.apache.hadoop.hbase.coprocessor.TestAggregateProtocol
Tests run: 44, Failures: 0, Errors: 0, Skipped: 0, Time elapsed: 13.439 sec
Running org.apache.hadoop.hbase.coprocessor.TestBatchCoprocessorEndpoint
Tests run: 4, Failures: 0, Errors: 0, Skipped: 0, Time elapsed: 11.619 sec
Running org.apache.hadoop.hbase.coprocessor.TestHTableWrapper
Tests run: 1, Failures: 0, Errors: 0, Skipped: 0, Time elapsed: 11.59 sec
Running org.apache.hadoop.hbase.coprocessor.TestRegionServerObserver
Tests run: 1, Failures: 0, Errors: 0, Skipped: 0, Time elapsed: 12.82 sec
Running org.apache.hadoop.hbase.coprocessor.TestClassLoading
Tests run: 8, Failures: 0, Errors: 0, Skipped: 0, Time elapsed: 23.04 sec
Running org.apache.hadoop.hbase.coprocessor.TestRegionServerCoprocessorExceptionWithAbort
Tests run: 2, Failures: 0, Errors: 0, Skipped: 0, Time elapsed: 17.088 sec
Running org.apache.hadoop.hbase.coprocessor.TestDoubleColumnInterpreter
Tests run: 38, Failures: 0, Errors: 0, Skipped: 0, Time elapsed: 13.434 sec
Running org.apache.hadoop.hbase.coprocessor.TestRegionObserverBypass
Tests run: 2, Failures: 0, Errors: 0, Skipped: 0, Time elapsed: 12.178 sec
Running org.apache.hadoop.hbase.coprocessor.TestRowProcessorEndpoint
Tests run: 4, Failures: 0, Errors: 0, Skipped: 0, Time elapsed: 16.187 sec
Running org.apache.hadoop.hbase.coprocessor.TestCoprocessorStop
Tests run: 1, Failures: 0, Errors: 0, Skipped: 0, Time elapsed: 25.009 sec
Running org.apache.hadoop.hbase.coprocessor.TestRegionServerCoprocessorExceptionWithRemove
Tests run: 1, Failures: 0, Errors: 0, Skipped: 0, Time elapsed: 22.821 sec
Running org.apache.hadoop.hbase.coprocessor.TestBigDecimalColumnInterpreter
Tests run: 38, Failures: 0, Errors: 0, Skipped: 0, Time elapsed: 13.148 sec
Running org.apache.hadoop.hbase.coprocessor.TestCoprocessorEndpoint
Tests run: 6, Failures: 0, Errors: 0, Skipped: 0, Time elapsed: 12.001 sec
Running org.apache.hadoop.hbase.coprocessor.TestMasterObserver
Tests run: 6, Failures: 0, Errors: 0, Skipped: 0, Time elapsed: 17.928 sec
Running org.apache.hadoop.hbase.TestGlobalMemStoreSize
Tests run: 1, Failures: 0, Errors: 0, Skipped: 0, Time elapsed: 12.706 sec
Running org.apache.hadoop.hbase.coprocessor.TestWALObserver
Tests run: 3, Failures: 0, Errors: 0, Skipped: 0, Time elapsed: 18.773 sec
Running org.apache.hadoop.hbase.TestMetaTableLocator
Tests run: 6, Failures: 0, Errors: 0, Skipped: 0, Time elapsed: 2.667 sec
Running org.apache.hadoop.hbase.zookeeper.TestZooKeeperACL
Tests run: 6, Failures: 0, Errors: 0, Skipped: 0, Time elapsed: 9.08 sec
Running org.apache.hadoop.hbase.zookeeper.TestZKTableStateManager
Tests run: 1, Failures: 0, Errors: 0, Skipped: 0, Time elapsed: 1.573 sec
Running org.apache.hadoop.hbase.zookeeper.TestZKMulti
Tests run: 6, Failures: 0, Errors: 0, Skipped: 0, Time elapsed: 1.266 sec
Running org.apache.hadoop.hbase.TestJMXListener
Tests run: 2, Failures: 0, Errors: 0, Skipped: 0, Time elapsed: 25.132 sec
Running org.apache.hadoop.hbase.zookeeper.TestZKLeaderManager
Tests run: 1, Failures: 0, Errors: 0, Skipped: 0, Time elapsed: 1.161 sec
Running org.apache.hadoop.hbase.zookeeper.TestRecoverableZooKeeper
Tests run: 1, Failures: 0, Errors: 0, Skipped: 0, Time elapsed: 2.077 sec
Running org.apache.hadoop.hbase.zookeeper.TestZooKeeperNodeTracker
Tests run: 3, Failures: 0, Errors: 0, Skipped: 0, Time elapsed: 1.876 sec
Running org.apache.hadoop.hbase.zookeeper.TestHQuorumPeer
Tests run: 3, Failures: 0, Errors: 0, Skipped: 0, Time elapsed: 2.468 sec
Running org.apache.hadoop.hbase.zookeeper.lock.TestZKInterProcessReadWriteLock
Tests run: 6, Failures: 0, Errors: 0, Skipped: 0, Time elapsed: 25.53 sec
Running org.apache.hadoop.hbase.TestClusterBootOrder
Tests run: 2, Failures: 0, Errors: 0, Skipped: 0, Time elapsed: 26.681 sec

Results :

Failed tests:   testCreateTableWithMultipleReplicas(org.apache.hadoop.hbase.master.TestMasterOperationsForRegionReplicas): expected:<3> but was:<2>
  testRetainAssignmentOnRestart(org.apache.hadoop.hbase.master.TestRestartCluster): expected:<...0.gq1.ygridcore.net:[42937]> but was:<...0.gq1.ygridcore.net:[53016]>
  testRebalanceOnRegionServerNumberChange[1](org.apache.hadoop.hbase.TestRegionRebalancing): After 5 attempts, region assignments were not balanced.

Tests in error: 
  org.apache.hadoop.hbase.regionserver.TestRegionReplicas: KeeperErrorCode = NoNode for /hbase/region-in-transition/1588230740
  org.apache.hadoop.hbase.client.TestReplicasClient: KeeperErrorCode = NoNode for /hbase/region-in-transition/1588230740

Tests run: 2073, Failures: 3, Errors: 2, Skipped: 19

[INFO] ------------------------------------------------------------------------
[INFO] Reactor Summary:
[INFO] 
[INFO] HBase ............................................. SUCCESS [3.097s]
[INFO] HBase - Common .................................... SUCCESS [37.675s]
[INFO] HBase - Protocol .................................. SUCCESS [10.459s]
[INFO] HBase - Client .................................... SUCCESS [55.454s]
[INFO] HBase - Hadoop Compatibility ...................... SUCCESS [5.377s]
[INFO] HBase - Hadoop Two Compatibility .................. SUCCESS [1.658s]
[INFO] HBase - Prefix Tree ............................... SUCCESS [3.960s]
[INFO] HBase - Server .................................... FAILURE [2:10:11.178s]
[INFO] HBase - Testing Util .............................. SKIPPED
[INFO] HBase - Thrift .................................... SKIPPED
[INFO] HBase - Shell ..................................... SKIPPED
[INFO] HBase - Integration Tests ......................... SKIPPED
[INFO] HBase - Examples .................................. SKIPPED
[INFO] HBase - Assembly .................................. SKIPPED
[INFO] ------------------------------------------------------------------------
[INFO] BUILD FAILURE
[INFO] ------------------------------------------------------------------------
[INFO] Total time: 2:12:09.795s
[INFO] Finished at: Wed Aug 06 02:21:39 UTC 2014
[INFO] Final Memory: 39M/756M
[INFO] ------------------------------------------------------------------------
[ERROR] Failed to execute goal org.apache.maven.plugins:maven-surefire-plugin:2.12-TRUNK-HBASE-2:test (secondPartTestsExecution) on project hbase-server: There are test failures.
[ERROR] 
[ERROR] Please refer to <https://builds.apache.org/job/HBase-TRUNK/ws/hbase-server/target/surefire-reports> for the individual test results.
[ERROR] -> [Help 1]
[ERROR] 
[ERROR] To see the full stack trace of the errors, re-run Maven with the -e switch.
[ERROR] Re-run Maven using the -X switch to enable full debug logging.
[ERROR] 
[ERROR] For more information about the errors and possible solutions, please read the following articles:
[ERROR] [Help 1] http://cwiki.apache.org/confluence/display/MAVEN/MojoFailureException
[ERROR] 
[ERROR] After correcting the problems, you can resume the build with the command
[ERROR]   mvn <goals> -rf :hbase-server
Build step 'Invoke top-level Maven targets' marked build as failure
Performing Post build task...
Match found for :.* : True
Logical operation result is TRUE
Running script  :   ZOMBIE_TESTS_COUNT=`jps | grep surefirebooter | wc -l`
  if [[ $ZOMBIE_TESTS_COUNT != 0 ]] ; then
    #It seems sometimes the tests are not dying immediately. Let's give them 10s
    echo "Suspicious java process found - waiting 10s to see if there are just slow to stop"
    sleep 10   
    ZOMBIE_TESTS_COUNT=`jps | grep surefirebooter | wc -l`
    if [[ $ZOMBIE_TESTS_COUNT != 0 ]] ; then
      echo "There are $ZOMBIE_TESTS_COUNT zombie tests, they should have been killed by surefire but survived"
      echo "************ BEGIN zombies jstack extract"
      ZB_STACK=`jps | grep surefirebooter | cut -d ' ' -f 1 | xargs -n 1 jstack | grep ".test" | grep "\.java"`
      jps | grep surefirebooter | cut -d ' ' -f 1 | xargs -n 1 jstack
      echo "************ END  zombies jstack extract"
      JIRA_COMMENT="$JIRA_COMMENT

     {color:red}-1 core zombie tests{color}.  There are ${ZOMBIE_TESTS_COUNT} zombie test(s): ${ZB_STACK}"
      BAD=1
      jps | grep surefirebooter | cut -d ' ' -f 1 | xargs kill -9
    else
      echo "We're ok: there is no zombie test, but some tests took some time to stop"
    fi
  else
    echo "We're ok: there is no zombie test"
  fi
[HBase-TRUNK] $ /bin/bash -xe /tmp/hudson82993503084573538.sh
++ jps
++ grep surefirebooter
++ wc -l
+ ZOMBIE_TESTS_COUNT=0
+ [[ 0 != 0 ]]
+ echo 'We'\''re ok: there is no zombie test'
We're ok: there is no zombie test
POST BUILD TASK : SUCCESS
END OF POST BUILD TASK : 0
Archiving artifacts
Sending artifact delta relative to HBase-TRUNK #5346
Archived 1744 artifacts
Archive block size is 32768
Received 74 blocks and 930335658 bytes
Compression is 0.3%
Took 6 min 12 sec
Recording test results
Updating HBASE-11674

Build failed in Jenkins: HBase-TRUNK #5371

Posted by Apache Jenkins Server <je...@builds.apache.org>.
See <https://builds.apache.org/job/HBase-TRUNK/5371/changes>

Changes:

[jxiang] HBASE-11671 TestEndToEndSplitTransaction fails on master (Mikhail Antonov)

------------------------------------------
[...truncated 1601 lines...]
Running org.apache.hadoop.hbase.client.TestFromClientSide
Tests run: 79, Failures: 0, Errors: 0, Skipped: 4, Time elapsed: 92.821 sec
Running org.apache.hadoop.hbase.client.TestRestoreSnapshotFromClientWithRegionReplicas
Tests run: 5, Failures: 0, Errors: 0, Skipped: 0, Time elapsed: 83.957 sec
Running org.apache.hadoop.hbase.client.TestReplicaWithCluster
Tests run: 4, Failures: 0, Errors: 0, Skipped: 0, Time elapsed: 29.58 sec
Running org.apache.hadoop.hbase.client.TestAdmin
Tests run: 46, Failures: 0, Errors: 0, Skipped: 0, Time elapsed: 460.588 sec
Running org.apache.hadoop.hbase.client.TestHTableMultiplexer
Tests run: 1, Failures: 0, Errors: 0, Skipped: 0, Time elapsed: 13.244 sec
Running org.apache.hadoop.hbase.client.TestReplicasClient
Tests run: 1, Failures: 0, Errors: 1, Skipped: 0, Time elapsed: 25.754 sec <<< FAILURE!
Running org.apache.hadoop.hbase.client.TestScannerTimeout
Tests run: 4, Failures: 0, Errors: 0, Skipped: 0, Time elapsed: 46.791 sec
Running org.apache.hadoop.hbase.client.TestTableSnapshotScanner
Tests run: 3, Failures: 0, Errors: 0, Skipped: 0, Time elapsed: 39.797 sec
Running org.apache.hadoop.hbase.client.TestFromClientSide3
Tests run: 6, Failures: 0, Errors: 0, Skipped: 0, Time elapsed: 38.434 sec
Running org.apache.hadoop.hbase.client.TestSnapshotMetadata
Tests run: 4, Failures: 0, Errors: 0, Skipped: 0, Time elapsed: 19.285 sec
Running org.apache.hadoop.hbase.TestMultiVersions
Tests run: 3, Failures: 0, Errors: 0, Skipped: 0, Time elapsed: 13.001 sec
Running org.apache.hadoop.hbase.TestHColumnDescriptorDefaultVersions
Tests run: 3, Failures: 0, Errors: 0, Skipped: 0, Time elapsed: 19.763 sec
Running org.apache.hadoop.hbase.procedure.TestZKProcedure
Tests run: 4, Failures: 0, Errors: 0, Skipped: 0, Time elapsed: 2.978 sec
Running org.apache.hadoop.hbase.procedure.TestZKProcedureControllers
Tests run: 4, Failures: 0, Errors: 0, Skipped: 0, Time elapsed: 2.476 sec
Running org.apache.hadoop.hbase.TestNamespace
Tests run: 9, Failures: 0, Errors: 0, Skipped: 1, Time elapsed: 13.977 sec
Running org.apache.hadoop.hbase.client.TestRestoreSnapshotFromClient
Tests run: 5, Failures: 0, Errors: 0, Skipped: 0, Time elapsed: 84.594 sec
Running org.apache.hadoop.hbase.constraint.TestConstraint
Tests run: 5, Failures: 0, Errors: 0, Skipped: 0, Time elapsed: 14.31 sec
Running org.apache.hadoop.hbase.rest.TestDeleteRow
Tests run: 2, Failures: 0, Errors: 0, Skipped: 0, Time elapsed: 13.382 sec
Running org.apache.hadoop.hbase.rest.TestScannersWithLabels
Tests run: 2, Failures: 0, Errors: 0, Skipped: 0, Time elapsed: 11.838 sec
Running org.apache.hadoop.hbase.rest.TestTableResource
Tests run: 8, Failures: 0, Errors: 0, Skipped: 0, Time elapsed: 24.714 sec
Running org.apache.hadoop.hbase.rest.TestSchemaResource
Tests run: 2, Failures: 0, Errors: 0, Skipped: 0, Time elapsed: 12.949 sec
Running org.apache.hadoop.hbase.rest.TestTableScan
Tests run: 10, Failures: 0, Errors: 0, Skipped: 0, Time elapsed: 34.524 sec
Running org.apache.hadoop.hbase.rest.TestStatusResource
Tests run: 2, Failures: 0, Errors: 0, Skipped: 0, Time elapsed: 10.777 sec
Running org.apache.hadoop.hbase.rest.TestGetAndPutResource
Tests run: 18, Failures: 0, Errors: 0, Skipped: 0, Time elapsed: 25.518 sec
Running org.apache.hadoop.hbase.rest.TestResourceFilter
Tests run: 1, Failures: 0, Errors: 0, Skipped: 0, Time elapsed: 9.827 sec
Running org.apache.hadoop.hbase.rest.TestVersionResource
Tests run: 7, Failures: 0, Errors: 0, Skipped: 0, Time elapsed: 11.331 sec
Running org.apache.hadoop.hbase.rest.client.TestRemoteTable
Tests run: 9, Failures: 0, Errors: 0, Skipped: 0, Time elapsed: 21.534 sec
Running org.apache.hadoop.hbase.rest.TestMultiRowResource
Tests run: 3, Failures: 0, Errors: 0, Skipped: 0, Time elapsed: 11.835 sec
Running org.apache.hadoop.hbase.rest.TestScannersWithFilters
Tests run: 10, Failures: 0, Errors: 0, Skipped: 0, Time elapsed: 15.959 sec
Running org.apache.hadoop.hbase.rest.TestGzipFilter
Tests run: 2, Failures: 0, Errors: 0, Skipped: 0, Time elapsed: 12.961 sec
Running org.apache.hadoop.hbase.rest.TestScannerResource
Tests run: 5, Failures: 0, Errors: 0, Skipped: 0, Time elapsed: 28.436 sec
Running org.apache.hadoop.hbase.TestZooKeeper
Tests run: 11, Failures: 0, Errors: 0, Skipped: 0, Time elapsed: 211.757 sec
Running org.apache.hadoop.hbase.snapshot.TestFlushSnapshotFromClient
Tests run: 9, Failures: 0, Errors: 0, Skipped: 0, Time elapsed: 42.354 sec
Running org.apache.hadoop.hbase.snapshot.TestExportSnapshot
Tests run: 9, Failures: 0, Errors: 0, Skipped: 0, Time elapsed: 296.208 sec
Running org.apache.hadoop.hbase.snapshot.TestRestoreFlushSnapshotFromClient
Tests run: 5, Failures: 0, Errors: 0, Skipped: 0, Time elapsed: 51.745 sec
Running org.apache.hadoop.hbase.snapshot.TestSnapshotDescriptionUtils
Tests run: 2, Failures: 0, Errors: 0, Skipped: 0, Time elapsed: 1.344 sec
Running org.apache.hadoop.hbase.snapshot.TestSecureExportSnapshot
Tests run: 9, Failures: 0, Errors: 0, Skipped: 0, Time elapsed: 300.443 sec
Running org.apache.hadoop.hbase.TestIOFencing
Tests run: 2, Failures: 0, Errors: 0, Skipped: 0, Time elapsed: 188.267 sec
Running org.apache.hadoop.hbase.coprocessor.TestRegionObserverScannerOpenHook
Tests run: 3, Failures: 0, Errors: 0, Skipped: 0, Time elapsed: 10.345 sec
Running org.apache.hadoop.hbase.coprocessor.TestOpenTableInCoprocessor
Tests run: 2, Failures: 0, Errors: 0, Skipped: 0, Time elapsed: 12.479 sec
Running org.apache.hadoop.hbase.coprocessor.TestMasterCoprocessorExceptionWithAbort
Tests run: 1, Failures: 0, Errors: 0, Skipped: 0, Time elapsed: 25.67 sec
Running org.apache.hadoop.hbase.coprocessor.TestMasterCoprocessorExceptionWithRemove
Tests run: 1, Failures: 0, Errors: 0, Skipped: 0, Time elapsed: 12.687 sec
Running org.apache.hadoop.hbase.coprocessor.TestRegionObserverInterface
Tests run: 12, Failures: 0, Errors: 0, Skipped: 0, Time elapsed: 40.987 sec
Running org.apache.hadoop.hbase.coprocessor.TestAggregateProtocol
Tests run: 44, Failures: 0, Errors: 0, Skipped: 0, Time elapsed: 12.931 sec
Running org.apache.hadoop.hbase.coprocessor.TestBatchCoprocessorEndpoint
Tests run: 4, Failures: 0, Errors: 0, Skipped: 0, Time elapsed: 10.446 sec
Running org.apache.hadoop.hbase.coprocessor.TestHTableWrapper
Tests run: 1, Failures: 0, Errors: 0, Skipped: 0, Time elapsed: 10.243 sec
Running org.apache.hadoop.hbase.coprocessor.TestRegionServerObserver
Tests run: 1, Failures: 0, Errors: 0, Skipped: 0, Time elapsed: 13.443 sec
Running org.apache.hadoop.hbase.coprocessor.TestClassLoading
Tests run: 8, Failures: 0, Errors: 0, Skipped: 0, Time elapsed: 22.522 sec
Running org.apache.hadoop.hbase.coprocessor.TestRegionServerCoprocessorExceptionWithAbort
Tests run: 2, Failures: 0, Errors: 0, Skipped: 0, Time elapsed: 15.455 sec
Running org.apache.hadoop.hbase.coprocessor.TestDoubleColumnInterpreter
Tests run: 38, Failures: 0, Errors: 0, Skipped: 0, Time elapsed: 12.106 sec
Running org.apache.hadoop.hbase.coprocessor.TestRegionObserverBypass
Tests run: 2, Failures: 0, Errors: 0, Skipped: 0, Time elapsed: 10.404 sec
Running org.apache.hadoop.hbase.coprocessor.TestRowProcessorEndpoint
Tests run: 4, Failures: 0, Errors: 0, Skipped: 0, Time elapsed: 15.002 sec
Running org.apache.hadoop.hbase.coprocessor.TestCoprocessorStop
Tests run: 1, Failures: 0, Errors: 0, Skipped: 0, Time elapsed: 25.425 sec
Running org.apache.hadoop.hbase.coprocessor.TestRegionServerCoprocessorExceptionWithRemove
Tests run: 1, Failures: 0, Errors: 0, Skipped: 0, Time elapsed: 20.928 sec
Running org.apache.hadoop.hbase.coprocessor.TestBigDecimalColumnInterpreter
Tests run: 38, Failures: 0, Errors: 0, Skipped: 0, Time elapsed: 12.129 sec
Running org.apache.hadoop.hbase.coprocessor.TestCoprocessorEndpoint
Tests run: 6, Failures: 0, Errors: 0, Skipped: 0, Time elapsed: 11.42 sec
Running org.apache.hadoop.hbase.coprocessor.TestMasterObserver
Tests run: 6, Failures: 0, Errors: 0, Skipped: 0, Time elapsed: 16.242 sec
Running org.apache.hadoop.hbase.TestGlobalMemStoreSize
Tests run: 1, Failures: 0, Errors: 0, Skipped: 0, Time elapsed: 10.98 sec
Running org.apache.hadoop.hbase.coprocessor.TestWALObserver
Tests run: 3, Failures: 0, Errors: 0, Skipped: 0, Time elapsed: 17.318 sec
Running org.apache.hadoop.hbase.TestMetaTableLocator
Tests run: 6, Failures: 0, Errors: 0, Skipped: 0, Time elapsed: 2.595 sec
Running org.apache.hadoop.hbase.zookeeper.TestZooKeeperACL
Tests run: 6, Failures: 0, Errors: 0, Skipped: 0, Time elapsed: 8.686 sec
Running org.apache.hadoop.hbase.zookeeper.TestZKTableStateManager
Tests run: 1, Failures: 0, Errors: 0, Skipped: 0, Time elapsed: 1.581 sec
Running org.apache.hadoop.hbase.zookeeper.TestZKMulti
Tests run: 6, Failures: 0, Errors: 0, Skipped: 0, Time elapsed: 1.219 sec
Running org.apache.hadoop.hbase.TestJMXListener
Tests run: 2, Failures: 0, Errors: 0, Skipped: 0, Time elapsed: 24.373 sec
Running org.apache.hadoop.hbase.zookeeper.TestZKLeaderManager
Tests run: 1, Failures: 0, Errors: 0, Skipped: 0, Time elapsed: 1.136 sec
Running org.apache.hadoop.hbase.zookeeper.TestRecoverableZooKeeper
Tests run: 1, Failures: 0, Errors: 0, Skipped: 0, Time elapsed: 2.007 sec
Running org.apache.hadoop.hbase.zookeeper.TestZooKeeperNodeTracker
Tests run: 3, Failures: 0, Errors: 0, Skipped: 0, Time elapsed: 1.797 sec
Running org.apache.hadoop.hbase.zookeeper.TestHQuorumPeer
Tests run: 3, Failures: 0, Errors: 0, Skipped: 0, Time elapsed: 2.197 sec
Running org.apache.hadoop.hbase.zookeeper.lock.TestZKInterProcessReadWriteLock
Tests run: 6, Failures: 0, Errors: 0, Skipped: 0, Time elapsed: 25.42 sec
Running org.apache.hadoop.hbase.TestClusterBootOrder
Tests run: 2, Failures: 0, Errors: 0, Skipped: 0, Time elapsed: 25.914 sec

Results :

Failed tests:   testCreateTableWithMultipleReplicas(org.apache.hadoop.hbase.master.TestMasterOperationsForRegionReplicas): expected:<3> but was:<2>
  testRetainAssignmentOnRestart(org.apache.hadoop.hbase.master.TestRestartCluster): expected:<...0.gq1.ygridcore.net:[50042]> but was:<...0.gq1.ygridcore.net:[45126]>

Tests in error: 
  org.apache.hadoop.hbase.regionserver.TestRegionReplicas: KeeperErrorCode = NoNode for /hbase/region-in-transition/1588230740
  org.apache.hadoop.hbase.client.TestReplicasClient: KeeperErrorCode = NoNode for /hbase/region-in-transition/1588230740

Tests run: 2068, Failures: 2, Errors: 2, Skipped: 19

[INFO] ------------------------------------------------------------------------
[INFO] Reactor Summary:
[INFO] 
[INFO] HBase ............................................. SUCCESS [3.552s]
[INFO] HBase - Common .................................... SUCCESS [38.127s]
[INFO] HBase - Protocol .................................. SUCCESS [10.157s]
[INFO] HBase - Client .................................... SUCCESS [55.195s]
[INFO] HBase - Hadoop Compatibility ...................... SUCCESS [5.458s]
[INFO] HBase - Hadoop Two Compatibility .................. SUCCESS [1.920s]
[INFO] HBase - Prefix Tree ............................... SUCCESS [4.037s]
[INFO] HBase - Server .................................... FAILURE [2:06:49.225s]
[INFO] HBase - Testing Util .............................. SKIPPED
[INFO] HBase - Thrift .................................... SKIPPED
[INFO] HBase - Shell ..................................... SKIPPED
[INFO] HBase - Integration Tests ......................... SKIPPED
[INFO] HBase - Examples .................................. SKIPPED
[INFO] HBase - Assembly .................................. SKIPPED
[INFO] ------------------------------------------------------------------------
[INFO] BUILD FAILURE
[INFO] ------------------------------------------------------------------------
[INFO] Total time: 2:08:48.510s
[INFO] Finished at: Tue Aug 05 19:13:24 UTC 2014
[INFO] Final Memory: 120M/1040M
[INFO] ------------------------------------------------------------------------
[ERROR] Failed to execute goal org.apache.maven.plugins:maven-surefire-plugin:2.12-TRUNK-HBASE-2:test (secondPartTestsExecution) on project hbase-server: Failure or timeout -> [Help 1]
[ERROR] 
[ERROR] To see the full stack trace of the errors, re-run Maven with the -e switch.
[ERROR] Re-run Maven using the -X switch to enable full debug logging.
[ERROR] 
[ERROR] For more information about the errors and possible solutions, please read the following articles:
[ERROR] [Help 1] http://cwiki.apache.org/confluence/display/MAVEN/MojoExecutionException
[ERROR] 
[ERROR] After correcting the problems, you can resume the build with the command
[ERROR]   mvn <goals> -rf :hbase-server
Build step 'Invoke top-level Maven targets' marked build as failure
Performing Post build task...
Match found for :.* : True
Logical operation result is TRUE
Running script  :   ZOMBIE_TESTS_COUNT=`jps | grep surefirebooter | wc -l`
  if [[ $ZOMBIE_TESTS_COUNT != 0 ]] ; then
    #It seems sometimes the tests are not dying immediately. Let's give them 10s
    echo "Suspicious java process found - waiting 10s to see if there are just slow to stop"
    sleep 10   
    ZOMBIE_TESTS_COUNT=`jps | grep surefirebooter | wc -l`
    if [[ $ZOMBIE_TESTS_COUNT != 0 ]] ; then
      echo "There are $ZOMBIE_TESTS_COUNT zombie tests, they should have been killed by surefire but survived"
      echo "************ BEGIN zombies jstack extract"
      ZB_STACK=`jps | grep surefirebooter | cut -d ' ' -f 1 | xargs -n 1 jstack | grep ".test" | grep "\.java"`
      jps | grep surefirebooter | cut -d ' ' -f 1 | xargs -n 1 jstack
      echo "************ END  zombies jstack extract"
      JIRA_COMMENT="$JIRA_COMMENT

     {color:red}-1 core zombie tests{color}.  There are ${ZOMBIE_TESTS_COUNT} zombie test(s): ${ZB_STACK}"
      BAD=1
      jps | grep surefirebooter | cut -d ' ' -f 1 | xargs kill -9
    else
      echo "We're ok: there is no zombie test, but some tests took some time to stop"
    fi
  else
    echo "We're ok: there is no zombie test"
  fi
[HBase-TRUNK] $ /bin/bash -xe /tmp/hudson5226918445254820707.sh
++ jps
++ grep surefirebooter
++ wc -l
+ ZOMBIE_TESTS_COUNT=1
+ [[ 1 != 0 ]]
+ echo 'Suspicious java process found - waiting 10s to see if there are just slow to stop'
Suspicious java process found - waiting 10s to see if there are just slow to stop
+ sleep 10
++ jps
++ grep surefirebooter
++ wc -l
+ ZOMBIE_TESTS_COUNT=1
+ [[ 1 != 0 ]]
+ echo 'There are 1 zombie tests, they should have been killed by surefire but survived'
There are 1 zombie tests, they should have been killed by surefire but survived
+ echo '************ BEGIN zombies jstack extract'
************ BEGIN zombies jstack extract
++ jps
++ cut -d ' ' -f 1
++ xargs -n 1 jstack
++ grep surefirebooter
++ grep .test
++ grep '\.java'
+ ZB_STACK=
POST BUILD TASK : FAILURE
END OF POST BUILD TASK : 0
Archiving artifacts
Sending artifact delta relative to HBase-TRUNK #5346
Archived 1741 artifacts
Archive block size is 32768
Received 74 blocks and 948192570 bytes
Compression is 0.3%
Took 7 min 20 sec
Recording test results
Updating HBASE-11671

Build failed in Jenkins: HBase-TRUNK #5370

Posted by Apache Jenkins Server <je...@builds.apache.org>.
See <https://builds.apache.org/job/HBase-TRUNK/5370/changes>

Changes:

[tedyu] HBASE-11666 Enforce JDK7 javac for builds on branch-1 and master (Sean Busbey)

------------------------------------------
[...truncated 966 lines...]
Running org.apache.hadoop.hbase.errorhandling.TestTimeoutExceptionInjector
Tests run: 4, Failures: 0, Errors: 0, Skipped: 0, Time elapsed: 0.121 sec
Running org.apache.hadoop.hbase.errorhandling.TestForeignExceptionSerialization
Tests run: 2, Failures: 0, Errors: 0, Skipped: 0, Time elapsed: 0.058 sec
Running org.apache.hadoop.hbase.TestHRegionLocation
Tests run: 3, Failures: 0, Errors: 0, Skipped: 0, Time elapsed: 0.059 sec
Running org.apache.hadoop.hbase.rest.client.TestRemoteHTableRetries
Tests run: 7, Failures: 0, Errors: 0, Skipped: 0, Time elapsed: 1.239 sec
Running org.apache.hadoop.hbase.rest.client.TestRemoteAdminRetries
Tests run: 7, Failures: 0, Errors: 0, Skipped: 0, Time elapsed: 1.218 sec
Running org.apache.hadoop.hbase.rest.model.TestTableRegionModel
Tests run: 8, Failures: 0, Errors: 0, Skipped: 0, Time elapsed: 0.232 sec
Running org.apache.hadoop.hbase.rest.model.TestTableSchemaModel
Tests run: 6, Failures: 0, Errors: 0, Skipped: 0, Time elapsed: 0.152 sec
Running org.apache.hadoop.hbase.rest.model.TestTableInfoModel
Tests run: 6, Failures: 0, Errors: 0, Skipped: 0, Time elapsed: 0.14 sec
Running org.apache.hadoop.hbase.rest.model.TestTableListModel
Tests run: 6, Failures: 0, Errors: 0, Skipped: 0, Time elapsed: 0.14 sec
Running org.apache.hadoop.hbase.rest.model.TestVersionModel
Tests run: 6, Failures: 0, Errors: 0, Skipped: 0, Time elapsed: 0.133 sec
Running org.apache.hadoop.hbase.rest.model.TestRowModel
Tests run: 6, Failures: 0, Errors: 0, Skipped: 0, Time elapsed: 0.133 sec
Running org.apache.hadoop.hbase.rest.model.TestStorageClusterVersionModel
Tests run: 6, Failures: 0, Errors: 0, Skipped: 0, Time elapsed: 0.128 sec
Running org.apache.hadoop.hbase.rest.model.TestScannerModel
Tests run: 6, Failures: 0, Errors: 0, Skipped: 0, Time elapsed: 0.145 sec
Running org.apache.hadoop.hbase.rest.model.TestColumnSchemaModel
Tests run: 6, Failures: 0, Errors: 0, Skipped: 0, Time elapsed: 0.133 sec
Running org.apache.hadoop.hbase.rest.model.TestCellModel
Tests run: 6, Failures: 0, Errors: 0, Skipped: 0, Time elapsed: 0.133 sec
Running org.apache.hadoop.hbase.rest.model.TestCellSetModel
Tests run: 6, Failures: 0, Errors: 0, Skipped: 0, Time elapsed: 0.14 sec
Running org.apache.hadoop.hbase.rest.model.TestStorageClusterStatusModel
Tests run: 6, Failures: 0, Errors: 0, Skipped: 0, Time elapsed: 0.162 sec
Running org.apache.hadoop.hbase.rest.TestGZIPResponseWrapper
Tests run: 4, Failures: 0, Errors: 0, Skipped: 0, Time elapsed: 0.09 sec
Running org.apache.hadoop.hbase.snapshot.TestRestoreSnapshotHelper
Tests run: 1, Failures: 0, Errors: 0, Skipped: 0, Time elapsed: 0.541 sec
Running org.apache.hadoop.hbase.TestIPv6NIOServerSocketChannel
Tests run: 2, Failures: 0, Errors: 0, Skipped: 0, Time elapsed: 0.048 sec
Running org.apache.hadoop.hbase.TestSerialization
Tests run: 9, Failures: 0, Errors: 0, Skipped: 0, Time elapsed: 0.223 sec
Running org.apache.hadoop.hbase.util.TestBoundedPriorityBlockingQueue
Tests run: 7, Failures: 0, Errors: 0, Skipped: 0, Time elapsed: 1.16 sec
Running org.apache.hadoop.hbase.util.TestIncrementingEnvironmentEdge
Tests run: 1, Failures: 0, Errors: 0, Skipped: 0, Time elapsed: 0.02 sec
Running org.apache.hadoop.hbase.util.TestByteBloomFilter
Tests run: 5, Failures: 0, Errors: 0, Skipped: 0, Time elapsed: 1.33 sec
Running org.apache.hadoop.hbase.util.TestHFileArchiveUtil
Tests run: 4, Failures: 0, Errors: 0, Skipped: 0, Time elapsed: 0.112 sec
Running org.apache.hadoop.hbase.util.TestPoolMap$TestRoundRobinPoolType
Tests run: 3, Failures: 0, Errors: 0, Skipped: 0, Time elapsed: 0.066 sec
Running org.apache.hadoop.hbase.util.TestPoolMap$TestThreadLocalPoolType
Tests run: 3, Failures: 0, Errors: 0, Skipped: 0, Time elapsed: 0.066 sec
Running org.apache.hadoop.hbase.util.TestPoolMap$TestReusablePoolType
Tests run: 3, Failures: 0, Errors: 0, Skipped: 0, Time elapsed: 0.07 sec
Running org.apache.hadoop.hbase.util.TestHBaseFsckComparator
Tests run: 6, Failures: 0, Errors: 0, Skipped: 0, Time elapsed: 0.129 sec
Running org.apache.hadoop.hbase.util.TestRegionSplitCalculator
Tests run: 15, Failures: 0, Errors: 0, Skipped: 0, Time elapsed: 0.336 sec
Running org.apache.hadoop.hbase.util.TestTableName
Tests run: 4, Failures: 0, Errors: 0, Skipped: 0, Time elapsed: 0.085 sec
Running org.apache.hadoop.hbase.util.TestRootPath
Tests run: 1, Failures: 0, Errors: 0, Skipped: 0, Time elapsed: 0.022 sec
Running org.apache.hadoop.hbase.util.TestSortedCopyOnWriteSet
Tests run: 2, Failures: 0, Errors: 0, Skipped: 0, Time elapsed: 0.042 sec
Running org.apache.hadoop.hbase.util.TestByteBufferUtils
Tests run: 12, Failures: 0, Errors: 0, Skipped: 0, Time elapsed: 0.397 sec
Running org.apache.hadoop.hbase.util.TestCompressionTest
Tests run: 2, Failures: 0, Errors: 0, Skipped: 0, Time elapsed: 0.048 sec
Running org.apache.hadoop.hbase.util.TestRegionSizeCalculator
Tests run: 3, Failures: 0, Errors: 0, Skipped: 0, Time elapsed: 0.178 sec
Running org.apache.hadoop.hbase.TestServerName
Tests run: 6, Failures: 0, Errors: 0, Skipped: 0, Time elapsed: 0.121 sec
Running org.apache.hadoop.hbase.http.TestGlobalFilter
Tests run: 1, Failures: 0, Errors: 0, Skipped: 0, Time elapsed: 0.627 sec
Running org.apache.hadoop.hbase.http.TestPathFilter
Tests run: 1, Failures: 0, Errors: 0, Skipped: 0, Time elapsed: 0.247 sec
Running org.apache.hadoop.hbase.http.TestServletFilter
Tests run: 3, Failures: 0, Errors: 0, Skipped: 0, Time elapsed: 2.035 sec
Running org.apache.hadoop.hbase.http.TestHttpRequestLogAppender
Tests run: 1, Failures: 0, Errors: 0, Skipped: 0, Time elapsed: 0.037 sec
Running org.apache.hadoop.hbase.http.TestHttpServerLifecycle
Tests run: 7, Failures: 0, Errors: 0, Skipped: 0, Time elapsed: 1.106 sec
Running org.apache.hadoop.hbase.http.TestSSLHttpServer
Tests run: 1, Failures: 0, Errors: 0, Skipped: 0, Time elapsed: 0.155 sec
Running org.apache.hadoop.hbase.http.lib.TestStaticUserWebFilter
Tests run: 3, Failures: 0, Errors: 0, Skipped: 0, Time elapsed: 0.119 sec
Running org.apache.hadoop.hbase.http.jmx.TestJMXJsonServlet
Tests run: 1, Failures: 0, Errors: 0, Skipped: 0, Time elapsed: 0.571 sec
Running org.apache.hadoop.hbase.http.conf.TestConfServlet
Tests run: 3, Failures: 0, Errors: 0, Skipped: 0, Time elapsed: 0.23 sec
Running org.apache.hadoop.hbase.http.log.TestLogLevel
Tests run: 1, Failures: 0, Errors: 0, Skipped: 0, Time elapsed: 0.206 sec
Running org.apache.hadoop.hbase.http.TestHttpRequestLog
Tests run: 2, Failures: 0, Errors: 0, Skipped: 0, Time elapsed: 0.037 sec
Running org.apache.hadoop.hbase.http.TestHtmlQuoting
Tests run: 4, Failures: 0, Errors: 0, Skipped: 0, Time elapsed: 0.078 sec
Running org.apache.hadoop.hbase.http.TestHttpServerWebapps
Tests run: 2, Failures: 0, Errors: 0, Skipped: 0, Time elapsed: 0.074 sec
Running org.apache.hadoop.hbase.http.TestHttpServer
Tests run: 15, Failures: 0, Errors: 0, Skipped: 3, Time elapsed: 1.292 sec
Running org.apache.hadoop.hbase.filter.TestColumnPrefixFilter
Tests run: 2, Failures: 0, Errors: 0, Skipped: 0, Time elapsed: 1.909 sec
Running org.apache.hadoop.hbase.filter.TestPageFilter
Tests run: 2, Failures: 0, Errors: 0, Skipped: 0, Time elapsed: 0.053 sec
Running org.apache.hadoop.hbase.filter.TestFilter
Tests run: 21, Failures: 0, Errors: 0, Skipped: 0, Time elapsed: 2.32 sec
Running org.apache.hadoop.hbase.filter.TestComparatorSerialization
Tests run: 6, Failures: 0, Errors: 0, Skipped: 0, Time elapsed: 0.223 sec
Running org.apache.hadoop.hbase.filter.TestDependentColumnFilter
Tests run: 4, Failures: 0, Errors: 0, Skipped: 0, Time elapsed: 0.284 sec
Running org.apache.hadoop.hbase.filter.TestParseFilter
Tests run: 34, Failures: 0, Errors: 0, Skipped: 0, Time elapsed: 0.846 sec
Running org.apache.hadoop.hbase.filter.TestNullComparator
Tests run: 3, Failures: 0, Errors: 0, Skipped: 0, Time elapsed: 0.071 sec
Running org.apache.hadoop.hbase.filter.TestFirstKeyValueMatchingQualifiersFilter
Tests run: 1, Failures: 0, Errors: 0, Skipped: 0, Time elapsed: 0.025 sec
Running org.apache.hadoop.hbase.filter.TestSingleColumnValueExcludeFilter
Tests run: 1, Failures: 0, Errors: 0, Skipped: 0, Time elapsed: 0.024 sec
Running org.apache.hadoop.hbase.filter.TestMultipleColumnPrefixFilter
Tests run: 3, Failures: 0, Errors: 0, Skipped: 0, Time elapsed: 3.166 sec
Running org.apache.hadoop.hbase.filter.TestSingleColumnValueFilter
Tests run: 2, Failures: 0, Errors: 0, Skipped: 0, Time elapsed: 0.057 sec
Running org.apache.hadoop.hbase.filter.TestFilterSerialization
Tests run: 25, Failures: 0, Errors: 0, Skipped: 0, Time elapsed: 0.676 sec
Running org.apache.hadoop.hbase.filter.TestPrefixFilter
Tests run: 3, Failures: 0, Errors: 0, Skipped: 0, Time elapsed: 0.071 sec
Running org.apache.hadoop.hbase.filter.TestBitComparator
Tests run: 6, Failures: 0, Errors: 0, Skipped: 0, Time elapsed: 0.144 sec
Running org.apache.hadoop.hbase.filter.TestRandomRowFilter
Tests run: 2, Failures: 0, Errors: 0, Skipped: 0, Time elapsed: 0.252 sec
Running org.apache.hadoop.hbase.filter.TestFuzzyRowFilter
Tests run: 2, Failures: 0, Errors: 0, Skipped: 0, Time elapsed: 0.047 sec
Running org.apache.hadoop.hbase.filter.TestColumnPaginationFilter
Tests run: 1, Failures: 0, Errors: 0, Skipped: 0, Time elapsed: 0.024 sec
Running org.apache.hadoop.hbase.filter.TestInclusiveStopFilter
Tests run: 2, Failures: 0, Errors: 0, Skipped: 0, Time elapsed: 0.049 sec
Running org.apache.hadoop.hbase.filter.TestFilterList
Tests run: 7, Failures: 0, Errors: 0, Skipped: 0, Time elapsed: 0.17 sec
Running org.apache.hadoop.hbase.filter.TestInvocationRecordFilter
Tests run: 1, Failures: 0, Errors: 0, Skipped: 0, Time elapsed: 248.284 sec
Running org.apache.hadoop.hbase.master.TestClockSkewDetection
Tests run: 1, Failures: 0, Errors: 1, Skipped: 0, Time elapsed: 248.284 sec <<< FAILURE!
Running org.apache.hadoop.hbase.procedure.TestProcedureManager
Tests run: 1, Failures: 0, Errors: 1, Skipped: 0, Time elapsed: 248.284 sec <<< FAILURE!
Running org.apache.hadoop.hbase.security.TestSecureRPC
Tests run: 1, Failures: 0, Errors: 0, Skipped: 1, Time elapsed: 248.284 sec
Running org.apache.hadoop.hbase.security.TestUsersOperationsWithSecureHadoop
Tests run: 1, Failures: 0, Errors: 0, Skipped: 1, Time elapsed: 248.284 sec
Running org.apache.hadoop.hbase.ipc.TestIPC
Tests run: 4, Failures: 1, Errors: 3, Skipped: 0, Time elapsed: 248.284 sec <<< FAILURE!

Results :

Failed tests:   testRTEDuringConnectionSetup(org.apache.hadoop.hbase.ipc.TestIPC)

Tests in error: 
  testClockSkewDetection(org.apache.hadoop.hbase.master.TestClockSkewDetection): asf905.ygridcore.net: asf905.ygridcore.net
  org.apache.hadoop.hbase.procedure.TestProcedureManager: asf905.ygridcore.net: asf905.ygridcore.net
  testRpcScheduler(org.apache.hadoop.hbase.ipc.TestIPC): asf905.ygridcore.net: asf905.ygridcore.net
  testCompressCellBlock(org.apache.hadoop.hbase.ipc.TestIPC): asf905.ygridcore.net: asf905.ygridcore.net
  testNoCodec(org.apache.hadoop.hbase.ipc.TestIPC): asf905.ygridcore.net: asf905.ygridcore.net

Tests run: 907, Failures: 1, Errors: 5, Skipped: 6

[INFO] ------------------------------------------------------------------------
[INFO] Reactor Summary:
[INFO] 
[INFO] HBase ............................................. SUCCESS [2.496s]
[INFO] HBase - Common .................................... SUCCESS [33.760s]
[INFO] HBase - Protocol .................................. SUCCESS [9.444s]
[INFO] HBase - Client .................................... SUCCESS [55.287s]
[INFO] HBase - Hadoop Compatibility ...................... SUCCESS [5.572s]
[INFO] HBase - Hadoop Two Compatibility .................. SUCCESS [1.961s]
[INFO] HBase - Prefix Tree ............................... SUCCESS [3.682s]
[INFO] HBase - Server .................................... FAILURE [4:28.846s]
[INFO] HBase - Testing Util .............................. SKIPPED
[INFO] HBase - Thrift .................................... SKIPPED
[INFO] HBase - Shell ..................................... SKIPPED
[INFO] HBase - Integration Tests ......................... SKIPPED
[INFO] HBase - Examples .................................. SKIPPED
[INFO] HBase - Assembly .................................. SKIPPED
[INFO] ------------------------------------------------------------------------
[INFO] BUILD FAILURE
[INFO] ------------------------------------------------------------------------
[INFO] Total time: 6:21.889s
[INFO] Finished at: Tue Aug 05 15:12:52 UTC 2014
[INFO] Final Memory: 74M/1001M
[INFO] ------------------------------------------------------------------------
[ERROR] Failed to execute goal org.apache.maven.plugins:maven-surefire-plugin:2.12-TRUNK-HBASE-2:test (default-test) on project hbase-server: There are test failures.
[ERROR] 
[ERROR] Please refer to <https://builds.apache.org/job/HBase-TRUNK/ws/hbase-server/target/surefire-reports> for the individual test results.
[ERROR] -> [Help 1]
[ERROR] 
[ERROR] To see the full stack trace of the errors, re-run Maven with the -e switch.
[ERROR] Re-run Maven using the -X switch to enable full debug logging.
[ERROR] 
[ERROR] For more information about the errors and possible solutions, please read the following articles:
[ERROR] [Help 1] http://cwiki.apache.org/confluence/display/MAVEN/MojoFailureException
[ERROR] 
[ERROR] After correcting the problems, you can resume the build with the command
[ERROR]   mvn <goals> -rf :hbase-server
Build step 'Invoke top-level Maven targets' marked build as failure
Performing Post build task...
Match found for :.* : True
Logical operation result is TRUE
Running script  :   ZOMBIE_TESTS_COUNT=`jps | grep surefirebooter | wc -l`
  if [[ $ZOMBIE_TESTS_COUNT != 0 ]] ; then
    #It seems sometimes the tests are not dying immediately. Let's give them 10s
    echo "Suspicious java process found - waiting 10s to see if there are just slow to stop"
    sleep 10   
    ZOMBIE_TESTS_COUNT=`jps | grep surefirebooter | wc -l`
    if [[ $ZOMBIE_TESTS_COUNT != 0 ]] ; then
      echo "There are $ZOMBIE_TESTS_COUNT zombie tests, they should have been killed by surefire but survived"
      echo "************ BEGIN zombies jstack extract"
      ZB_STACK=`jps | grep surefirebooter | cut -d ' ' -f 1 | xargs -n 1 jstack | grep ".test" | grep "\.java"`
      jps | grep surefirebooter | cut -d ' ' -f 1 | xargs -n 1 jstack
      echo "************ END  zombies jstack extract"
      JIRA_COMMENT="$JIRA_COMMENT

     {color:red}-1 core zombie tests{color}.  There are ${ZOMBIE_TESTS_COUNT} zombie test(s): ${ZB_STACK}"
      BAD=1
      jps | grep surefirebooter | cut -d ' ' -f 1 | xargs kill -9
    else
      echo "We're ok: there is no zombie test, but some tests took some time to stop"
    fi
  else
    echo "We're ok: there is no zombie test"
  fi
[HBase-TRUNK] $ /bin/bash -xe /tmp/hudson7749990401169468161.sh
++ jps
++ grep surefirebooter
++ wc -l
+ ZOMBIE_TESTS_COUNT=0
+ [[ 0 != 0 ]]
+ echo 'We'\''re ok: there is no zombie test'
We're ok: there is no zombie test
POST BUILD TASK : SUCCESS
END OF POST BUILD TASK : 0
Archiving artifacts
Sending artifact delta relative to HBase-TRUNK #5346
Archived 833 artifacts
Archive block size is 32768
Received 7 blocks and 36434214 bytes
Compression is 0.6%
Took 1 min 51 sec
Recording test results
Updating HBASE-11666

Build failed in Jenkins: HBase-TRUNK #5369

Posted by Apache Jenkins Server <je...@builds.apache.org>.
See <https://builds.apache.org/job/HBase-TRUNK/5369/changes>

Changes:

[tedyu] HBASE-10674 HBCK should be updated to do replica related checks Addendum

[apurtell] HBASE-11668 Re-add HBASE_LIBRARY_PATH to bin/hbase (Esteban Gutierrez)

[apurtell] HBASE-11662 shell should properly handle long form --debug.

------------------------------------------
[...truncated 968 lines...]
Running org.apache.hadoop.hbase.io.hfile.TestLruCachedBlock
Tests run: 1, Failures: 0, Errors: 0, Skipped: 0, Time elapsed: 0.028 sec
Running org.apache.hadoop.hbase.io.hfile.TestHFileInlineToRootChunkConversion
Tests run: 1, Failures: 0, Errors: 0, Skipped: 0, Time elapsed: 0.028 sec
Running org.apache.hadoop.hbase.io.hfile.TestHFile
Tests run: 7, Failures: 0, Errors: 0, Skipped: 0, Time elapsed: 0.473 sec
Running org.apache.hadoop.hbase.io.hfile.TestPrefetch
Tests run: 1, Failures: 0, Errors: 0, Skipped: 0, Time elapsed: 1.079 sec
Running org.apache.hadoop.hbase.io.hfile.TestCachedBlockQueue
Tests run: 2, Failures: 0, Errors: 0, Skipped: 0, Time elapsed: 0.043 sec
Running org.apache.hadoop.hbase.io.hfile.TestBlockCacheReporting
Tests run: 2, Failures: 0, Errors: 0, Skipped: 0, Time elapsed: 0.2 sec
Running org.apache.hadoop.hbase.io.hfile.TestSeekTo
Tests run: 4, Failures: 0, Errors: 0, Skipped: 0, Time elapsed: 0.875 sec
Running org.apache.hadoop.hbase.io.hfile.TestHFileWriterV3
Tests run: 4, Failures: 0, Errors: 0, Skipped: 0, Time elapsed: 1.568 sec
Running org.apache.hadoop.hbase.io.hfile.TestReseekTo
Tests run: 1, Failures: 0, Errors: 0, Skipped: 0, Time elapsed: 0.079 sec
Running org.apache.hadoop.hbase.io.hfile.TestHFileWriterV2
Tests run: 2, Failures: 0, Errors: 0, Skipped: 0, Time elapsed: 0.625 sec
Running org.apache.hadoop.hbase.io.hfile.TestHFileEncryption
Tests run: 3, Failures: 0, Errors: 0, Skipped: 0, Time elapsed: 1.981 sec
Running org.apache.hadoop.hbase.io.hfile.TestHFileDataBlockEncoder
Tests run: 30, Failures: 0, Errors: 0, Skipped: 0, Time elapsed: 0.744 sec
Running org.apache.hadoop.hbase.io.hfile.bucket.TestByteBufferIOEngine
Tests run: 1, Failures: 0, Errors: 0, Skipped: 0, Time elapsed: 0.072 sec
Running org.apache.hadoop.hbase.io.hfile.bucket.TestBucketCache
Tests run: 8, Failures: 0, Errors: 0, Skipped: 0, Time elapsed: 39.122 sec
Running org.apache.hadoop.hbase.io.hfile.bucket.TestFileIOEngine
Tests run: 1, Failures: 0, Errors: 0, Skipped: 0, Time elapsed: 0.033 sec
Running org.apache.hadoop.hbase.io.hfile.TestScannerSelectionUsingKeyRange
Tests run: 3, Failures: 0, Errors: 0, Skipped: 0, Time elapsed: 0.227 sec
Running org.apache.hadoop.hbase.io.hfile.TestChecksum
Tests run: 3, Failures: 0, Errors: 0, Skipped: 0, Time elapsed: 0.363 sec
Running org.apache.hadoop.hbase.io.TestImmutableBytesWritable
Tests run: 3, Failures: 0, Errors: 0, Skipped: 0, Time elapsed: 0.071 sec
Running org.apache.hadoop.hbase.io.TestHFileLink
Tests run: 2, Failures: 0, Errors: 0, Skipped: 0, Time elapsed: 0.05 sec
Running org.apache.hadoop.hbase.io.TestHeapSize
Tests run: 3, Failures: 0, Errors: 0, Skipped: 0, Time elapsed: 0.074 sec
Running org.apache.hadoop.hbase.io.TestReference
Tests run: 1, Failures: 0, Errors: 0, Skipped: 0, Time elapsed: 0.03 sec
Running org.apache.hadoop.hbase.constraint.TestConstraints
Tests run: 6, Failures: 0, Errors: 0, Skipped: 0, Time elapsed: 0.465 sec
Running org.apache.hadoop.hbase.TestServerLoad
Tests run: 2, Failures: 0, Errors: 0, Skipped: 0, Time elapsed: 0.045 sec
Running org.apache.hadoop.hbase.filter.TestInclusiveStopFilter
Tests run: 2, Failures: 0, Errors: 0, Skipped: 0, Time elapsed: 0.052 sec
Running org.apache.hadoop.hbase.filter.TestInvocationRecordFilter
Tests run: 1, Failures: 0, Errors: 0, Skipped: 0, Time elapsed: 0.059 sec
Running org.apache.hadoop.hbase.filter.TestFilterSerialization
Tests run: 25, Failures: 0, Errors: 0, Skipped: 0, Time elapsed: 0.713 sec
Running org.apache.hadoop.hbase.filter.TestFirstKeyValueMatchingQualifiersFilter
Tests run: 1, Failures: 0, Errors: 0, Skipped: 0, Time elapsed: 0.023 sec
Running org.apache.hadoop.hbase.filter.TestColumnPaginationFilter
Tests run: 1, Failures: 0, Errors: 0, Skipped: 0, Time elapsed: 0.024 sec
Running org.apache.hadoop.hbase.filter.TestRandomRowFilter
Tests run: 2, Failures: 0, Errors: 0, Skipped: 0, Time elapsed: 0.238 sec
Running org.apache.hadoop.hbase.filter.TestSingleColumnValueExcludeFilter
Tests run: 1, Failures: 0, Errors: 0, Skipped: 0, Time elapsed: 0.026 sec
Running org.apache.hadoop.hbase.filter.TestDependentColumnFilter
Tests run: 4, Failures: 0, Errors: 0, Skipped: 0, Time elapsed: 0.263 sec
Running org.apache.hadoop.hbase.filter.TestMultipleColumnPrefixFilter
Tests run: 3, Failures: 0, Errors: 0, Skipped: 0, Time elapsed: 3.154 sec
Running org.apache.hadoop.hbase.filter.TestSingleColumnValueFilter
Tests run: 2, Failures: 0, Errors: 0, Skipped: 0, Time elapsed: 0.056 sec
Running org.apache.hadoop.hbase.filter.TestNullComparator
Tests run: 3, Failures: 0, Errors: 0, Skipped: 0, Time elapsed: 0.071 sec
Running org.apache.hadoop.hbase.filter.TestColumnPrefixFilter
Tests run: 2, Failures: 0, Errors: 0, Skipped: 0, Time elapsed: 1.796 sec
Running org.apache.hadoop.hbase.filter.TestPrefixFilter
Tests run: 3, Failures: 0, Errors: 0, Skipped: 0, Time elapsed: 0.074 sec
Running org.apache.hadoop.hbase.filter.TestFilter
Tests run: 21, Failures: 0, Errors: 0, Skipped: 0, Time elapsed: 2.267 sec
Running org.apache.hadoop.hbase.filter.TestBitComparator
Tests run: 6, Failures: 0, Errors: 0, Skipped: 0, Time elapsed: 0.157 sec
Running org.apache.hadoop.hbase.filter.TestPageFilter
Tests run: 2, Failures: 0, Errors: 0, Skipped: 0, Time elapsed: 0.049 sec
Running org.apache.hadoop.hbase.filter.TestFuzzyRowFilter
Tests run: 2, Failures: 0, Errors: 0, Skipped: 0, Time elapsed: 0.049 sec
Running org.apache.hadoop.hbase.filter.TestFilterList
Tests run: 7, Failures: 0, Errors: 0, Skipped: 0, Time elapsed: 0.172 sec
Running org.apache.hadoop.hbase.filter.TestComparatorSerialization
Tests run: 6, Failures: 0, Errors: 0, Skipped: 0, Time elapsed: 0.144 sec
Running org.apache.hadoop.hbase.filter.TestParseFilter
Tests run: 34, Failures: 0, Errors: 0, Skipped: 0, Time elapsed: 0.821 sec
Running org.apache.hadoop.hbase.protobuf.TestProtobufUtil
Tests run: 7, Failures: 0, Errors: 0, Skipped: 0, Time elapsed: 0.183 sec
Running org.apache.hadoop.hbase.protobuf.TestReplicationProtobuf
Tests run: 1, Failures: 0, Errors: 0, Skipped: 0, Time elapsed: 0.027 sec
Running org.apache.hadoop.hbase.TestCompare
Tests run: 1, Failures: 0, Errors: 0, Skipped: 0, Time elapsed: 0.024 sec
Running org.apache.hadoop.hbase.codec.TestCellMessageCodec
Tests run: 3, Failures: 0, Errors: 0, Skipped: 0, Time elapsed: 0.089 sec
Running org.apache.hadoop.hbase.TestCheckTestClasses
Tests run: 1, Failures: 0, Errors: 0, Skipped: 0, Time elapsed: 0.843 sec
Running org.apache.hadoop.hbase.rest.TestGZIPResponseWrapper
Tests run: 4, Failures: 0, Errors: 0, Skipped: 0, Time elapsed: 0.105 sec
Running org.apache.hadoop.hbase.rest.client.TestRemoteHTableRetries
Tests run: 7, Failures: 0, Errors: 0, Skipped: 0, Time elapsed: 1.259 sec
Running org.apache.hadoop.hbase.rest.client.TestRemoteAdminRetries
Tests run: 7, Failures: 0, Errors: 0, Skipped: 0, Time elapsed: 1.236 sec
Running org.apache.hadoop.hbase.rest.model.TestTableRegionModel
Tests run: 8, Failures: 0, Errors: 0, Skipped: 0, Time elapsed: 0.258 sec
Running org.apache.hadoop.hbase.rest.model.TestScannerModel
Tests run: 6, Failures: 0, Errors: 0, Skipped: 0, Time elapsed: 0.172 sec
Running org.apache.hadoop.hbase.rest.model.TestCellSetModel
Tests run: 6, Failures: 0, Errors: 0, Skipped: 0, Time elapsed: 0.155 sec
Running org.apache.hadoop.hbase.rest.model.TestStorageClusterVersionModel
Tests run: 6, Failures: 0, Errors: 0, Skipped: 0, Time elapsed: 0.154 sec
Running org.apache.hadoop.hbase.rest.model.TestTableListModel
Tests run: 6, Failures: 0, Errors: 0, Skipped: 0, Time elapsed: 0.156 sec
Running org.apache.hadoop.hbase.rest.model.TestStorageClusterStatusModel
Tests run: 6, Failures: 0, Errors: 0, Skipped: 0, Time elapsed: 0.181 sec
Running org.apache.hadoop.hbase.rest.model.TestTableSchemaModel
Tests run: 6, Failures: 0, Errors: 0, Skipped: 0, Time elapsed: 0.166 sec
Running org.apache.hadoop.hbase.rest.model.TestTableInfoModel
Tests run: 6, Failures: 0, Errors: 0, Skipped: 0, Time elapsed: 0.12 sec
Running org.apache.hadoop.hbase.rest.model.TestRowModel
Tests run: 6, Failures: 0, Errors: 0, Skipped: 0, Time elapsed: 0.144 sec
Running org.apache.hadoop.hbase.rest.model.TestColumnSchemaModel
Tests run: 6, Failures: 0, Errors: 0, Skipped: 0, Time elapsed: 0.148 sec
Running org.apache.hadoop.hbase.rest.model.TestVersionModel
Tests run: 6, Failures: 0, Errors: 0, Skipped: 0, Time elapsed: 0.157 sec
Running org.apache.hadoop.hbase.rest.model.TestCellModel
Tests run: 6, Failures: 0, Errors: 0, Skipped: 0, Time elapsed: 0.113 sec
Running org.apache.hadoop.hbase.TestHTableDescriptor
Tests run: 11, Failures: 0, Errors: 0, Skipped: 0, Time elapsed: 0.27 sec
Running org.apache.hadoop.hbase.errorhandling.TestForeignExceptionSerialization
Tests run: 2, Failures: 0, Errors: 0, Skipped: 0, Time elapsed: 0.063 sec
Running org.apache.hadoop.hbase.errorhandling.TestTimeoutExceptionInjector
Tests run: 4, Failures: 0, Errors: 0, Skipped: 0, Time elapsed: 0.135 sec
Running org.apache.hadoop.hbase.errorhandling.TestForeignExceptionDispatcher
Tests run: 3, Failures: 0, Errors: 0, Skipped: 0, Time elapsed: 0.078 sec
Running org.apache.hadoop.hbase.replication.regionserver.TestReplicationSinkManager
Tests run: 5, Failures: 0, Errors: 0, Skipped: 0, Time elapsed: 0.22 sec
Running org.apache.hadoop.hbase.replication.regionserver.TestReplicationThrottler
Tests run: 1, Failures: 0, Errors: 0, Skipped: 0, Time elapsed: 0.025 sec
Running org.apache.hadoop.hbase.master.TestClockSkewDetection
Tests run: 1, Failures: 0, Errors: 1, Skipped: 0, Time elapsed: 262.1 sec <<< FAILURE!
Running org.apache.hadoop.hbase.procedure.TestProcedureManager
Tests run: 1, Failures: 0, Errors: 1, Skipped: 0, Time elapsed: 262.1 sec <<< FAILURE!
Running org.apache.hadoop.hbase.security.TestSecureRPC
Tests run: 1, Failures: 0, Errors: 0, Skipped: 1, Time elapsed: 262.1 sec
Running org.apache.hadoop.hbase.security.TestUsersOperationsWithSecureHadoop
Tests run: 1, Failures: 0, Errors: 0, Skipped: 1, Time elapsed: 262.1 sec
Running org.apache.hadoop.hbase.replication.TestReplicationWALEntryFilters
Tests run: 4, Failures: 0, Errors: 0, Skipped: 0, Time elapsed: 262.1 sec
Running org.apache.hadoop.hbase.ipc.TestIPC
Tests run: 4, Failures: 1, Errors: 3, Skipped: 0, Time elapsed: 262.1 sec <<< FAILURE!

Results :

Failed tests:   testRTEDuringConnectionSetup(org.apache.hadoop.hbase.ipc.TestIPC)

Tests in error: 
  testClockSkewDetection(org.apache.hadoop.hbase.master.TestClockSkewDetection): asf901.ygridcore.net: asf901.ygridcore.net
  org.apache.hadoop.hbase.procedure.TestProcedureManager: asf901.ygridcore.net: asf901.ygridcore.net
  testRpcScheduler(org.apache.hadoop.hbase.ipc.TestIPC): asf901.ygridcore.net: asf901.ygridcore.net
  testCompressCellBlock(org.apache.hadoop.hbase.ipc.TestIPC): asf901.ygridcore.net: asf901.ygridcore.net
  testNoCodec(org.apache.hadoop.hbase.ipc.TestIPC): asf901.ygridcore.net: asf901.ygridcore.net

Tests run: 907, Failures: 1, Errors: 5, Skipped: 6

[INFO] ------------------------------------------------------------------------
[INFO] Reactor Summary:
[INFO] 
[INFO] HBase ............................................. SUCCESS [2.576s]
[INFO] HBase - Common .................................... SUCCESS [32.603s]
[INFO] HBase - Protocol .................................. SUCCESS [9.075s]
[INFO] HBase - Client .................................... SUCCESS [55.283s]
[INFO] HBase - Hadoop Compatibility ...................... SUCCESS [5.616s]
[INFO] HBase - Hadoop Two Compatibility .................. SUCCESS [2.030s]
[INFO] HBase - Prefix Tree ............................... SUCCESS [3.650s]
[INFO] HBase - Server .................................... FAILURE [4:40.779s]
[INFO] HBase - Testing Util .............................. SKIPPED
[INFO] HBase - Thrift .................................... SKIPPED
[INFO] HBase - Shell ..................................... SKIPPED
[INFO] HBase - Integration Tests ......................... SKIPPED
[INFO] HBase - Examples .................................. SKIPPED
[INFO] HBase - Assembly .................................. SKIPPED
[INFO] ------------------------------------------------------------------------
[INFO] BUILD FAILURE
[INFO] ------------------------------------------------------------------------
[INFO] Total time: 6:32.417s
[INFO] Finished at: Tue Aug 05 05:12:59 UTC 2014
[INFO] Final Memory: 75M/1093M
[INFO] ------------------------------------------------------------------------
[ERROR] Failed to execute goal org.apache.maven.plugins:maven-surefire-plugin:2.12-TRUNK-HBASE-2:test (default-test) on project hbase-server: There are test failures.
[ERROR] 
[ERROR] Please refer to <https://builds.apache.org/job/HBase-TRUNK/ws/hbase-server/target/surefire-reports> for the individual test results.
[ERROR] -> [Help 1]
[ERROR] 
[ERROR] To see the full stack trace of the errors, re-run Maven with the -e switch.
[ERROR] Re-run Maven using the -X switch to enable full debug logging.
[ERROR] 
[ERROR] For more information about the errors and possible solutions, please read the following articles:
[ERROR] [Help 1] http://cwiki.apache.org/confluence/display/MAVEN/MojoFailureException
[ERROR] 
[ERROR] After correcting the problems, you can resume the build with the command
[ERROR]   mvn <goals> -rf :hbase-server
Build step 'Invoke top-level Maven targets' marked build as failure
Performing Post build task...
Match found for :.* : True
Logical operation result is TRUE
Running script  :   ZOMBIE_TESTS_COUNT=`jps | grep surefirebooter | wc -l`
  if [[ $ZOMBIE_TESTS_COUNT != 0 ]] ; then
    #It seems sometimes the tests are not dying immediately. Let's give them 10s
    echo "Suspicious java process found - waiting 10s to see if there are just slow to stop"
    sleep 10   
    ZOMBIE_TESTS_COUNT=`jps | grep surefirebooter | wc -l`
    if [[ $ZOMBIE_TESTS_COUNT != 0 ]] ; then
      echo "There are $ZOMBIE_TESTS_COUNT zombie tests, they should have been killed by surefire but survived"
      echo "************ BEGIN zombies jstack extract"
      ZB_STACK=`jps | grep surefirebooter | cut -d ' ' -f 1 | xargs -n 1 jstack | grep ".test" | grep "\.java"`
      jps | grep surefirebooter | cut -d ' ' -f 1 | xargs -n 1 jstack
      echo "************ END  zombies jstack extract"
      JIRA_COMMENT="$JIRA_COMMENT

     {color:red}-1 core zombie tests{color}.  There are ${ZOMBIE_TESTS_COUNT} zombie test(s): ${ZB_STACK}"
      BAD=1
      jps | grep surefirebooter | cut -d ' ' -f 1 | xargs kill -9
    else
      echo "We're ok: there is no zombie test, but some tests took some time to stop"
    fi
  else
    echo "We're ok: there is no zombie test"
  fi
[HBase-TRUNK] $ /bin/bash -xe /tmp/hudson6243805886985677746.sh
++ jps
++ grep surefirebooter
++ wc -l
+ ZOMBIE_TESTS_COUNT=0
+ [[ 0 != 0 ]]
+ echo 'We'\''re ok: there is no zombie test'
We're ok: there is no zombie test
POST BUILD TASK : SUCCESS
END OF POST BUILD TASK : 0
Archiving artifacts
Sending artifact delta relative to HBase-TRUNK #5346
Archived 832 artifacts
Archive block size is 32768
Received 7 blocks and 35937299 bytes
Compression is 0.6%
Took 1 min 17 sec
Recording test results
Updating HBASE-11662
Updating HBASE-10674
Updating HBASE-11668