You are viewing a plain text version of this content. The canonical link for it is here.
Posted to mapreduce-dev@hadoop.apache.org by Apache Jenkins Server <je...@builds.apache.org> on 2012/08/18 15:56:21 UTC

Hadoop-Mapreduce-trunk - Build # 1170 - Still Failing

See https://builds.apache.org/job/Hadoop-Mapreduce-trunk/1170/

###################################################################################
########################## LAST 60 LINES OF THE CONSOLE ###########################
[...truncated 30238 lines...]
Tests run: 1, Failures: 0, Errors: 0, Skipped: 0, Time elapsed: 0.061 sec
Running org.apache.hadoop.mapreduce.TestMapReduce
Tests run: 1, Failures: 0, Errors: 0, Skipped: 0, Time elapsed: 4.521 sec

Results :

Failed tests:   testForEmptyFile(org.apache.hadoop.mapreduce.lib.input.TestCombineFileInputFormat): expected:<0> but was:<1>

Tests in error: 
  testMissingBlocks(org.apache.hadoop.mapreduce.lib.input.TestCombineFileInputFormat): org.apache.hadoop.fs.BlockLocation

Tests run: 384, Failures: 1, Errors: 1, Skipped: 14

[INFO] ------------------------------------------------------------------------
[INFO] Reactor Summary:
[INFO] 
[INFO] hadoop-mapreduce-client ........................... SUCCESS [2.065s]
[INFO] hadoop-mapreduce-client-core ...................... SUCCESS [1:15.413s]
[INFO] hadoop-mapreduce-client-common .................... SUCCESS [21.190s]
[INFO] hadoop-mapreduce-client-shuffle ................... SUCCESS [1.071s]
[INFO] hadoop-mapreduce-client-app ....................... SUCCESS [4:25.931s]
[INFO] hadoop-mapreduce-client-hs ........................ SUCCESS [1:05.566s]
[INFO] hadoop-mapreduce-client-jobclient ................. FAILURE [35:09.180s]
[INFO] Apache Hadoop MapReduce Examples .................. SKIPPED
[INFO] hadoop-mapreduce .................................. SKIPPED
[INFO] ------------------------------------------------------------------------
[INFO] BUILD FAILURE
[INFO] ------------------------------------------------------------------------
[INFO] Total time: 42:20.966s
[INFO] Finished at: Sat Aug 18 13:56:12 UTC 2012
[INFO] Final Memory: 20M/142M
[INFO] ------------------------------------------------------------------------
[ERROR] Failed to execute goal org.apache.maven.plugins:maven-surefire-plugin:2.12:test (default-test) on project hadoop-mapreduce-client-jobclient: There are test failures.
[ERROR] 
[ERROR] Please refer to /home/jenkins/jenkins-slave/workspace/Hadoop-Mapreduce-trunk/trunk/hadoop-mapreduce-project/hadoop-mapreduce-client/hadoop-mapreduce-client-jobclient/target/surefire-reports for the individual test results.
[ERROR] -> [Help 1]
[ERROR] 
[ERROR] To see the full stack trace of the errors, re-run Maven with the -e switch.
[ERROR] Re-run Maven using the -X switch to enable full debug logging.
[ERROR] 
[ERROR] For more information about the errors and possible solutions, please read the following articles:
[ERROR] [Help 1] http://cwiki.apache.org/confluence/display/MAVEN/MojoFailureException
[ERROR] 
[ERROR] After correcting the problems, you can resume the build with the command
[ERROR]   mvn <goals> -rf :hadoop-mapreduce-client-jobclient
Build step 'Execute shell' marked build as failure
[FINDBUGS] Skipping publisher since build result is FAILURE
Archiving artifacts
Updating HADOOP-8693
Updating HADOOP-8689
Updating HADOOP-8695
Updating HADOOP-8697
Updating HADOOP-8692
Updating HADOOP-8710
Updating HADOOP-7967
Updating HDFS-3672
Updating YARN-25
Email was triggered for: Failure
Sending email for trigger: Failure



###################################################################################
############################## FAILED TESTS (if any) ##############################
No tests ran.

Hadoop-Mapreduce-trunk - Build # 1175 - Still Failing

Posted by Apache Jenkins Server <je...@builds.apache.org>.
See https://builds.apache.org/job/Hadoop-Mapreduce-trunk/1175/

###################################################################################
########################## LAST 60 LINES OF THE CONSOLE ###########################
[...truncated 30066 lines...]

Tests run: 111, Failures: 3, Errors: 7, Skipped: 4

[INFO] ------------------------------------------------------------------------
[INFO] Reactor Summary:
[INFO] 
[INFO] hadoop-mapreduce-client ........................... SUCCESS [1.990s]
[INFO] hadoop-mapreduce-client-core ...................... SUCCESS [1:16.729s]
[INFO] hadoop-mapreduce-client-common .................... SUCCESS [21.228s]
[INFO] hadoop-mapreduce-client-shuffle ................... SUCCESS [1.069s]
[INFO] hadoop-mapreduce-client-app ....................... SUCCESS [4:22.434s]
[INFO] hadoop-mapreduce-client-hs ........................ SUCCESS [1:05.362s]
[INFO] hadoop-mapreduce-client-jobclient ................. FAILURE [1:09:47.904s]
[INFO] Apache Hadoop MapReduce Examples .................. SKIPPED
[INFO] hadoop-mapreduce .................................. SKIPPED
[INFO] ------------------------------------------------------------------------
[INFO] BUILD FAILURE
[INFO] ------------------------------------------------------------------------
[INFO] Total time: 1:16:57.257s
[INFO] Finished at: Fri Aug 24 14:31:00 UTC 2012
[INFO] Final Memory: 41M/137M
[INFO] ------------------------------------------------------------------------
[ERROR] Failed to execute goal org.apache.maven.plugins:maven-surefire-plugin:2.12:test (default-test) on project hadoop-mapreduce-client-jobclient: ExecutionException; nested exception is java.util.concurrent.ExecutionException: org.apache.maven.surefire.booter.SurefireBooterForkException: Error occurred in starting fork, check output in log -> [Help 1]
[ERROR] 
[ERROR] To see the full stack trace of the errors, re-run Maven with the -e switch.
[ERROR] Re-run Maven using the -X switch to enable full debug logging.
[ERROR] 
[ERROR] For more information about the errors and possible solutions, please read the following articles:
[ERROR] [Help 1] http://cwiki.apache.org/confluence/display/MAVEN/MojoExecutionException
[ERROR] 
[ERROR] After correcting the problems, you can resume the build with the command
[ERROR]   mvn <goals> -rf :hadoop-mapreduce-client-jobclient
Build step 'Execute shell' marked build as failure
[FINDBUGS] Skipping publisher since build result is FAILURE
Archiving artifacts
Updating MAPREDUCE-4470
Updating HDFS-3832
Updating HDFS-3835
Updating HADOOP-8075
Updating HDFS-3837
Updating HADOOP-8031
Updating HADOOP-4572
Updating HADOOP-8709
Updating HADOOP-8225
Updating HADOOP-8720
Updating HDFS-3672
Updating HDFS-3819
Updating HADOOP-8721
Updating HDFS-3715
Updating MAPREDUCE-2374
Updating HDFS-3830
Updating MAPREDUCE-4068
Updating HDFS-3817
Updating HDFS-2686
Updating HADOOP-8632
Updating MAPREDUCE-4577
Updating HADOOP-8655
Email was triggered for: Failure
Sending email for trigger: Failure



###################################################################################
############################## FAILED TESTS (if any) ##############################
No tests ran.

Hadoop-Mapreduce-trunk - Build # 1174 - Still Failing

Posted by Apache Jenkins Server <je...@builds.apache.org>.
See https://builds.apache.org/job/Hadoop-Mapreduce-trunk/1174/

###################################################################################
########################## LAST 60 LINES OF THE CONSOLE ###########################
[...truncated 30206 lines...]
Running org.apache.hadoop.mapreduce.TestChild
Tests run: 1, Failures: 0, Errors: 0, Skipped: 0, Time elapsed: 53.36 sec
Running org.apache.hadoop.mapreduce.filecache.TestURIFragments
Tests run: 1, Failures: 0, Errors: 0, Skipped: 0, Time elapsed: 0.06 sec
Running org.apache.hadoop.mapreduce.TestMapReduce
Tests run: 1, Failures: 0, Errors: 0, Skipped: 0, Time elapsed: 4.49 sec

Results :

Failed tests:   testForEmptyFile(org.apache.hadoop.mapreduce.lib.input.TestCombineFileInputFormat): expected:<0> but was:<1>

Tests in error: 
  testMissingBlocks(org.apache.hadoop.mapreduce.lib.input.TestCombineFileInputFormat): org.apache.hadoop.fs.BlockLocation

Tests run: 384, Failures: 1, Errors: 1, Skipped: 14

[INFO] ------------------------------------------------------------------------
[INFO] Reactor Summary:
[INFO] 
[INFO] hadoop-mapreduce-client ........................... SUCCESS [2.390s]
[INFO] hadoop-mapreduce-client-core ...................... SUCCESS [1:26.592s]
[INFO] hadoop-mapreduce-client-common .................... SUCCESS [21.231s]
[INFO] hadoop-mapreduce-client-shuffle ................... SUCCESS [1.065s]
[INFO] hadoop-mapreduce-client-app ....................... SUCCESS [4:26.469s]
[INFO] hadoop-mapreduce-client-hs ........................ SUCCESS [1:06.386s]
[INFO] hadoop-mapreduce-client-jobclient ................. FAILURE [35:47.379s]
[INFO] Apache Hadoop MapReduce Examples .................. SKIPPED
[INFO] hadoop-mapreduce .................................. SKIPPED
[INFO] ------------------------------------------------------------------------
[INFO] BUILD FAILURE
[INFO] ------------------------------------------------------------------------
[INFO] Total time: 43:12.058s
[INFO] Finished at: Wed Aug 22 13:56:53 UTC 2012
[INFO] Final Memory: 20M/108M
[INFO] ------------------------------------------------------------------------
[ERROR] Failed to execute goal org.apache.maven.plugins:maven-surefire-plugin:2.12:test (default-test) on project hadoop-mapreduce-client-jobclient: There are test failures.
[ERROR] 
[ERROR] Please refer to /home/jenkins/jenkins-slave/workspace/Hadoop-Mapreduce-trunk/trunk/hadoop-mapreduce-project/hadoop-mapreduce-client/hadoop-mapreduce-client-jobclient/target/surefire-reports for the individual test results.
[ERROR] -> [Help 1]
[ERROR] 
[ERROR] To see the full stack trace of the errors, re-run Maven with the -e switch.
[ERROR] Re-run Maven using the -X switch to enable full debug logging.
[ERROR] 
[ERROR] For more information about the errors and possible solutions, please read the following articles:
[ERROR] [Help 1] http://cwiki.apache.org/confluence/display/MAVEN/MojoFailureException
[ERROR] 
[ERROR] After correcting the problems, you can resume the build with the command
[ERROR]   mvn <goals> -rf :hadoop-mapreduce-client-jobclient
Build step 'Execute shell' marked build as failure
[FINDBUGS] Skipping publisher since build result is FAILURE
Archiving artifacts
Updating MAPREDUCE-3506
Updating MAPREDUCE-4570
Updating HDFS-2686
Updating HDFS-3827
Updating HADOOP-8711
Updating YARN-22
Email was triggered for: Failure
Sending email for trigger: Failure



###################################################################################
############################## FAILED TESTS (if any) ##############################
No tests ran.

Hadoop-Mapreduce-trunk - Build # 1173 - Still Failing

Posted by Apache Jenkins Server <je...@builds.apache.org>.
See https://builds.apache.org/job/Hadoop-Mapreduce-trunk/1173/

###################################################################################
########################## LAST 60 LINES OF THE CONSOLE ###########################
[...truncated 30233 lines...]
Running org.apache.hadoop.mapreduce.filecache.TestURIFragments
Tests run: 1, Failures: 0, Errors: 0, Skipped: 0, Time elapsed: 0.061 sec
Running org.apache.hadoop.mapreduce.TestMapReduce
Tests run: 1, Failures: 0, Errors: 0, Skipped: 0, Time elapsed: 4.502 sec

Results :

Failed tests:   testForEmptyFile(org.apache.hadoop.mapreduce.lib.input.TestCombineFileInputFormat): expected:<0> but was:<1>

Tests in error: 
  testMissingBlocks(org.apache.hadoop.mapreduce.lib.input.TestCombineFileInputFormat): org.apache.hadoop.fs.BlockLocation

Tests run: 384, Failures: 1, Errors: 1, Skipped: 14

[INFO] ------------------------------------------------------------------------
[INFO] Reactor Summary:
[INFO] 
[INFO] hadoop-mapreduce-client ........................... SUCCESS [1.996s]
[INFO] hadoop-mapreduce-client-core ...................... SUCCESS [1:19.225s]
[INFO] hadoop-mapreduce-client-common .................... SUCCESS [21.286s]
[INFO] hadoop-mapreduce-client-shuffle ................... SUCCESS [1.064s]
[INFO] hadoop-mapreduce-client-app ....................... SUCCESS [4:27.211s]
[INFO] hadoop-mapreduce-client-hs ........................ SUCCESS [1:05.514s]
[INFO] hadoop-mapreduce-client-jobclient ................. FAILURE [34:38.349s]
[INFO] Apache Hadoop MapReduce Examples .................. SKIPPED
[INFO] hadoop-mapreduce .................................. SKIPPED
[INFO] ------------------------------------------------------------------------
[INFO] BUILD FAILURE
[INFO] ------------------------------------------------------------------------
[INFO] Total time: 41:55.184s
[INFO] Finished at: Tue Aug 21 13:55:43 UTC 2012
[INFO] Final Memory: 20M/169M
[INFO] ------------------------------------------------------------------------
[ERROR] Failed to execute goal org.apache.maven.plugins:maven-surefire-plugin:2.12:test (default-test) on project hadoop-mapreduce-client-jobclient: There are test failures.
[ERROR] 
[ERROR] Please refer to /home/jenkins/jenkins-slave/workspace/Hadoop-Mapreduce-trunk/trunk/hadoop-mapreduce-project/hadoop-mapreduce-client/hadoop-mapreduce-client-jobclient/target/surefire-reports for the individual test results.
[ERROR] -> [Help 1]
[ERROR] 
[ERROR] To see the full stack trace of the errors, re-run Maven with the -e switch.
[ERROR] Re-run Maven using the -X switch to enable full debug logging.
[ERROR] 
[ERROR] For more information about the errors and possible solutions, please read the following articles:
[ERROR] [Help 1] http://cwiki.apache.org/confluence/display/MAVEN/MojoFailureException
[ERROR] 
[ERROR] After correcting the problems, you can resume the build with the command
[ERROR]   mvn <goals> -rf :hadoop-mapreduce-client-jobclient
Build step 'Execute shell' marked build as failure
[FINDBUGS] Skipping publisher since build result is FAILURE
Archiving artifacts
Updating HADOOP-8686
Updating HADOOP-8611
Updating HADOOP-8239
Updating MAPREDUCE-4323
Updating HADOOP-8614
Updating HDFS-2727
Updating YARN-27
Updating HDFS-3707
Email was triggered for: Failure
Sending email for trigger: Failure



###################################################################################
############################## FAILED TESTS (if any) ##############################
No tests ran.

Hadoop-Mapreduce-trunk - Build # 1172 - Still Failing

Posted by Apache Jenkins Server <je...@builds.apache.org>.
See https://builds.apache.org/job/Hadoop-Mapreduce-trunk/1172/

###################################################################################
########################## LAST 60 LINES OF THE CONSOLE ###########################
[...truncated 30223 lines...]
Running org.apache.hadoop.mapreduce.lib.partition.TestKeyFieldHelper
Tests run: 3, Failures: 0, Errors: 0, Skipped: 0, Time elapsed: 0.137 sec
Running org.apache.hadoop.mapreduce.lib.partition.TestBinaryPartitioner
Tests run: 4, Failures: 0, Errors: 0, Skipped: 0, Time elapsed: 0.398 sec
Running org.apache.hadoop.mapreduce.lib.partition.TestMRKeyFieldBasedPartitioner
Tests run: 1, Failures: 0, Errors: 0, Skipped: 0, Time elapsed: 0.352 sec
Running org.apache.hadoop.mapreduce.TestChild
Tests run: 1, Failures: 0, Errors: 0, Skipped: 0, Time elapsed: 53.337 sec
Running org.apache.hadoop.mapreduce.filecache.TestURIFragments
Tests run: 1, Failures: 0, Errors: 0, Skipped: 0, Time elapsed: 0.061 sec
Running org.apache.hadoop.mapreduce.TestMapReduce
Tests run: 1, Failures: 0, Errors: 0, Skipped: 0, Time elapsed: 4.475 sec

Results :

Failed tests:   testForEmptyFile(org.apache.hadoop.mapreduce.lib.input.TestCombineFileInputFormat): expected:<0> but was:<1>

Tests in error: 
  testMissingBlocks(org.apache.hadoop.mapreduce.lib.input.TestCombineFileInputFormat): org.apache.hadoop.fs.BlockLocation

Tests run: 384, Failures: 1, Errors: 1, Skipped: 14

[INFO] ------------------------------------------------------------------------
[INFO] Reactor Summary:
[INFO] 
[INFO] hadoop-mapreduce-client ........................... SUCCESS [1.982s]
[INFO] hadoop-mapreduce-client-core ...................... SUCCESS [1:18.633s]
[INFO] hadoop-mapreduce-client-common .................... SUCCESS [21.073s]
[INFO] hadoop-mapreduce-client-shuffle ................... SUCCESS [1.063s]
[INFO] hadoop-mapreduce-client-app ....................... SUCCESS [4:26.018s]
[INFO] hadoop-mapreduce-client-hs ........................ SUCCESS [1:05.605s]
[INFO] hadoop-mapreduce-client-jobclient ................. FAILURE [35:43.085s]
[INFO] Apache Hadoop MapReduce Examples .................. SKIPPED
[INFO] hadoop-mapreduce .................................. SKIPPED
[INFO] ------------------------------------------------------------------------
[INFO] BUILD FAILURE
[INFO] ------------------------------------------------------------------------
[INFO] Total time: 42:57.994s
[INFO] Finished at: Mon Aug 20 13:56:33 UTC 2012
[INFO] Final Memory: 20M/185M
[INFO] ------------------------------------------------------------------------
[ERROR] Failed to execute goal org.apache.maven.plugins:maven-surefire-plugin:2.12:test (default-test) on project hadoop-mapreduce-client-jobclient: There are test failures.
[ERROR] 
[ERROR] Please refer to /home/jenkins/jenkins-slave/workspace/Hadoop-Mapreduce-trunk/trunk/hadoop-mapreduce-project/hadoop-mapreduce-client/hadoop-mapreduce-client-jobclient/target/surefire-reports for the individual test results.
[ERROR] -> [Help 1]
[ERROR] 
[ERROR] To see the full stack trace of the errors, re-run Maven with the -e switch.
[ERROR] Re-run Maven using the -X switch to enable full debug logging.
[ERROR] 
[ERROR] For more information about the errors and possible solutions, please read the following articles:
[ERROR] [Help 1] http://cwiki.apache.org/confluence/display/MAVEN/MojoFailureException
[ERROR] 
[ERROR] After correcting the problems, you can resume the build with the command
[ERROR]   mvn <goals> -rf :hadoop-mapreduce-client-jobclient
Build step 'Execute shell' marked build as failure
[FINDBUGS] Skipping publisher since build result is FAILURE
Archiving artifacts
Email was triggered for: Failure
Sending email for trigger: Failure



###################################################################################
############################## FAILED TESTS (if any) ##############################
No tests ran.

Hadoop-Mapreduce-trunk - Build # 1171 - Still Failing

Posted by Apache Jenkins Server <je...@builds.apache.org>.
See https://builds.apache.org/job/Hadoop-Mapreduce-trunk/1171/

###################################################################################
########################## LAST 60 LINES OF THE CONSOLE ###########################
[...truncated 30255 lines...]
Running org.apache.hadoop.mapreduce.lib.partition.TestBinaryPartitioner
Tests run: 4, Failures: 0, Errors: 0, Skipped: 0, Time elapsed: 0.399 sec
Running org.apache.hadoop.mapreduce.lib.partition.TestMRKeyFieldBasedPartitioner
Tests run: 1, Failures: 0, Errors: 0, Skipped: 0, Time elapsed: 0.353 sec
Running org.apache.hadoop.mapreduce.TestChild
Tests run: 1, Failures: 0, Errors: 0, Skipped: 0, Time elapsed: 53.343 sec
Running org.apache.hadoop.mapreduce.filecache.TestURIFragments
Tests run: 1, Failures: 0, Errors: 0, Skipped: 0, Time elapsed: 0.061 sec
Running org.apache.hadoop.mapreduce.TestMapReduce
Tests run: 1, Failures: 0, Errors: 0, Skipped: 0, Time elapsed: 4.462 sec

Results :

Failed tests:   testForEmptyFile(org.apache.hadoop.mapreduce.lib.input.TestCombineFileInputFormat): expected:<0> but was:<1>

Tests in error: 
  testMissingBlocks(org.apache.hadoop.mapreduce.lib.input.TestCombineFileInputFormat): org.apache.hadoop.fs.BlockLocation

Tests run: 384, Failures: 1, Errors: 1, Skipped: 14

[INFO] ------------------------------------------------------------------------
[INFO] Reactor Summary:
[INFO] 
[INFO] hadoop-mapreduce-client ........................... SUCCESS [2.292s]
[INFO] hadoop-mapreduce-client-core ...................... SUCCESS [1:19.139s]
[INFO] hadoop-mapreduce-client-common .................... SUCCESS [21.242s]
[INFO] hadoop-mapreduce-client-shuffle ................... SUCCESS [1.079s]
[INFO] hadoop-mapreduce-client-app ....................... SUCCESS [4:23.904s]
[INFO] hadoop-mapreduce-client-hs ........................ SUCCESS [1:06.000s]
[INFO] hadoop-mapreduce-client-jobclient ................. FAILURE [35:05.582s]
[INFO] Apache Hadoop MapReduce Examples .................. SKIPPED
[INFO] hadoop-mapreduce .................................. SKIPPED
[INFO] ------------------------------------------------------------------------
[INFO] BUILD FAILURE
[INFO] ------------------------------------------------------------------------
[INFO] Total time: 42:19.780s
[INFO] Finished at: Sun Aug 19 13:56:10 UTC 2012
[INFO] Final Memory: 20M/177M
[INFO] ------------------------------------------------------------------------
[ERROR] Failed to execute goal org.apache.maven.plugins:maven-surefire-plugin:2.12:test (default-test) on project hadoop-mapreduce-client-jobclient: There are test failures.
[ERROR] 
[ERROR] Please refer to /home/jenkins/jenkins-slave/workspace/Hadoop-Mapreduce-trunk/trunk/hadoop-mapreduce-project/hadoop-mapreduce-client/hadoop-mapreduce-client-jobclient/target/surefire-reports for the individual test results.
[ERROR] -> [Help 1]
[ERROR] 
[ERROR] To see the full stack trace of the errors, re-run Maven with the -e switch.
[ERROR] Re-run Maven using the -X switch to enable full debug logging.
[ERROR] 
[ERROR] For more information about the errors and possible solutions, please read the following articles:
[ERROR] [Help 1] http://cwiki.apache.org/confluence/display/MAVEN/MojoFailureException
[ERROR] 
[ERROR] After correcting the problems, you can resume the build with the command
[ERROR]   mvn <goals> -rf :hadoop-mapreduce-client-jobclient
Build step 'Execute shell' marked build as failure
[FINDBUGS] Skipping publisher since build result is FAILURE
Archiving artifacts
Updating HADOOP-8240
Updating HDFS-3816
Email was triggered for: Failure
Sending email for trigger: Failure



###################################################################################
############################## FAILED TESTS (if any) ##############################
No tests ran.