You are viewing a plain text version of this content. The canonical link for it is here.
Posted to dev@pdfbox.apache.org by Apache Jenkins Server <je...@builds.apache.org> on 2025/11/28 17:49:13 UTC
Build failed in Jenkins: PDFBox » PDFBox-3.0.x #1033
See <https://ci-builds.apache.org/job/PDFBox/job/PDFBox-3.0.x/1033/display/redirect?page=changes>
Changes:
[Tilman Hausherr] PDFBOX-6107: format year with 4 digits
------------------------------------------
[...truncated 506.40 KiB...]
28.11.2025 17:47:41 INFO text.TestTextStripper:243 - Preparing to parse PDFBOX-3833-reduced.pdf for sorted test
28.11.2025 17:47:41 INFO rendering.TestPDFToImage:199 - Writing: FormI-9-English.pdf-3.png
28.11.2025 17:47:41 INFO text.TestTextStripper:247 - Preparing to parse PDFBOX-4531-bidi-ligature-1.pdf for standard test
28.11.2025 17:47:41 INFO text.TestTextStripper:243 - Preparing to parse PDFBOX-4531-bidi-ligature-1.pdf for sorted test
28.11.2025 17:47:41 INFO text.TestTextStripper:247 - Preparing to parse Liste732004001452_001_0.pdf_0_.pdf for standard test
28.11.2025 17:47:41 INFO text.TestTextStripper:243 - Preparing to parse Liste732004001452_001_0.pdf_0_.pdf for sorted test
28.11.2025 17:47:41 INFO text.TestTextStripper:247 - Preparing to parse PDFBOX-3061-092465-reduced.pdf for standard test
28.11.2025 17:47:41 INFO text.TestTextStripper:243 - Preparing to parse PDFBOX-3061-092465-reduced.pdf for sorted test
28.11.2025 17:47:41 INFO text.TestTextStripper:247 - Preparing to parse PDFBOX-3025.pdf for standard test
28.11.2025 17:47:41 INFO text.TestTextStripper:243 - Preparing to parse PDFBOX-3025.pdf for sorted test
28.11.2025 17:47:41 INFO text.TestTextStripper:247 - Preparing to parse data-000001.pdf for standard test
28.11.2025 17:47:41 INFO text.TestTextStripper:243 - Preparing to parse data-000001.pdf for sorted test
28.11.2025 17:47:41 INFO text.TestTextStripper:247 - Preparing to parse PDFBOX-5920-Y5U2XZCKG2U6TO3FC36NCGOZECHQA2PY-p39-reduced.pdf for standard test
28.11.2025 17:47:41 INFO text.TestTextStripper:243 - Preparing to parse PDFBOX-5920-Y5U2XZCKG2U6TO3FC36NCGOZECHQA2PY-p39-reduced.pdf for sorted test
28.11.2025 17:47:41 INFO text.TestTextStripper:247 - Preparing to parse yaddatest.pdf for standard test
28.11.2025 17:47:41 INFO text.TestTextStripper:243 - Preparing to parse yaddatest.pdf for sorted test
28.11.2025 17:47:41 INFO rendering.TestPDFToImage:199 - Writing: FormI-9-English.pdf-4.png
28.11.2025 17:47:41 WARN pdmodel.PDDocument:1329 - do not call setAllSecurityToBeRemoved(true) before calling protect(), as protect() implies setAllSecurityToBeRemoved(false)
28.11.2025 17:47:41 INFO rendering.TestPDFToImage:283 - *** TEST OK *** for file: PDFBOX-4955.pdf-1.png
28.11.2025 17:47:41 INFO rendering.TestPDFToImage:284 - Deleting: PDFBOX-4955.pdf-1.png
[INFO] Tests run: 5, Failures: 0, Errors: 0, Skipped: 0, Time elapsed: 9.877 s -- in org.apache.pdfbox.text.TestTextStripper
28.11.2025 17:47:42 INFO rendering.TestPDFToImage:199 - Writing: FormI-9-English.pdf-5.png
28.11.2025 17:47:42 INFO rendering.TestPDFToImage:237 - Comparing: FormI-9-English.pdf
28.11.2025 17:47:42 INFO rendering.TestPDFToImage:291 - *** TEST OK *** for file: FormI-9-English.pdf-4.png
28.11.2025 17:47:42 INFO rendering.TestPDFToImage:292 - Deleting: FormI-9-English.pdf-4.png
28.11.2025 17:47:42 INFO rendering.TestPDFToImage:291 - *** TEST OK *** for file: FormI-9-English.pdf-1.png
28.11.2025 17:47:42 INFO rendering.TestPDFToImage:292 - Deleting: FormI-9-English.pdf-1.png
28.11.2025 17:47:42 INFO rendering.TestPDFToImage:291 - *** TEST OK *** for file: FormI-9-English.pdf-2.png
28.11.2025 17:47:42 INFO rendering.TestPDFToImage:292 - Deleting: FormI-9-English.pdf-2.png
28.11.2025 17:47:42 INFO rendering.TestPDFToImage:291 - *** TEST OK *** for file: FormI-9-English.pdf-3.png
28.11.2025 17:47:42 INFO rendering.TestPDFToImage:292 - Deleting: FormI-9-English.pdf-3.png
28.11.2025 17:47:42 INFO rendering.TestPDFToImage:291 - *** TEST OK *** for file: FormI-9-English.pdf-5.png
28.11.2025 17:47:42 INFO rendering.TestPDFToImage:292 - Deleting: FormI-9-English.pdf-5.png
[INFO] Tests run: 13, Failures: 0, Errors: 0, Skipped: 0, Time elapsed: 17.79 s -- in org.apache.pdfbox.pdmodel.interactive.form.PDAcroFormFlattenTest
[INFO] Tests run: 6, Failures: 0, Errors: 0, Skipped: 0, Time elapsed: 10.44 s -- in org.apache.pdfbox.util.TestNumberFormatUtil
[INFO] Tests run: 30, Failures: 0, Errors: 0, Skipped: 0, Time elapsed: 11.09 s -- in org.apache.pdfbox.multipdf.PDFMergerUtilityTest
28.11.2025 17:47:43 WARN pdmodel.PDDocument:1329 - do not call setAllSecurityToBeRemoved(true) before calling protect(), as protect() implies setAllSecurityToBeRemoved(false)
[INFO] Tests run: 7, Failures: 0, Errors: 0, Skipped: 0, Time elapsed: 21.04 s -- in org.apache.pdfbox.encryption.TestSymmetricKeyEncryption
[INFO] Tests run: 5, Failures: 0, Errors: 0, Skipped: 0, Time elapsed: 16.68 s -- in org.apache.pdfbox.filter.TestFilters
[INFO]
[INFO] Results:
[INFO]
[WARNING] Tests run: 704, Failures: 0, Errors: 0, Skipped: 2
[INFO]
[JENKINS] Recording test results
[INFO]
[INFO] --- animal-sniffer-maven-plugin:1.24:check (check-java-version) @ pdfbox ---
[INFO] Checking unresolved references to org.codehaus.mojo.signature:java18:1.0
[INFO]
[INFO] --- maven-bundle-plugin:5.1.9:bundle (default-bundle) @ pdfbox ---
[INFO] Building bundle: <https://ci-builds.apache.org/job/PDFBox/job/PDFBox-3.0.x/ws/pdfbox/target/pdfbox-3.0.7-SNAPSHOT.jar>
[INFO] Writing manifest: <https://ci-builds.apache.org/job/PDFBox/job/PDFBox-3.0.x/ws/pdfbox/target/classes/META-INF/MANIFEST.MF>
[INFO]
[INFO] --- apache-rat-plugin:0.17:check (default) @ pdfbox ---
[WARNING] Basedir is : <https://ci-builds.apache.org/job/PDFBox/job/PDFBox-3.0.x/ws/pdfbox>
[WARNING] Use of deprecated option 'exclude'. Deprecated for removal since 0.17: Use <inputExclude> instead.
[INFO] Excluding patterns: src/main/resources/org/apache/pdfbox/resources/afm/*, src/main/resources/org/apache/pdfbox/resources/icc/*, src/main/resources/org/apache/pdfbox/resources/glyphlist/glyphlist.txt, src/main/resources/org/apache/pdfbox/resources/glyphlist/zapfdingbats.txt, src/main/resources/org/apache/pdfbox/resources/text/BidiMirroring.txt, src/main/resources/META-INF/services/*, src/test/resources/input/rendering/*.ai, src/test/resources/input/*.txt, src/test/resources/input/**/*.pdf, src/test/resources/input/**/*.png, src/test/resources/input/*.pdf, src/test/resources/org/apache/**/*.pdf, src/test/resources/output/*, src/test/resources/org/apache/pdfbox/pdmodel/sRGB.*, src/test/resources/org/apache/pdfbox/pdfparser/*.fdf, release.properties, src/test/resources/org/apache/pdfbox/encryption/*.der, src/test/resources/org/apache/pdfbox/encryption/*.p12, src/test/resources/org/apache/pdfbox/encryption/*.pfx, src/test/resources/org/apache/pdfbox/filter/*.bin, src/test/resources/org/apache/pdfbox/text/*.txt, src/test/resources/*.properties, src/main/java/org/apache/pdfbox/filter/CCITTFaxDecoderStream.java, src/main/java/org/apache/pdfbox/filter/CCITTFaxEncoderStream.java, src/main/java/org/apache/pdfbox/filter/TIFFExtension.java
[INFO] Excluding MAVEN collection.
[INFO] Excluding ECLIPSE collection.
[INFO] Excluding IDEA collection.
[INFO] Processing exclude file from STANDARD_SCMS.
[INFO] Excluding STANDARD_SCMS collection.
[INFO] Excluding MISC collection.
[INFO] Excluding HIDDEN_DIR collection.
[INFO] RAT summary:
[INFO] Approved: 792
[INFO] Archives: 0
[INFO] Binaries: 46
[INFO] Document types: 4
[INFO] Ignored: 277
[INFO] License categories: 1
[INFO] License names: 1
[INFO] Notices: 2
[INFO] Standards: 792
[INFO] Unapproved: 0
[INFO] Unknown: 0
[INFO]
[INFO] --- dependency-check-maven:10.0.4:check (default) @ pdfbox ---
[INFO] Skipping dependency-check
[INFO]
[INFO] --- maven-install-plugin:3.1.4:install (default-install) @ pdfbox ---
[INFO] Installing <https://ci-builds.apache.org/job/PDFBox/job/PDFBox-3.0.x/ws/pdfbox/pom.xml> to /home/jenkins/.m2/repository/org/apache/pdfbox/pdfbox/3.0.7-SNAPSHOT/pdfbox-3.0.7-SNAPSHOT.pom
[INFO] Installing <https://ci-builds.apache.org/job/PDFBox/job/PDFBox-3.0.x/ws/pdfbox/target/pdfbox-3.0.7-SNAPSHOT.jar> to /home/jenkins/.m2/repository/org/apache/pdfbox/pdfbox/3.0.7-SNAPSHOT/pdfbox-3.0.7-SNAPSHOT.jar
[INFO]
[INFO] --- maven-bundle-plugin:5.1.9:install (default-install) @ pdfbox ---
[INFO] Installing org/apache/pdfbox/pdfbox/3.0.7-SNAPSHOT/pdfbox-3.0.7-SNAPSHOT.jar
[INFO] Writing OBR metadata
[INFO]
[INFO] --- maven-deploy-plugin:3.1.4:deploy (default-deploy) @ pdfbox ---
[INFO] Downloading from apache.snapshots.https: https://repository.apache.org/content/repositories/snapshots/org/apache/pdfbox/pdfbox/3.0.7-SNAPSHOT/maven-metadata.xml
[INFO] Downloaded from apache.snapshots.https: https://repository.apache.org/content/repositories/snapshots/org/apache/pdfbox/pdfbox/3.0.7-SNAPSHOT/maven-metadata.xml (776 B at 1.1 kB/s)
[INFO] Uploading to apache.snapshots.https: https://repository.apache.org/content/repositories/snapshots/org/apache/pdfbox/pdfbox/3.0.7-SNAPSHOT/pdfbox-3.0.7-20251128.174352-92.pom
[INFO] Uploaded to apache.snapshots.https: https://repository.apache.org/content/repositories/snapshots/org/apache/pdfbox/pdfbox/3.0.7-SNAPSHOT/pdfbox-3.0.7-20251128.174352-92.pom (54 kB at 38 kB/s)
[INFO] Uploading to apache.snapshots.https: https://repository.apache.org/content/repositories/snapshots/org/apache/pdfbox/pdfbox/3.0.7-SNAPSHOT/pdfbox-3.0.7-20251128.174352-92.jar
[INFO] Uploaded to apache.snapshots.https: https://repository.apache.org/content/repositories/snapshots/org/apache/pdfbox/pdfbox/3.0.7-SNAPSHOT/pdfbox-3.0.7-20251128.174352-92.jar (2.1 MB at 1.1 MB/s)
[INFO] Downloading from apache.snapshots.https: https://repository.apache.org/content/repositories/snapshots/org/apache/pdfbox/pdfbox/maven-metadata.xml
[INFO] Downloaded from apache.snapshots.https: https://repository.apache.org/content/repositories/snapshots/org/apache/pdfbox/pdfbox/maven-metadata.xml (465 B at 1.3 kB/s)
[INFO] Uploading to apache.snapshots.https: https://repository.apache.org/content/repositories/snapshots/org/apache/pdfbox/pdfbox/3.0.7-SNAPSHOT/maven-metadata.xml
[INFO] Uploaded to apache.snapshots.https: https://repository.apache.org/content/repositories/snapshots/org/apache/pdfbox/pdfbox/3.0.7-SNAPSHOT/maven-metadata.xml (776 B at 732 B/s)
[INFO] Uploading to apache.snapshots.https: https://repository.apache.org/content/repositories/snapshots/org/apache/pdfbox/pdfbox/maven-metadata.xml
[INFO] Uploaded to apache.snapshots.https: https://repository.apache.org/content/repositories/snapshots/org/apache/pdfbox/pdfbox/maven-metadata.xml (465 B at 439 B/s)
[INFO]
[INFO] --- maven-bundle-plugin:5.1.9:deploy (default-deploy) @ pdfbox ---
[INFO] Remote OBR update disabled (enable with -DremoteOBR)
[INFO]
[INFO] --- ossindex-maven-plugin:3.2.0:audit (default-cli) @ pdfbox ---
[INFO] Checking for vulnerabilities; 25 artifacts
[INFO] Exclude coordinates: []
[INFO] Exclude vulnerability identifiers: []
[INFO] CVSS-score threshold: 0.0
[WARNING] Failed to fetch component-reports
org.sonatype.ossindex.service.client.transport.Transport$TransportException: Unexpected response; status: HTTP/1.1 401 Unauthorized
at org.sonatype.ossindex.service.client.transport.HttpClientTransport.post (HttpClientTransport.java:102)
at org.sonatype.ossindex.service.client.internal.OssindexClientImpl.doRequestComponentReports (OssindexClientImpl.java:204)
at org.sonatype.ossindex.service.client.internal.OssindexClientImpl.requestComponentReports (OssindexClientImpl.java:170)
at org.sonatype.ossindex.maven.common.ComponentReportAssistant.request (ComponentReportAssistant.java:86)
at org.sonatype.ossindex.maven.plugin.AuditMojoSupport.execute (AuditMojoSupport.java:242)
at org.apache.maven.plugin.DefaultBuildPluginManager.executeMojo (DefaultBuildPluginManager.java:137)
at org.apache.maven.lifecycle.internal.MojoExecutor.doExecute2 (MojoExecutor.java:370)
at org.apache.maven.lifecycle.internal.MojoExecutor.doExecute (MojoExecutor.java:351)
at org.apache.maven.lifecycle.internal.MojoExecutor.execute (MojoExecutor.java:215)
at org.apache.maven.lifecycle.internal.MojoExecutor.execute (MojoExecutor.java:171)
at org.apache.maven.lifecycle.internal.MojoExecutor.execute (MojoExecutor.java:163)
at org.apache.maven.lifecycle.internal.LifecycleModuleBuilder.buildProject (LifecycleModuleBuilder.java:117)
at org.apache.maven.lifecycle.internal.LifecycleModuleBuilder.buildProject (LifecycleModuleBuilder.java:81)
at org.apache.maven.lifecycle.internal.builder.singlethreaded.SingleThreadedBuilder.build (SingleThreadedBuilder.java:56)
at org.apache.maven.lifecycle.internal.LifecycleStarter.execute (LifecycleStarter.java:128)
at org.apache.maven.DefaultMaven.doExecute (DefaultMaven.java:298)
at org.apache.maven.DefaultMaven.doExecute (DefaultMaven.java:192)
at org.apache.maven.DefaultMaven.execute (DefaultMaven.java:105)
at org.jvnet.hudson.maven3.launcher.Maven35Launcher.main (Maven35Launcher.java:138)
at jdk.internal.reflect.NativeMethodAccessorImpl.invoke0 (Native Method)
at jdk.internal.reflect.NativeMethodAccessorImpl.invoke (NativeMethodAccessorImpl.java:77)
at jdk.internal.reflect.DelegatingMethodAccessorImpl.invoke (DelegatingMethodAccessorImpl.java:43)
at java.lang.reflect.Method.invoke (Method.java:569)
at org.codehaus.plexus.classworlds.launcher.Launcher.launchEnhanced (Launcher.java:282)
at org.codehaus.plexus.classworlds.launcher.Launcher.launch (Launcher.java:225)
at jenkins.maven3.agent.Maven35Main.launch (Maven35Main.java:179)
at jdk.internal.reflect.NativeMethodAccessorImpl.invoke0 (Native Method)
at jdk.internal.reflect.NativeMethodAccessorImpl.invoke (NativeMethodAccessorImpl.java:77)
at jdk.internal.reflect.DelegatingMethodAccessorImpl.invoke (DelegatingMethodAccessorImpl.java:43)
at java.lang.reflect.Method.invoke (Method.java:569)
at hudson.maven.Maven3Builder.call (Maven3Builder.java:140)
at hudson.maven.Maven3Builder.call (Maven3Builder.java:71)
at hudson.remoting.UserRequest.perform (UserRequest.java:225)
at hudson.remoting.UserRequest.perform (UserRequest.java:50)
at hudson.remoting.Request$2.run (Request.java:391)
at hudson.remoting.InterceptingExecutorService.lambda$wrap$0 (InterceptingExecutorService.java:81)
at java.util.concurrent.FutureTask.run (FutureTask.java:264)
at java.util.concurrent.ThreadPoolExecutor.runWorker (ThreadPoolExecutor.java:1136)
at java.util.concurrent.ThreadPoolExecutor$Worker.run (ThreadPoolExecutor.java:635)
at java.lang.Thread.run (Thread.java:840)
[INFO]
[INFO] --------------------< org.apache.pdfbox:preflight >---------------------
[INFO] Building Apache Preflight 3.0.7-SNAPSHOT [6/13]
[INFO] -------------------------------[ bundle ]-------------------------------
[INFO]
[INFO] --- maven-clean-plugin:3.5.0:clean (default-clean) @ preflight ---
[INFO]
[INFO] --- maven-enforcer-plugin:3.6.2:enforce (default) @ preflight ---
[INFO]
[INFO] --- maven-enforcer-plugin:3.6.2:enforce (enforce-maven-version) @ preflight ---
[INFO]
[INFO] --- maven-enforcer-plugin:3.6.2:enforce (enforce-java-version) @ preflight ---
[INFO]
[INFO] --- maven-checkstyle-plugin:3.6.0:check (check) @ preflight ---
[INFO] Starting audit...
Audit done.
[INFO] You have 0 Checkstyle violations.
[INFO]
[INFO] --- maven-remote-resources-plugin:3.3.0:process (process-resource-bundles) @ preflight ---
[INFO] Preparing remote bundle org.apache.apache.resources:apache-jar-resource-bundle:1.7
[INFO] Copying 3 resources from 1 bundle.
[INFO]
[INFO] --- maven-resources-plugin:3.3.1:resources (default-resources) @ preflight ---
[INFO] Copying 0 resource from src/main/resources to target/classes
[INFO] Copying 3 resources from target/maven-shared-archive-resources to target/classes
[INFO]
[INFO] --- maven-compiler-plugin:3.14.0:compile (default-compile) @ preflight ---
[INFO] Recompiling the module because of changed dependency.
[INFO] Compiling 116 source files with javac [debug deprecation release 8] to target/classes
[WARNING] <https://ci-builds.apache.org/job/PDFBox/job/PDFBox-3.0.x/ws/preflight/src/main/java/org/apache/pdfbox/preflight/graphic/StandardColorSpaceHelper.java>:[330,65] getColorants() in org.apache.pdfbox.pdmodel.graphics.color.PDDeviceNAttributes has been deprecated
[INFO] <https://ci-builds.apache.org/job/PDFBox/job/PDFBox-3.0.x/ws/preflight/src/main/java/org/apache/pdfbox/preflight/font/descriptor/FontDescriptorHelper.java>: <https://ci-builds.apache.org/job/PDFBox/job/PDFBox-3.0.x/ws/preflight/src/main/java/org/apache/pdfbox/preflight/font/descriptor/FontDescriptorHelper.java> uses unchecked or unsafe operations.
[INFO] <https://ci-builds.apache.org/job/PDFBox/job/PDFBox-3.0.x/ws/preflight/src/main/java/org/apache/pdfbox/preflight/font/descriptor/FontDescriptorHelper.java>: Recompile with -Xlint:unchecked for details.
[INFO]
[INFO] --- download-maven-plugin:1.9.0:wget (get-isartor) @ preflight ---
[INFO]
[INFO] --- download-maven-plugin:1.9.0:wget (get-bavaria) @ preflight ---
[INFO] ------------------------------------------------------------------------
[INFO] Reactor Summary for Apache PDFBox Reactor 3.0.7-SNAPSHOT:
[INFO]
[INFO] Apache PDFBox parent ............................... SUCCESS [ 29.332 s]
[INFO] Apache PDFBox io ................................... SUCCESS [ 56.783 s]
[INFO] Apache FontBox ..................................... SUCCESS [ 39.679 s]
[INFO] Apache XmpBox ...................................... SUCCESS [ 24.310 s]
[INFO] Apache PDFBox ...................................... SUCCESS [01:37 min]
[INFO] Apache Preflight ................................... FAILURE [ 13.335 s]
[INFO] Apache Preflight application ....................... SKIPPED
[INFO] Apache PDFBox Debugger ............................. SKIPPED
[INFO] Apache PDFBox tools ................................ SKIPPED
[INFO] Apache PDFBox application .......................... SKIPPED
[INFO] Apache PDFBox Debugger application ................. SKIPPED
[INFO] Apache PDFBox examples ............................. SKIPPED
[INFO] Apache PDFBox Reactor .............................. SKIPPED
[INFO] ------------------------------------------------------------------------
[INFO] BUILD FAILURE
[INFO] ------------------------------------------------------------------------
[INFO] Total time: 04:57 min
[INFO] Finished at: 2025-11-28T17:48:49Z
[INFO] ------------------------------------------------------------------------
Waiting for Jenkins to finish collecting data
[ERROR] Failed to execute goal com.googlecode.maven-download-plugin:download-maven-plugin:1.9.0:wget (get-bavaria) on project preflight: Read timed out -> [Help 1]
[ERROR]
[ERROR] To see the full stack trace of the errors, re-run Maven with the -e switch.
[ERROR] Re-run Maven using the -X switch to enable full debug logging.
[ERROR]
[ERROR] For more information about the errors and possible solutions, please read the following articles:
[ERROR] [Help 1] http://cwiki.apache.org/confluence/display/MAVEN/MojoExecutionException
[ERROR]
[ERROR] After correcting the problems, you can resume the build with the command
[ERROR] mvn <goals> -rf :preflight
[JENKINS] Archiving <https://ci-builds.apache.org/job/PDFBox/job/PDFBox-3.0.x/ws/examples/pom.xml> to org.apache.pdfbox/pdfbox-examples/3.0.7-SNAPSHOT/pdfbox-examples-3.0.7-SNAPSHOT.pom
[JENKINS] Archiving <https://ci-builds.apache.org/job/PDFBox/job/PDFBox-3.0.x/ws/parent/pom.xml> to org.apache.pdfbox/pdfbox-parent/3.0.7-SNAPSHOT/pdfbox-parent-3.0.7-SNAPSHOT.pom
[JENKINS] Archiving <https://ci-builds.apache.org/job/PDFBox/job/PDFBox-3.0.x/ws/pdfbox/pom.xml> to org.apache.pdfbox/pdfbox/3.0.7-SNAPSHOT/pdfbox-3.0.7-SNAPSHOT.pom
[JENKINS] Archiving <https://ci-builds.apache.org/job/PDFBox/job/PDFBox-3.0.x/ws/pdfbox/target/pdfbox-3.0.7-SNAPSHOT.jar> to org.apache.pdfbox/pdfbox/3.0.7-SNAPSHOT/pdfbox-3.0.7-SNAPSHOT.jar
[JENKINS] Archiving <https://ci-builds.apache.org/job/PDFBox/job/PDFBox-3.0.x/ws/debugger-app/pom.xml> to org.apache.pdfbox/debugger-app/3.0.7-SNAPSHOT/debugger-app-3.0.7-SNAPSHOT.pom
[JENKINS] Archiving <https://ci-builds.apache.org/job/PDFBox/job/PDFBox-3.0.x/ws/io/pom.xml> to org.apache.pdfbox/pdfbox-io/3.0.7-SNAPSHOT/pdfbox-io-3.0.7-SNAPSHOT.pom
[JENKINS] Archiving <https://ci-builds.apache.org/job/PDFBox/job/PDFBox-3.0.x/ws/io/target/pdfbox-io-3.0.7-SNAPSHOT.jar> to org.apache.pdfbox/pdfbox-io/3.0.7-SNAPSHOT/pdfbox-io-3.0.7-SNAPSHOT.jar
[JENKINS] Archiving <https://ci-builds.apache.org/job/PDFBox/job/PDFBox-3.0.x/ws/fontbox/pom.xml> to org.apache.pdfbox/fontbox/3.0.7-SNAPSHOT/fontbox-3.0.7-SNAPSHOT.pom
[JENKINS] Archiving <https://ci-builds.apache.org/job/PDFBox/job/PDFBox-3.0.x/ws/fontbox/target/fontbox-3.0.7-SNAPSHOT.jar> to org.apache.pdfbox/fontbox/3.0.7-SNAPSHOT/fontbox-3.0.7-SNAPSHOT.jar
[JENKINS] Archiving <https://ci-builds.apache.org/job/PDFBox/job/PDFBox-3.0.x/ws/xmpbox/pom.xml> to org.apache.pdfbox/xmpbox/3.0.7-SNAPSHOT/xmpbox-3.0.7-SNAPSHOT.pom
[JENKINS] Archiving <https://ci-builds.apache.org/job/PDFBox/job/PDFBox-3.0.x/ws/xmpbox/target/xmpbox-3.0.7-SNAPSHOT.jar> to org.apache.pdfbox/xmpbox/3.0.7-SNAPSHOT/xmpbox-3.0.7-SNAPSHOT.jar
[JENKINS] Archiving <https://ci-builds.apache.org/job/PDFBox/job/PDFBox-3.0.x/ws/tools/pom.xml> to org.apache.pdfbox/pdfbox-tools/3.0.7-SNAPSHOT/pdfbox-tools-3.0.7-SNAPSHOT.pom
[JENKINS] Archiving <https://ci-builds.apache.org/job/PDFBox/job/PDFBox-3.0.x/ws/debugger/pom.xml> to org.apache.pdfbox/pdfbox-debugger/3.0.7-SNAPSHOT/pdfbox-debugger-3.0.7-SNAPSHOT.pom
[JENKINS] Archiving <https://ci-builds.apache.org/job/PDFBox/job/PDFBox-3.0.x/ws/preflight-app/pom.xml> to org.apache.pdfbox/preflight-app/3.0.7-SNAPSHOT/preflight-app-3.0.7-SNAPSHOT.pom
[JENKINS] Archiving <https://ci-builds.apache.org/job/PDFBox/job/PDFBox-3.0.x/ws/app/pom.xml> to org.apache.pdfbox/pdfbox-app/3.0.7-SNAPSHOT/pdfbox-app-3.0.7-SNAPSHOT.pom
[JENKINS] Archiving <https://ci-builds.apache.org/job/PDFBox/job/PDFBox-3.0.x/ws/preflight/pom.xml> to org.apache.pdfbox/preflight/3.0.7-SNAPSHOT/preflight-3.0.7-SNAPSHOT.pom
[JENKINS] Archiving <https://ci-builds.apache.org/job/PDFBox/job/PDFBox-3.0.x/ws/pom.xml> to org.apache.pdfbox/pdfbox-reactor/3.0.7-SNAPSHOT/pdfbox-reactor-3.0.7-SNAPSHOT.pom
No mail will be sent out, as 'PDFBox » PDFBox-3.0.x » Apache PDFBox examples #1033' does not have a result yet. Please make sure you set a proper result in case of pipeline/build scripts.
No mail will be sent out, as 'PDFBox » PDFBox-3.0.x » Apache PDFBox Debugger application #1033' does not have a result yet. Please make sure you set a proper result in case of pipeline/build scripts.
Sending e-mails to: dev@pdfbox.apache.org
No mail will be sent out, as 'PDFBox » PDFBox-3.0.x » Apache PDFBox tools #1033' does not have a result yet. Please make sure you set a proper result in case of pipeline/build scripts.
No mail will be sent out, as 'PDFBox » PDFBox-3.0.x » Apache PDFBox Debugger #1033' does not have a result yet. Please make sure you set a proper result in case of pipeline/build scripts.
No mail will be sent out, as 'PDFBox » PDFBox-3.0.x » Apache Preflight application #1033' does not have a result yet. Please make sure you set a proper result in case of pipeline/build scripts.
No mail will be sent out, as 'PDFBox » PDFBox-3.0.x » Apache PDFBox application #1033' does not have a result yet. Please make sure you set a proper result in case of pipeline/build scripts.
Sending e-mails to: dev@pdfbox.apache.org
No mail will be sent out, as 'PDFBox » PDFBox-3.0.x » Apache PDFBox Reactor #1033' does not have a result yet. Please make sure you set a proper result in case of pipeline/build scripts.
channel stopped
Archiving artifacts
---------------------------------------------------------------------
To unsubscribe, e-mail: dev-unsubscribe@pdfbox.apache.org
For additional commands, e-mail: dev-help@pdfbox.apache.org
Jenkins build is back to normal : PDFBox » PDFBox-3.0.x #1034
Posted by Apache Jenkins Server <je...@builds.apache.org>.
See <https://ci-builds.apache.org/job/PDFBox/job/PDFBox-3.0.x/1034/display/redirect?page=changes>
---------------------------------------------------------------------
To unsubscribe, e-mail: dev-unsubscribe@pdfbox.apache.org
For additional commands, e-mail: dev-help@pdfbox.apache.org