You are viewing a plain text version of this content. The canonical link for it is here.
Posted to commits@sling.apache.org by Apache Jenkins Server <je...@builds.apache.org> on 2016/10/06 10:54:06 UTC

Build failed in Jenkins: sling-contrib-commons-mom-jobs-it-services-1.8 #1

See <https://builds.apache.org/job/sling-contrib-commons-mom-jobs-it-services-1.8/1/>

------------------------------------------
Started by an SCM change
[EnvInject] - Loading node environment variables.
Building remotely on jenkins-test-ddd (Ubuntu ubuntu jenkins-cloud-8GB jenkins-cloud-4GB cloud-slave) in workspace <https://builds.apache.org/job/sling-contrib-commons-mom-jobs-it-services-1.8/ws/>
Checking out a fresh workspace because there's no workspace at <https://builds.apache.org/job/sling-contrib-commons-mom-jobs-it-services-1.8/ws/>
Cleaning local Directory .
Checking out https://svn.apache.org/repos/asf/sling/trunk/contrib/commons/mom/jobs/it-services at revision '2016-10-06T10:52:55.753 +0000'
AU        testlaunch.jsp
A         src
A         src/main
A         src/main/java
A         src/main/java/org
A         src/main/java/org/apache
A         src/main/java/org/apache/sling
A         src/main/java/org/apache/sling/jobs
A         src/main/java/org/apache/sling/jobs/it
A         src/main/java/org/apache/sling/jobs/it/services
AU        src/main/java/org/apache/sling/jobs/it/services/FullySyncJob.java
AU        src/main/java/org/apache/sling/jobs/it/services/AsyncJobConsumer.java
AU        src/main/java/org/apache/sling/jobs/it/services/JobManagerTestComponent.java
AU        pom.xml
At revision 1763554

Parsing POMs
Discovered a new module org.apache.sling:org.apache.sling.jobs-it-services Apache Sling Jobs Service Integration Tests Bundle
Modules changed, recalculating dependency graph
Established TCP socket on 38706
maven32-agent.jar already up to date
maven32-interceptor.jar already up to date
maven3-interceptor-commons.jar already up to date
[sling-contrib-commons-mom-jobs-it-services-1.8] $ /home/jenkins/tools/java/latest1.8/bin/java -Xmx2g -Xms256m -XX:MaxPermSize=512m -cp /home/jenkins/jenkins-slave/maven32-agent.jar:/home/jenkins/tools/maven/apache-maven-3.3.9/boot/plexus-classworlds-2.5.2.jar:/home/jenkins/tools/maven/apache-maven-3.3.9/conf/logging jenkins.maven3.agent.Maven32Main /home/jenkins/tools/maven/apache-maven-3.3.9 /home/jenkins/jenkins-slave/slave.jar /home/jenkins/jenkins-slave/maven32-interceptor.jar /home/jenkins/jenkins-slave/maven3-interceptor-commons.jar 38706
Java HotSpot(TM) 64-Bit Server VM warning: ignoring option MaxPermSize=512m; support was removed in 8.0
<===[JENKINS REMOTING CAPACITY]===>   channel started
Executing Maven:  -B -f <https://builds.apache.org/job/sling-contrib-commons-mom-jobs-it-services-1.8/ws/pom.xml> -Dmaven.repo.local=/home/jenkins/jenkins-slave/maven-repositories/0 -U clean verify
[INFO] Scanning for projects...
[INFO]                                                                         
[INFO] ------------------------------------------------------------------------
[INFO] Building Apache Sling Jobs Service Integration Tests Bundle 0.0.1-SNAPSHOT
[INFO] ------------------------------------------------------------------------
[INFO] Downloading: http://repository.apache.org/snapshots/org/apache/sling/org.apache.sling.jobs/1.0.1-SNAPSHOT/maven-metadata.xml
[INFO] Downloading: http://repository.apache.org/snapshots/org/apache/sling/org.apache.sling.jobs/1.0.1-SNAPSHOT/org.apache.sling.jobs-1.0.1-SNAPSHOT.pom
[WARNING] The POM for org.apache.sling:org.apache.sling.jobs:jar:1.0.1-SNAPSHOT is missing, no dependency information available
[INFO] Downloading: http://repository.apache.org/snapshots/org/apache/sling/org.apache.sling.jobs/1.0.1-SNAPSHOT/org.apache.sling.jobs-1.0.1-SNAPSHOT.jar
[JENKINS] Archiving disabled
[JENKINS] Archiving disabled
[INFO] ------------------------------------------------------------------------
[INFO] BUILD FAILURE
[INFO] ------------------------------------------------------------------------
[INFO] Total time: 4.998 s
[INFO] Finished at: 2016-10-06T10:54:09+00:00
[INFO] Final Memory: 15M/287M
[INFO] ------------------------------------------------------------------------
Waiting for Jenkins to finish collecting data
[ERROR] Failed to execute goal on project org.apache.sling.jobs-it-services: Could not resolve dependencies for project org.apache.sling:org.apache.sling.jobs-it-services:bundle:0.0.1-SNAPSHOT: Could not find artifact org.apache.sling:org.apache.sling.jobs:jar:1.0.1-SNAPSHOT in Nexus (http://repository.apache.org/snapshots) -> [Help 1]
[ERROR] 
[ERROR] To see the full stack trace of the errors, re-run Maven with the -e switch.
[ERROR] Re-run Maven using the -X switch to enable full debug logging.
[ERROR] 
[ERROR] For more information about the errors and possible solutions, please read the following articles:
[ERROR] [Help 1] http://cwiki.apache.org/confluence/display/MAVEN/DependencyResolutionException
channel stopped
Recording test results

Re: Build failed in Jenkins: sling-contrib-commons-mom-jobs-it-services-1.8 #1

Posted by Robert Munteanu <ro...@apache.org>.
Please ignore the initial batch of failures for MoM, the snapshots will
be deployed soon and then they should pass.

Robert

On Thu, 2016-10-06 at 10:54 +0000, Apache Jenkins Server wrote:
> See <https://builds.apache.org/job/sling-contrib-commons-mom-jobs-it-
> services-1.8/1/>
> 
> ------------------------------------------
> Started by an SCM change
> [EnvInject] - Loading node environment variables.
> Building remotely on jenkins-test-ddd (Ubuntu ubuntu jenkins-cloud-
> 8GB jenkins-cloud-4GB cloud-slave) in workspace <https://builds.apach
> e.org/job/sling-contrib-commons-mom-jobs-it-services-1.8/ws/>
> Checking out a fresh workspace because there's no workspace at <https
> ://builds.apache.org/job/sling-contrib-commons-mom-jobs-it-services-
> 1.8/ws/>
> Cleaning local Directory .
> Checking out https://svn.apache.org/repos/asf/sling/trunk/contrib/com
> mons/mom/jobs/it-services at revision '2016-10-06T10:52:55.753 +0000'
> AU��������testlaunch.jsp
> A���������src
> A���������src/main
> A���������src/main/java
> A���������src/main/java/org
> A���������src/main/java/org/apache
> A���������src/main/java/org/apache/sling
> A���������src/main/java/org/apache/sling/jobs
> A���������src/main/java/org/apache/sling/jobs/it
> A���������src/main/java/org/apache/sling/jobs/it/services
> AU��������src/main/java/org/apache/sling/jobs/it/services/FullySyncJo
> b.java
> AU��������src/main/java/org/apache/sling/jobs/it/services/AsyncJobCon
> sumer.java
> AU��������src/main/java/org/apache/sling/jobs/it/services/JobManagerT
> estComponent.java
> AU��������pom.xml
> At revision 1763554
> 
> Parsing POMs
> Discovered a new module org.apache.sling:org.apache.sling.jobs-it-
> services Apache Sling Jobs Service Integration Tests Bundle
> Modules changed, recalculating dependency graph
> Established TCP socket on 38706
> maven32-agent.jar already up to date
> maven32-interceptor.jar already up to date
> maven3-interceptor-commons.jar already up to date
> [sling-contrib-commons-mom-jobs-it-services-1.8] $
> /home/jenkins/tools/java/latest1.8/bin/java -Xmx2g -Xms256m
> -XX:MaxPermSize=512m -cp /home/jenkins/jenkins-slave/maven32-
> agent.jar:/home/jenkins/tools/maven/apache-maven-3.3.9/boot/plexus-
> classworlds-2.5.2.jar:/home/jenkins/tools/maven/apache-maven-
> 3.3.9/conf/logging jenkins.maven3.agent.Maven32Main
> /home/jenkins/tools/maven/apache-maven-3.3.9 /home/jenkins/jenkins-
> slave/slave.jar /home/jenkins/jenkins-slave/maven32-interceptor.jar
> /home/jenkins/jenkins-slave/maven3-interceptor-commons.jar 38706
> Java HotSpot(TM) 64-Bit Server VM warning: ignoring option
> MaxPermSize=512m; support was removed in 8.0
> <===[JENKINS REMOTING CAPACITY]===>���channel started
> Executing Maven:��-B -f <https://builds.apache.org/job/sling-contrib-
> commons-mom-jobs-it-services-1.8/ws/pom.xml>
> -Dmaven.repo.local=/home/jenkins/jenkins-slave/maven-repositories/0
> -U clean verify
> [INFO] Scanning for projects...
> [INFO]���������������������������������������������������������������
> ����������
> [INFO] --------------------------------------------------------------
> ----------
> [INFO] Building Apache Sling Jobs Service Integration Tests Bundle
> 0.0.1-SNAPSHOT
> [INFO] --------------------------------------------------------------
> ----------
> [INFO] Downloading: http://repository.apache.org/snapshots/org/apache
> /sling/org.apache.sling.jobs/1.0.1-SNAPSHOT/maven-metadata.xml
> [INFO] Downloading: http://repository.apache.org/snapshots/org/apache
> /sling/org.apache.sling.jobs/1.0.1-SNAPSHOT/org.apache.sling.jobs-
> 1.0.1-SNAPSHOT.pom
> [WARNING] The POM for
> org.apache.sling:org.apache.sling.jobs:jar:1.0.1-SNAPSHOT is missing,
> no dependency information available
> [INFO] Downloading: http://repository.apache.org/snapshots/org/apache
> /sling/org.apache.sling.jobs/1.0.1-SNAPSHOT/org.apache.sling.jobs-
> 1.0.1-SNAPSHOT.jar
> [JENKINS] Archiving disabled
> [JENKINS] Archiving disabled
> [INFO] --------------------------------------------------------------
> ----------
> [INFO] BUILD FAILURE
> [INFO] --------------------------------------------------------------
> ----------
> [INFO] Total time: 4.998 s
> [INFO] Finished at: 2016-10-06T10:54:09+00:00
> [INFO] Final Memory: 15M/287M
> [INFO] --------------------------------------------------------------
> ----------
> Waiting for Jenkins to finish collecting data
> [ERROR] Failed to execute goal on project org.apache.sling.jobs-it-
> services: Could not resolve dependencies for project
> org.apache.sling:org.apache.sling.jobs-it-services:bundle:0.0.1-
> SNAPSHOT: Could not find artifact
> org.apache.sling:org.apache.sling.jobs:jar:1.0.1-SNAPSHOT in Nexus (h
> ttp://repository.apache.org/snapshots) -> [Help 1]
> [ERROR]�
> [ERROR] To see the full stack trace of the errors, re-run Maven with
> the -e switch.
> [ERROR] Re-run Maven using the -X switch to enable full debug
> logging.
> [ERROR]�
> [ERROR] For more information about the errors and possible solutions,
> please read the following articles:
> [ERROR] [Help 1] http://cwiki.apache.org/confluence/display/MAVEN/Dep
> endencyResolutionException
> channel stopped
> Recording test results
> 
				

Jenkins build is back to normal : sling-contrib-commons-mom-jobs-it-services-1.8 #2

Posted by Apache Jenkins Server <je...@builds.apache.org>.
See <https://builds.apache.org/job/sling-contrib-commons-mom-jobs-it-services-1.8/2/>