You are viewing a plain text version of this content. The canonical link for it is here.
Posted to builds@beam.apache.org by Apache Jenkins Server <je...@builds.apache.org> on 2022/02/03 00:08:46 UTC
Build failed in Jenkins: beam_PostCommit_Java_Examples_Dataflow_V2_java17 #190
See <https://ci-beam.apache.org/job/beam_PostCommit_Java_Examples_Dataflow_V2_java17/190/display/redirect?page=changes>
Changes:
[Robert Bradshaw] Make num-stages counter into an internal counter.
[Kenneth Knowles] [BEAM-13768] Fix NullPointerException in BigQueryStorageSourceBase
[noreply] [BEAM-13574] Large Wordcount (#16455)
[Robert Bradshaw] Avoid packaging avro in the java harness jar.
[noreply] [BEAM-13293] Refactor JDBC IO Go Wrapper (#16686)
[noreply] Edit license script for Java, add manual licenses for xz (#16692)
[mmack] [BEAM-13563] Restructure Kinesis Source for Aws 2 internally to prepare
[noreply] [BEAM-4665] Allow joining a running dataflow pipeline without throwing
[noreply] [BEAM-13801] Add standard coder tests for state backed iterable.
[noreply] [BEAM-13430] Fix provided configuration by removing extendsFrom for
[noreply] [BEAM-12830] Print clearer go version fail message (#16693)
[Jan Lukavský] Add reference to Books to Learning Resources in website
[noreply] Use ThreadLocal for DESERIALIZATION_CONTEXT (#16680)
[noreply] Minor: Add apt update after adding deadsnakes repository in dev env
[noreply] [BEAM-13807] Regenerate container images to get TF 2.8.0 (#16707)
------------------------------------------
[...truncated 31.16 KB...]
> Task :runners:local-java:jar
> Task :sdks:java:fn-execution:compileJava
Note: Some input files use or override a deprecated API.
Note: Recompile with -Xlint:deprecation for details.
Note: Some input files use unchecked or unsafe operations.
Note: Recompile with -Xlint:unchecked for details.
> Task :sdks:java:fn-execution:classes
> Task :sdks:java:fn-execution:jar
> Task :sdks:java:extensions:protobuf:compileJava
Note: Some input files use or override a deprecated API.
Note: Recompile with -Xlint:deprecation for details.
Note: Some input files use unchecked or unsafe operations.
Note: Recompile with -Xlint:unchecked for details.
> Task :sdks:java:extensions:protobuf:classes
> Task :sdks:java:extensions:protobuf:jar
> Task :runners:core-construction-java:compileJava
Note: Some input files use or override a deprecated API.
Note: Recompile with -Xlint:deprecation for details.
Note: Some input files use unchecked or unsafe operations.
Note: Recompile with -Xlint:unchecked for details.
> Task :runners:core-construction-java:classes
> Task :runners:core-construction-java:jar
> Task :runners:core-java:compileJava
Note: Some input files use or override a deprecated API.
Note: Recompile with -Xlint:deprecation for details.
Note: Some input files use unchecked or unsafe operations.
Note: Recompile with -Xlint:unchecked for details.
> Task :runners:core-java:classes
> Task :runners:core-java:jar
> Task :sdks:java:extensions:google-cloud-platform-core:compileJava
Note: Some input files use or override a deprecated API.
Note: Recompile with -Xlint:deprecation for details.
> Task :sdks:java:extensions:google-cloud-platform-core:classes
> Task :sdks:java:extensions:google-cloud-platform-core:jar
> Task :sdks:java:harness:compileJava
Note: Some input files use or override a deprecated API.
Note: Recompile with -Xlint:deprecation for details.
Note: Some input files use unchecked or unsafe operations.
Note: Recompile with -Xlint:unchecked for details.
> Task :sdks:java:harness:classes
> Task :sdks:java:harness:jar
> Task :runners:java-fn-execution:compileJava
Note: Some input files use or override a deprecated API.
Note: Recompile with -Xlint:deprecation for details.
Note: Some input files use unchecked or unsafe operations.
Note: Recompile with -Xlint:unchecked for details.
> Task :runners:java-fn-execution:classes
> Task :runners:java-fn-execution:jar
> Task :sdks:java:expansion-service:compileJava
Note: Some input files use unchecked or unsafe operations.
Note: Recompile with -Xlint:unchecked for details.
> Task :sdks:java:expansion-service:classes
> Task :sdks:java:expansion-service:jar
> Task :sdks:java:harness:shadowJar
> Task :sdks:java:extensions:ml:compileJava
> Task :sdks:java:extensions:ml:classes
> Task :sdks:java:extensions:ml:jar
> Task :runners:direct-java:compileJava
Note: Some input files use or override a deprecated API.
Note: Recompile with -Xlint:deprecation for details.
Note: Some input files use unchecked or unsafe operations.
Note: Recompile with -Xlint:unchecked for details.
> Task :runners:direct-java:classes
> Task :runners:direct-java:shadowJar
> Task :sdks:java:io:kafka:compileJava
Note: Some input files use or override a deprecated API.
Note: Recompile with -Xlint:deprecation for details.
Note: Some input files use unchecked or unsafe operations.
Note: Recompile with -Xlint:unchecked for details.
> Task :sdks:java:io:kafka:classes
> Task :sdks:java:io:kafka:jar
> Task :sdks:java:container:java17:copyDockerfileDependencies
> Task :sdks:java:io:google-cloud-platform:compileJava
> Task :sdks:java:container:java17:dockerPrepare
> Task :sdks:java:container:java17:docker
> Task :sdks:java:io:google-cloud-platform:compileJava
Note: Some input files use or override a deprecated API.
Note: Recompile with -Xlint:deprecation for details.
Note: Some input files use unchecked or unsafe operations.
Note: Recompile with -Xlint:unchecked for details.
> Task :sdks:java:io:google-cloud-platform:classes
> Task :sdks:java:container:java17:docker
Removing intermediate container 72dec4ce80cb
---> 7ef0429d3dc8
Step 17/19 : RUN if [ "${pull_licenses}" = "false" ] ; then rm -rf /opt/apache/beam/third_party_licenses ; fi
---> Running in 29214609003e
> Task :sdks:java:io:google-cloud-platform:jar
> Task :sdks:java:container:java17:docker
Removing intermediate container 29214609003e
---> 1cb967a957bb
Step 18/19 : COPY target/profiler/* /opt/google_cloud_profiler/
---> 31db4b76bb57
Step 19/19 : ENTRYPOINT ["/opt/apache/beam/boot"]
---> Running in cdea18fdb761
Removing intermediate container cdea18fdb761
---> 275150277bc5
Successfully built 275150277bc5
Successfully tagged apache/beam_java17_sdk:2.37.0.dev
> Task :runners:google-cloud-dataflow-java:compileJava
Note: Some input files use or override a deprecated API.
Note: Recompile with -Xlint:deprecation for details.
Note: Some input files use unchecked or unsafe operations.
Note: Recompile with -Xlint:unchecked for details.
> Task :examples:java:compileJava
Note: Some input files use or override a deprecated API.
Note: Recompile with -Xlint:deprecation for details.
Note: Some input files use unchecked or unsafe operations.
Note: Recompile with -Xlint:unchecked for details.
> Task :examples:java:classes
> Task :examples:java:jar
> Task :runners:google-cloud-dataflow-java:buildAndPushDockerJavaContainer
WARNING: `gcloud docker` will not be supported for Docker client versions above 18.03.
As an alternative, use `gcloud auth configure-docker` to configure `docker` to
use `gcloud` as a credential helper, then use `docker` as you would for non-GCR
registries, e.g. `docker pull gcr.io/project-id/my-image`. Add
`--verbosity=error` to silence this warning: `gcloud docker
--verbosity=error -- pull gcr.io/project-id/my-image`.
See: https://cloud.google.com/container-registry/docs/support/deprecation-notices#gcloud-docker
> Task :examples:java:compileTestJava FAILED
Exception in thread "main" java.lang.IllegalAccessError: class com.google.errorprone.BaseErrorProneJavaCompiler (in unnamed module @0x501edcf1) cannot access class com.sun.tools.javac.api.BasicJavacTask (in module jdk.compiler) because module jdk.compiler does not export com.sun.tools.javac.api to unnamed module @0x501edcf1
at com.google.errorprone.BaseErrorProneJavaCompiler.addTaskListener(BaseErrorProneJavaCompiler.java:94)
at com.google.errorprone.ErrorProneJavacPlugin.init(ErrorProneJavacPlugin.java:34)
at jdk.compiler/com.sun.tools.javac.api.BasicJavacTask.initPlugin(BasicJavacTask.java:255)
at jdk.compiler/com.sun.tools.javac.api.BasicJavacTask.initPlugins(BasicJavacTask.java:229)
at jdk.compiler/com.sun.tools.javac.main.Main.compile(Main.java:292)
at jdk.compiler/com.sun.tools.javac.main.Main.compile(Main.java:176)
at jdk.compiler/com.sun.tools.javac.Main.compile(Main.java:64)
at jdk.compiler/com.sun.tools.javac.Main.main(Main.java:50)
> Task :runners:google-cloud-dataflow-java:buildAndPushDockerJavaContainer
The push refers to repository [us.gcr.io/apache-beam-testing/java-postcommit-it/java]
8610a2536258: Preparing
53e864bbde74: Preparing
6f3c0df23bd6: Preparing
e4f63fa37166: Preparing
acc931bd2b59: Preparing
b920bde1274f: Preparing
0512114e7e28: Preparing
292318760d42: Preparing
18f75f6c82c8: Preparing
142afa387b96: Preparing
d153ce7b2c46: Preparing
47fd5a1c7fb3: Preparing
a3dd341ed2eb: Preparing
5331ce361341: Preparing
babf5ef2e3ab: Preparing
613ab28cf833: Preparing
bed676ceab7a: Preparing
6398d5cccd2c: Preparing
0b0f2f2f5279: Preparing
47fd5a1c7fb3: Waiting
a3dd341ed2eb: Waiting
b920bde1274f: Waiting
5331ce361341: Waiting
babf5ef2e3ab: Waiting
613ab28cf833: Waiting
0512114e7e28: Waiting
bed676ceab7a: Waiting
6398d5cccd2c: Waiting
292318760d42: Waiting
0b0f2f2f5279: Waiting
18f75f6c82c8: Waiting
53e864bbde74: Pushed
acc931bd2b59: Pushed
e4f63fa37166: Pushed
6f3c0df23bd6: Pushed
8610a2536258: Pushed
142afa387b96: Pushed
292318760d42: Pushed
b920bde1274f: Pushed
18f75f6c82c8: Pushed
5331ce361341: Layer already exists
babf5ef2e3ab: Layer already exists
613ab28cf833: Layer already exists
bed676ceab7a: Layer already exists
6398d5cccd2c: Layer already exists
0b0f2f2f5279: Layer already exists
0512114e7e28: Pushed
a3dd341ed2eb: Pushed
47fd5a1c7fb3: Pushed
d153ce7b2c46: Pushed
20220203000145: digest: sha256:fdcd07fb2c02c2375ce35af7f41c7143095d2e499bf9b932bb227d5345854a72 size: 4314
> Task :runners:google-cloud-dataflow-java:classes
> Task :runners:google-cloud-dataflow-java:jar
FAILURE: Build failed with an exception.
* What went wrong:
Execution failed for task ':examples:java:compileTestJava'.
> Compilation failed with exit code 1; see the compiler error output for details.
* Try:
> Run with --stacktrace option to get the stack trace.
> Run with --info or --debug option to get more log output.
> Run with --scan to get full insights.
* Get more help at https://help.gradle.org
Deprecated Gradle features were used in this build, making it incompatible with Gradle 8.0.
You can use '--warning-mode all' to show the individual deprecation warnings and determine if they come from your own scripts or plugins.
See https://docs.gradle.org/7.3.2/userguide/command_line_interface.html#sec:command_line_warnings
Execution optimizations have been disabled for 1 invalid unit(s) of work during this build to ensure correctness.
Please consult deprecation warnings for more details.
BUILD FAILED in 7m 48s
85 actionable tasks: 74 executed, 9 from cache, 2 up-to-date
Publishing build scan...
https://gradle.com/s/txbytgsxulljy
Build step 'Invoke Gradle script' changed build result to FAILURE
Build step 'Invoke Gradle script' marked build as failure
---------------------------------------------------------------------
To unsubscribe, e-mail: builds-unsubscribe@beam.apache.org
For additional commands, e-mail: builds-help@beam.apache.org
Jenkins build is back to normal : beam_PostCommit_Java_Examples_Dataflow_V2_java17 #193
Posted by Apache Jenkins Server <je...@builds.apache.org>.
See <https://ci-beam.apache.org/job/beam_PostCommit_Java_Examples_Dataflow_V2_java17/193/display/redirect?page=changes>
---------------------------------------------------------------------
To unsubscribe, e-mail: builds-unsubscribe@beam.apache.org
For additional commands, e-mail: builds-help@beam.apache.org
Build failed in Jenkins: beam_PostCommit_Java_Examples_Dataflow_V2_java17 #192
Posted by Apache Jenkins Server <je...@builds.apache.org>.
See <https://ci-beam.apache.org/job/beam_PostCommit_Java_Examples_Dataflow_V2_java17/192/display/redirect?page=changes>
Changes:
[Kiley Sok] Allow Java 17 to be used in SDK
[Kiley Sok] add testing support
[Kiley Sok] Add more testing support for java 17
[Kiley Sok] workaround for jamm
[Kiley Sok] Add Jenkins test for Java 17
[Kiley Sok] Fix jvm hex and skip errorprone
[Kiley Sok] Fix display data for anonymous classes
[Kiley Sok] fix jpms tests
[Kiley Sok] skip zetasql
[Kiley Sok] spotless
[Kiley Sok] spotless
[Kiley Sok] Fix trigger
[Kiley Sok] skip checker framework
[Kiley Sok] fix app name
[Kiley Sok] remove duplicate property check
[Heejong Lee] [BEAM-13813] Add support for URL artifact to extractStagingToPath
[avilovpavel6] Remove Python SQL Test example from catalog
[noreply] [BEAM-13024] Unify PipelineOptions behavior (#16719)
[noreply] Update sdks/go/pkg/beam/artifact/materialize_test.go
[noreply] Merge pull request #16605 from [BEAM-13634][Playground] Create a
[noreply] Merge pull request #16593 from [BEAM-13725][Playground] Add graph to the
[noreply] Merge pull request #16699 from [BEAM-13789][Playground] Change logic of
------------------------------------------
[...truncated 33.24 KB...]
> Task :runners:core-construction-java:compileJava
Note: Some input files use or override a deprecated API.
Note: Recompile with -Xlint:deprecation for details.
Note: Some input files use unchecked or unsafe operations.
Note: Recompile with -Xlint:unchecked for details.
> Task :runners:core-construction-java:classes
> Task :runners:core-construction-java:jar
> Task :runners:core-java:compileJava
Note: Some input files use or override a deprecated API.
Note: Recompile with -Xlint:deprecation for details.
Note: Some input files use unchecked or unsafe operations.
Note: Recompile with -Xlint:unchecked for details.
> Task :runners:core-java:classes
> Task :runners:core-java:jar
> Task :sdks:java:extensions:google-cloud-platform-core:compileJava FROM-CACHE
> Task :sdks:java:extensions:google-cloud-platform-core:classes UP-TO-DATE
> Task :sdks:java:extensions:google-cloud-platform-core:jar
> Task :release:go-licenses:java:createLicenses
> Task :sdks:java:container:java17:copyGolangLicenses
> Task :sdks:java:harness:compileJava
Note: Some input files use or override a deprecated API.
Note: Recompile with -Xlint:deprecation for details.
Note: Some input files use unchecked or unsafe operations.
Note: Recompile with -Xlint:unchecked for details.
> Task :sdks:java:harness:classes
> Task :sdks:java:harness:jar
> Task :runners:java-fn-execution:compileJava
Note: Some input files use or override a deprecated API.
Note: Recompile with -Xlint:deprecation for details.
Note: Some input files use unchecked or unsafe operations.
Note: Recompile with -Xlint:unchecked for details.
> Task :runners:java-fn-execution:classes
> Task :runners:java-fn-execution:jar
> Task :sdks:java:expansion-service:compileJava FROM-CACHE
> Task :sdks:java:expansion-service:classes UP-TO-DATE
> Task :sdks:java:expansion-service:jar
> Task :sdks:java:io:kafka:compileJava
Note: Some input files use or override a deprecated API.
Note: Recompile with -Xlint:deprecation for details.
Note: Some input files use unchecked or unsafe operations.
Note: Recompile with -Xlint:unchecked for details.
> Task :sdks:java:io:kafka:classes
> Task :runners:direct-java:compileJava
Note: Some input files use or override a deprecated API.
Note: Recompile with -Xlint:deprecation for details.
Note: Some input files use unchecked or unsafe operations.
Note: Recompile with -Xlint:unchecked for details.
> Task :sdks:java:io:kafka:jar
> Task :runners:direct-java:classes
> Task :runners:direct-java:shadowJar
> Task :sdks:java:harness:shadowJar
> Task :sdks:java:container:java17:copyDockerfileDependencies
> Task :sdks:java:container:java17:dockerPrepare
> Task :sdks:java:extensions:ml:compileJava
> Task :sdks:java:extensions:ml:classes
> Task :sdks:java:extensions:ml:jar
> Task :sdks:java:io:google-cloud-platform:compileJava
Note: Some input files use or override a deprecated API.
Note: Recompile with -Xlint:deprecation for details.
Note: Some input files use unchecked or unsafe operations.
Note: Recompile with -Xlint:unchecked for details.
> Task :sdks:java:container:java17:docker
Sending build context to Docker daemon 167.5MB
Step 1/19 : ARG java_version
Step 2/19 : FROM openjdk:${java_version}-bullseye
17-bullseye: Pulling from library/openjdk
Digest: sha256:0dbcc3f0875b621c2873fed33727a4eb84551f49ea1969939decf166e4bc3ec9
Status: Downloaded newer image for openjdk:17-bullseye
---> c99376f89d3d
Step 3/19 : MAINTAINER "Apache Beam <de...@beam.apache.org>"
---> Running in 37bf8495ca20
Removing intermediate container 37bf8495ca20
---> c52b06024120
Step 4/19 : ARG pull_licenses
---> Running in 2d4b8f3ca479
Removing intermediate container 2d4b8f3ca479
---> fa009a3bb6a5
Step 5/19 : ADD target/slf4j-api.jar /opt/apache/beam/jars/
---> 576b1e835b01
Step 6/19 : ADD target/slf4j-jdk14.jar /opt/apache/beam/jars/
---> 9d011403e36e
Step 7/19 : ADD target/beam-sdks-java-harness.jar /opt/apache/beam/jars/
---> 6693d6fd7c35
Step 8/19 : ADD target/beam-sdks-java-io-kafka.jar /opt/apache/beam/jars/
---> c258f06185a5
Step 9/19 : ADD target/kafka-clients.jar /opt/apache/beam/jars/
---> 2596753c01d7
Step 10/19 : ADD target/jamm.jar /opt/apache/beam/jars/
---> 64cf4be00cee
Step 11/19 : ADD target/linux_amd64/boot /opt/apache/beam/
> Task :sdks:java:io:google-cloud-platform:classes
> Task :sdks:java:io:google-cloud-platform:jar
> Task :examples:java:compileJava
Note: Some input files use or override a deprecated API.
Note: Recompile with -Xlint:deprecation for details.
Note: Some input files use unchecked or unsafe operations.
Note: Recompile with -Xlint:unchecked for details.
> Task :examples:java:classes
> Task :runners:google-cloud-dataflow-java:compileJava
Note: Some input files use or override a deprecated API.
Note: Recompile with -Xlint:deprecation for details.
Note: Some input files use unchecked or unsafe operations.
Note: Recompile with -Xlint:unchecked for details.
> Task :runners:google-cloud-dataflow-java:classes
> Task :examples:java:jar
> Task :runners:google-cloud-dataflow-java:jar
> Task :examples:java:compileTestJava
Note: Some input files use or override a deprecated API.
Note: Recompile with -Xlint:deprecation for details.
Note: Some input files use unchecked or unsafe operations.
Note: Recompile with -Xlint:unchecked for details.
> Task :examples:java:testClasses
> Task :examples:java:testJar
> Task :sdks:java:container:java17:docker
---> 18e4b11ce3f9
Step 12/19 : COPY target/LICENSE /opt/apache/beam/
---> 2c5e10807723
Step 13/19 : COPY target/NOTICE /opt/apache/beam/
---> 13d8e91d682a
Step 14/19 : ADD target/third_party_licenses /opt/apache/beam/third_party_licenses/
---> 3b9a736e4a4b
Step 15/19 : COPY target/LICENSE target/go-licenses/* /opt/apache/beam/third_party_licenses/golang/
---> 8d893b142d9e
Step 16/19 : RUN rm /opt/apache/beam/third_party_licenses/golang/LICENSE
---> Running in d0a1a855b027
Removing intermediate container d0a1a855b027
---> 152e78130960
Step 17/19 : RUN if [ "${pull_licenses}" = "false" ] ; then rm -rf /opt/apache/beam/third_party_licenses ; fi
---> Running in 35a80820313d
Removing intermediate container 35a80820313d
---> c899c28650cf
Step 18/19 : COPY target/profiler/* /opt/google_cloud_profiler/
---> ee7b360ad9d1
Step 19/19 : ENTRYPOINT ["/opt/apache/beam/boot"]
---> Running in 67d7e32b6524
Removing intermediate container 67d7e32b6524
---> 70da81d9e2dd
Successfully built 70da81d9e2dd
Successfully tagged apache/beam_java17_sdk:2.37.0.dev
> Task :runners:google-cloud-dataflow-java:buildAndPushDockerJavaContainer
WARNING: `gcloud docker` will not be supported for Docker client versions above 18.03.
As an alternative, use `gcloud auth configure-docker` to configure `docker` to
use `gcloud` as a credential helper, then use `docker` as you would for non-GCR
registries, e.g. `docker pull gcr.io/project-id/my-image`. Add
`--verbosity=error` to silence this warning: `gcloud docker
--verbosity=error -- pull gcr.io/project-id/my-image`.
See: https://cloud.google.com/container-registry/docs/support/deprecation-notices#gcloud-docker
The push refers to repository [us.gcr.io/apache-beam-testing/java-postcommit-it/java]
97568aaa9a68: Preparing
f4b074592909: Preparing
a453f1b873a4: Preparing
77b2c1c5d312: Preparing
876cb3cd76dc: Preparing
9cf2ec34a13f: Preparing
b3acd47f8ae6: Preparing
3dc96c5f8766: Preparing
79c39463a968: Preparing
a30a89009cc7: Preparing
f681312b7fcc: Preparing
5df89041a9bc: Preparing
cf7863eb22bb: Preparing
5331ce361341: Preparing
babf5ef2e3ab: Preparing
613ab28cf833: Preparing
bed676ceab7a: Preparing
6398d5cccd2c: Preparing
0b0f2f2f5279: Preparing
f681312b7fcc: Waiting
5df89041a9bc: Waiting
cf7863eb22bb: Waiting
5331ce361341: Waiting
babf5ef2e3ab: Waiting
613ab28cf833: Waiting
bed676ceab7a: Waiting
6398d5cccd2c: Waiting
9cf2ec34a13f: Waiting
3dc96c5f8766: Waiting
79c39463a968: Waiting
b3acd47f8ae6: Waiting
0b0f2f2f5279: Waiting
a30a89009cc7: Waiting
f4b074592909: Pushed
a453f1b873a4: Pushed
876cb3cd76dc: Retrying in 5 seconds
876cb3cd76dc: Retrying in 4 seconds
876cb3cd76dc: Retrying in 3 seconds
876cb3cd76dc: Retrying in 2 seconds
876cb3cd76dc: Retrying in 1 second
error parsing HTTP 408 response body: invalid character '<' looking for beginning of value: "<!DOCTYPE html>\n<html lang=en>\n <meta charset=utf-8>\n <meta name=viewport content=\"initial-scale=1, minimum-scale=1, width=device-width\">\n <title>Error 408 (Request Timeout)!!1</title>\n <style>\n *{margin:0;padding:0}html,code{font:15px/22px arial,sans-serif}html{background:#fff;color:#222;padding:15px}body{margin:7% auto 0;max-width:390px;min-height:180px;padding:30px 0 15px}* > body{background:url(//www.google.com/images/errors/robot.png) 100% 5px no-repeat;padding-right:205px}p{margin:11px 0 22px;overflow:hidden}ins{color:#777;text-decoration:none}a img{border:0}@media screen and (max-width:772px){body{background:none;margin-top:0;max-width:none;padding-right:0}}#logo{background:url(//www.google.com/images/branding/googlelogo/1x/googlelogo_color_150x54dp.png) no-repeat;margin-left:-5px}@media only screen and (min-resolution:192dpi){#logo{background:url(//www.google.com/images/branding/googlelogo/2x/googlelogo_color_150x54dp.png) no-repeat 0% 0%/100% 100%;-moz-border-image:url(//www.google.com/images/branding/googlelogo/2x/googlelogo_color_150x54dp.png) 0}}@media only screen and (-webkit-min-device-pixel-ratio:2){#logo{background:url(//www.google.com/images/branding/googlelogo/2x/googlelogo_color_150x54dp.png) no-repeat;-webkit-background-size:100% 100%}}#logo{display:inline-block;height:54px;width:150px}\n </style>\n <a href=//www.google.com/><span id=logo aria-label=Google></span></a>\n <p><b>408.</b> <ins>That’s an error.</ins>\n <p>Your client has taken too long to issue its request. <ins>That’s all we know.</ins>\n"
> Task :runners:google-cloud-dataflow-java:buildAndPushDockerJavaContainer FAILED
FAILURE: Build failed with an exception.
* Where:
Build file '<https://ci-beam.apache.org/job/beam_PostCommit_Java_Examples_Dataflow_V2_java17/ws/src/runners/google-cloud-dataflow-java/build.gradle'> line: 282
* What went wrong:
Execution failed for task ':runners:google-cloud-dataflow-java:buildAndPushDockerJavaContainer'.
> Process 'command 'gcloud'' finished with non-zero exit value 1
* Try:
> Run with --stacktrace option to get the stack trace.
> Run with --info or --debug option to get more log output.
> Run with --scan to get full insights.
* Get more help at https://help.gradle.org
Deprecated Gradle features were used in this build, making it incompatible with Gradle 8.0.
You can use '--warning-mode all' to show the individual deprecation warnings and determine if they come from your own scripts or plugins.
See https://docs.gradle.org/7.3.2/userguide/command_line_interface.html#sec:command_line_warnings
Execution optimizations have been disabled for 1 invalid unit(s) of work during this build to ensure correctness.
Please consult deprecation warnings for more details.
BUILD FAILED in 11m 18s
86 actionable tasks: 73 executed, 11 from cache, 2 up-to-date
Publishing build scan...
https://gradle.com/s/fzoibxtvy73au
Build step 'Invoke Gradle script' changed build result to FAILURE
Build step 'Invoke Gradle script' marked build as failure
---------------------------------------------------------------------
To unsubscribe, e-mail: builds-unsubscribe@beam.apache.org
For additional commands, e-mail: builds-help@beam.apache.org
Build failed in Jenkins: beam_PostCommit_Java_Examples_Dataflow_V2_java17 #191
Posted by Apache Jenkins Server <je...@builds.apache.org>.
See <https://ci-beam.apache.org/job/beam_PostCommit_Java_Examples_Dataflow_V2_java17/191/display/redirect?page=changes>
Changes:
[aydar.zaynutdinov] [BEAM-13737][Playground]
[noreply] [BEAM-13399, BEAM-13683] Eagerly materialize artifacts for automated
[noreply] Merge pull request #16617 from [BEAM-13743] [Playground] Add context
[noreply] Merge pull request #16618 from [BEAM-13744] [Playground] Add context
[noreply] Merge pull request #16698 from [BEAM-13802][Playground] [Bugfix] Clean
[noreply] [BEAM-13293][BEAM-13806] Pipe a SchemaIO flag through Go integration
[noreply] [BEAM-13605] Modify groupby.apply implementation in preparation for
[noreply] Merge pull request #16436 from [BEAM-1330] - DatastoreIO Writes should
[relax] Fix timer consistency in direct runner
[noreply] [BEAM-13757] adds pane observation in DoFn (#16629)
[Jan Lukavský] Change links to Books from Amazon to Publisher
[noreply] [BEAM-13605] Add support for pandas 1.4.0 (#16590)
[noreply] [BEAM-13761] adds Debezium IO wrapper for Go SDK (#16642)
------------------------------------------
[...truncated 15.77 KB...]
> Task :model:pipeline:generateProto FROM-CACHE
> Task :model:pipeline:compileJava FROM-CACHE
> Task :model:pipeline:processResources
> Task :model:pipeline:classes
> Task :model:pipeline:jar
> Task :model:pipeline:shadowJar FROM-CACHE
> Task :model:job-management:extractIncludeProto
> Task :model:fn-execution:extractIncludeProto
> Task :model:job-management:generateProto FROM-CACHE
> Task :model:fn-execution:generateProto FROM-CACHE
> Task :model:job-management:compileJava FROM-CACHE
> Task :model:job-management:classes
> Task :model:fn-execution:compileJava FROM-CACHE
> Task :model:fn-execution:classes
> Task :model:job-management:shadowJar FROM-CACHE
> Task :model:fn-execution:shadowJar FROM-CACHE
> Task :sdks:java:container:goBuild
> Task :sdks:java:container:java17:copySdkHarnessLauncher
Execution optimizations have been disabled for task ':sdks:java:container:java17:copySdkHarnessLauncher' to ensure correctness due to the following reasons:
- Gradle detected a problem with the following location: '<https://ci-beam.apache.org/job/beam_PostCommit_Java_Examples_Dataflow_V2_java17/ws/src/sdks/java/container/build/target'.> Reason: Task ':sdks:java:container:java17:copySdkHarnessLauncher' uses this output of task ':sdks:java:container:downloadCloudProfilerAgent' without declaring an explicit or implicit dependency. This can lead to incorrect results being produced, depending on what order the tasks are executed. Please refer to https://docs.gradle.org/7.3.2/userguide/validation_problems.html#implicit_dependency for more details about this problem.
> Task :release:go-licenses:java:docker
> Task :sdks:java:container:generateLicenseReport
> Task :sdks:java:core:compileJava FROM-CACHE
> Task :sdks:java:core:classes
> Task :sdks:java:core:shadowJar FROM-CACHE
> Task :sdks:java:extensions:arrow:compileJava FROM-CACHE
> Task :sdks:java:extensions:arrow:classes UP-TO-DATE
> Task :release:go-licenses:java:dockerRun
+ rm -rf '/output/*'
+ export GO111MODULE=off
+ GO111MODULE=off
+ go get github.com/apache/beam/sdks/java/container
> Task :sdks:java:extensions:arrow:jar
> Task :sdks:java:fn-execution:compileJava FROM-CACHE
> Task :sdks:java:fn-execution:classes UP-TO-DATE
> Task :sdks:java:fn-execution:jar
> Task :sdks:java:extensions:protobuf:extractIncludeProto
> Task :sdks:java:extensions:protobuf:generateProto NO-SOURCE
> Task :sdks:java:extensions:protobuf:compileJava FROM-CACHE
> Task :sdks:java:extensions:protobuf:classes UP-TO-DATE
> Task :sdks:java:extensions:protobuf:jar
> Task :runners:core-construction-java:compileJava FROM-CACHE
> Task :runners:core-construction-java:classes UP-TO-DATE
> Task :runners:core-construction-java:jar
> Task :runners:local-java:compileJava
> Task :runners:local-java:classes
> Task :runners:local-java:jar
> Task :sdks:java:container:pullLicenses
INFO:root:Pulling license for 217 dependencies using 16 threads.
> Task :runners:core-java:compileJava
Note: Some input files use or override a deprecated API.
Note: Recompile with -Xlint:deprecation for details.
Note: Some input files use unchecked or unsafe operations.
Note: Recompile with -Xlint:unchecked for details.
> Task :runners:core-java:classes
> Task :runners:core-java:jar
> Task :sdks:java:container:pullLicenses
INFO:root:Replaced local file URL with file://<https://ci-beam.apache.org/job/beam_PostCommit_Java_Examples_Dataflow_V2_java17/ws/src/sdks/java/container/license_scripts/manual_licenses/xz/COPYING> for xz-1.5
> Task :sdks:java:extensions:google-cloud-platform-core:compileJava
Note: Some input files use or override a deprecated API.
Note: Recompile with -Xlint:deprecation for details.
> Task :sdks:java:extensions:google-cloud-platform-core:classes
> Task :sdks:java:extensions:google-cloud-platform-core:jar
> Task :sdks:java:harness:compileJava
Note: Some input files use or override a deprecated API.
Note: Recompile with -Xlint:deprecation for details.
Note: Some input files use unchecked or unsafe operations.
Note: Recompile with -Xlint:unchecked for details.
> Task :sdks:java:harness:classes
> Task :sdks:java:harness:jar
> Task :runners:java-fn-execution:compileJava
Note: Some input files use or override a deprecated API.
Note: Recompile with -Xlint:deprecation for details.
Note: Some input files use unchecked or unsafe operations.
Note: Recompile with -Xlint:unchecked for details.
> Task :runners:java-fn-execution:classes
> Task :runners:java-fn-execution:jar
> Task :sdks:java:expansion-service:compileJava FROM-CACHE
> Task :sdks:java:expansion-service:classes UP-TO-DATE
> Task :sdks:java:expansion-service:jar
> Task :sdks:java:extensions:ml:compileJava FROM-CACHE
> Task :sdks:java:extensions:ml:classes UP-TO-DATE
> Task :sdks:java:extensions:ml:jar
> Task :sdks:java:io:kafka:compileJava FROM-CACHE
> Task :sdks:java:io:kafka:classes UP-TO-DATE
> Task :sdks:java:io:kafka:jar
> Task :sdks:java:container:pullLicenses
INFO:root:pull_licenses_java.py succeed. It took 24.690019 seconds with 16 threads.
> Task :sdks:java:container:java17:copyJavaThirdPartyLicenses
> Task :runners:direct-java:compileJava
Note: Some input files use or override a deprecated API.
Note: Recompile with -Xlint:deprecation for details.
Note: Some input files use unchecked or unsafe operations.
Note: Recompile with -Xlint:unchecked for details.
> Task :runners:direct-java:classes
> Task :runners:direct-java:shadowJar
> Task :sdks:java:harness:shadowJar
> Task :sdks:java:container:java17:copyDockerfileDependencies
> Task :sdks:java:io:google-cloud-platform:compileJava
Note: Some input files use or override a deprecated API.
Note: Recompile with -Xlint:deprecation for details.
Note: Some input files use unchecked or unsafe operations.
Note: Recompile with -Xlint:unchecked for details.
> Task :sdks:java:io:google-cloud-platform:classes
> Task :sdks:java:io:google-cloud-platform:jar
> Task :runners:google-cloud-dataflow-java:compileJava FROM-CACHE
> Task :runners:google-cloud-dataflow-java:classes
> Task :examples:java:compileJava FROM-CACHE
> Task :examples:java:classes UP-TO-DATE
> Task :runners:google-cloud-dataflow-java:jar
> Task :examples:java:jar
> Task :examples:java:compileTestJava FAILED
Exception in thread "main" java.lang.IllegalAccessError: class com.google.errorprone.BaseErrorProneJavaCompiler (in unnamed module @0x501edcf1) cannot access class com.sun.tools.javac.api.BasicJavacTask (in module jdk.compiler) because module jdk.compiler does not export com.sun.tools.javac.api to unnamed module @0x501edcf1
at com.google.errorprone.BaseErrorProneJavaCompiler.addTaskListener(BaseErrorProneJavaCompiler.java:94)
at com.google.errorprone.ErrorProneJavacPlugin.init(ErrorProneJavacPlugin.java:34)
at jdk.compiler/com.sun.tools.javac.api.BasicJavacTask.initPlugin(BasicJavacTask.java:255)
at jdk.compiler/com.sun.tools.javac.api.BasicJavacTask.initPlugins(BasicJavacTask.java:229)
at jdk.compiler/com.sun.tools.javac.main.Main.compile(Main.java:292)
at jdk.compiler/com.sun.tools.javac.main.Main.compile(Main.java:176)
at jdk.compiler/com.sun.tools.javac.Main.compile(Main.java:64)
at jdk.compiler/com.sun.tools.javac.Main.main(Main.java:50)
> Task :release:go-licenses:java:dockerRun
+ go-licenses save github.com/apache/beam/sdks/java/container --save_path=/output/licenses
+ go-licenses csv github.com/apache/beam/sdks/java/container
+ tee /output/licenses/list.csv
+ chmod -R a+w /output/licenses
> Task :release:go-licenses:java:createLicenses
> Task :sdks:java:container:java17:copyGolangLicenses
> Task :sdks:java:container:java17:dockerPrepare
> Task :sdks:java:container:java17:docker
> Task :runners:google-cloud-dataflow-java:buildAndPushDockerJavaContainer
WARNING: `gcloud docker` will not be supported for Docker client versions above 18.03.
As an alternative, use `gcloud auth configure-docker` to configure `docker` to
use `gcloud` as a credential helper, then use `docker` as you would for non-GCR
registries, e.g. `docker pull gcr.io/project-id/my-image`. Add
`--verbosity=error` to silence this warning: `gcloud docker
--verbosity=error -- pull gcr.io/project-id/my-image`.
See: https://cloud.google.com/container-registry/docs/support/deprecation-notices#gcloud-docker
The push refers to repository [us.gcr.io/apache-beam-testing/java-postcommit-it/java]
17dfad6d5620: Preparing
a0e6fb76d26b: Preparing
30ed8014c04a: Preparing
f02ebcaa1002: Preparing
2e399c26ca0a: Preparing
c72204a62d1b: Preparing
f3574f4db080: Preparing
6c7a51015a6d: Preparing
0997bf9121c4: Preparing
997ad09af523: Preparing
391c09afbb47: Preparing
b32134902759: Preparing
df92b7394583: Preparing
5331ce361341: Preparing
babf5ef2e3ab: Preparing
613ab28cf833: Preparing
bed676ceab7a: Preparing
6398d5cccd2c: Preparing
0b0f2f2f5279: Preparing
f3574f4db080: Waiting
c72204a62d1b: Waiting
5331ce361341: Waiting
6398d5cccd2c: Waiting
babf5ef2e3ab: Waiting
0b0f2f2f5279: Waiting
6c7a51015a6d: Waiting
bed676ceab7a: Waiting
997ad09af523: Waiting
613ab28cf833: Waiting
df92b7394583: Waiting
391c09afbb47: Waiting
b32134902759: Waiting
a0e6fb76d26b: Pushed
30ed8014c04a: Pushed
2e399c26ca0a: Pushed
c72204a62d1b: Pushed
17dfad6d5620: Pushed
6c7a51015a6d: Pushed
f02ebcaa1002: Pushed
997ad09af523: Pushed
f3574f4db080: Pushed
b32134902759: Pushed
5331ce361341: Layer already exists
0997bf9121c4: Pushed
613ab28cf833: Layer already exists
babf5ef2e3ab: Layer already exists
bed676ceab7a: Layer already exists
0b0f2f2f5279: Layer already exists
6398d5cccd2c: Layer already exists
df92b7394583: Pushed
391c09afbb47: Pushed
20220204000038: digest: sha256:8dcd731a529ba5da68959c8674341cd31ef857a3d71f88d58038fa01c1c9ca0f size: 4314
FAILURE: Build failed with an exception.
* What went wrong:
Execution failed for task ':examples:java:compileTestJava'.
> Compilation failed with exit code 1; see the compiler error output for details.
* Try:
> Run with --stacktrace option to get the stack trace.
> Run with --info or --debug option to get more log output.
> Run with --scan to get full insights.
* Get more help at https://help.gradle.org
Deprecated Gradle features were used in this build, making it incompatible with Gradle 8.0.
You can use '--warning-mode all' to show the individual deprecation warnings and determine if they come from your own scripts or plugins.
See https://docs.gradle.org/7.3.2/userguide/command_line_interface.html#sec:command_line_warnings
Execution optimizations have been disabled for 1 invalid unit(s) of work during this build to ensure correctness.
Please consult deprecation warnings for more details.
BUILD FAILED in 2m 28s
85 actionable tasks: 60 executed, 23 from cache, 2 up-to-date
Publishing build scan...
https://gradle.com/s/h5cglp2ypmksa
Build step 'Invoke Gradle script' changed build result to FAILURE
Build step 'Invoke Gradle script' marked build as failure
---------------------------------------------------------------------
To unsubscribe, e-mail: builds-unsubscribe@beam.apache.org
For additional commands, e-mail: builds-help@beam.apache.org