You are viewing a plain text version of this content. The canonical link for it is here.
Posted to builds@hbase.apache.org by Apache Jenkins Server <je...@builds.apache.org> on 2015/07/31 23:10:33 UTC
Build failed in Jenkins: HBase-1.1 #595
See <https://builds.apache.org/job/HBase-1.1/595/changes>
Changes:
[apurtell] HBASE-14087 Ensure correct ASF headers for docs/code
[apurtell] HBASE-14176 Add missing headers to META-INF files
------------------------------------------
[...truncated 36875 lines...]
- locked <0xc6ee4bc8> (a java.util.Collections$UnmodifiableSet)
- locked <0xc6ee47c0> (a sun.nio.ch.EPollSelectorImpl)
at sun.nio.ch.SelectorImpl.select(SelectorImpl.java:98)
at sun.nio.ch.SelectorImpl.select(SelectorImpl.java:102)
at org.apache.hadoop.ipc.Server$Listener.run(Server.java:668)
"IPC Server Responder" daemon prio=10 tid=0x274a5400 nid=0x7350 runnable [0x26fac000]
java.lang.Thread.State: RUNNABLE
at sun.nio.ch.EPollArrayWrapper.epollWait(Native Method)
at sun.nio.ch.EPollArrayWrapper.poll(EPollArrayWrapper.java:228)
at sun.nio.ch.EPollSelectorImpl.doSelect(EPollSelectorImpl.java:81)
at sun.nio.ch.SelectorImpl.lockAndDoSelect(SelectorImpl.java:87)
- locked <0xc6eef610> (a sun.nio.ch.Util$2)
- locked <0xc6eef600> (a java.util.Collections$UnmodifiableSet)
- locked <0xc6eef400> (a sun.nio.ch.EPollSelectorImpl)
at sun.nio.ch.SelectorImpl.select(SelectorImpl.java:98)
at org.apache.hadoop.ipc.Server$Responder.doRunLoop(Server.java:835)
at org.apache.hadoop.ipc.Server$Responder.run(Server.java:818)
"org.apache.hadoop.hdfs.server.blockmanagement.BlockManager$ReplicationMonitor@1b37f8b" daemon prio=10 tid=0x2749b000 nid=0x7348 waiting on condition [0x2565c000]
java.lang.Thread.State: TIMED_WAITING (sleeping)
at java.lang.Thread.sleep(Native Method)
at org.apache.hadoop.hdfs.server.blockmanagement.BlockManager$ReplicationMonitor.run(BlockManager.java:3397)
at java.lang.Thread.run(Thread.java:724)
"org.apache.hadoop.hdfs.server.blockmanagement.HeartbeatManager$Monitor@17a86ba" daemon prio=10 tid=0x27499800 nid=0x7347 waiting on condition [0x256ad000]
java.lang.Thread.State: TIMED_WAITING (sleeping)
at java.lang.Thread.sleep(Native Method)
at org.apache.hadoop.hdfs.server.blockmanagement.HeartbeatManager$Monitor.run(HeartbeatManager.java:319)
at java.lang.Thread.run(Thread.java:724)
"org.apache.hadoop.hdfs.server.blockmanagement.DecommissionManager$Monitor@12a74f7" daemon prio=10 tid=0x27498800 nid=0x7346 waiting on condition [0x256fe000]
java.lang.Thread.State: TIMED_WAITING (sleeping)
at java.lang.Thread.sleep(Native Method)
at org.apache.hadoop.hdfs.server.blockmanagement.DecommissionManager$Monitor.run(DecommissionManager.java:76)
at java.lang.Thread.run(Thread.java:724)
"org.apache.hadoop.hdfs.server.blockmanagement.PendingReplicationBlocks$PendingReplicationMonitor@1a36ea0" daemon prio=10 tid=0x28048c00 nid=0x7344 waiting on condition [0x26f5b000]
java.lang.Thread.State: TIMED_WAITING (sleeping)
at java.lang.Thread.sleep(Native Method)
at org.apache.hadoop.hdfs.server.blockmanagement.PendingReplicationBlocks$PendingReplicationMonitor.run(PendingReplicationBlocks.java:221)
at java.lang.Thread.run(Thread.java:724)
"org.apache.hadoop.util.JvmPauseMonitor$Monitor@da4409" daemon prio=10 tid=0x28045000 nid=0x7330 waiting on condition [0x26ffd000]
java.lang.Thread.State: TIMED_WAITING (sleeping)
at java.lang.Thread.sleep(Native Method)
at org.apache.hadoop.util.JvmPauseMonitor$Monitor.run(JvmPauseMonitor.java:180)
at java.lang.Thread.run(Thread.java:724)
"IPC Server idle connection scanner for port 47198" daemon prio=10 tid=0x28040000 nid=0x731a in Object.wait() [0x27b5c000]
java.lang.Thread.State: TIMED_WAITING (on object monitor)
at java.lang.Object.wait(Native Method)
- waiting on <0xc6ee4118> (a java.util.TaskQueue)
at java.util.TimerThread.mainLoop(Timer.java:552)
- locked <0xc6ee4118> (a java.util.TaskQueue)
at java.util.TimerThread.run(Timer.java:505)
"Socket Reader #1 for port 47198" prio=10 tid=0x2803f000 nid=0x7318 runnable [0x27bad000]
java.lang.Thread.State: RUNNABLE
at sun.nio.ch.EPollArrayWrapper.epollWait(Native Method)
at sun.nio.ch.EPollArrayWrapper.poll(EPollArrayWrapper.java:228)
at sun.nio.ch.EPollSelectorImpl.doSelect(EPollSelectorImpl.java:81)
at sun.nio.ch.SelectorImpl.lockAndDoSelect(SelectorImpl.java:87)
- locked <0xc6ee3060> (a sun.nio.ch.Util$2)
- locked <0xc6ee3050> (a java.util.Collections$UnmodifiableSet)
- locked <0xc6ecba58> (a sun.nio.ch.EPollSelectorImpl)
at sun.nio.ch.SelectorImpl.select(SelectorImpl.java:98)
at sun.nio.ch.SelectorImpl.select(SelectorImpl.java:102)
at org.apache.hadoop.ipc.Server$Listener$Reader.doRunLoop(Server.java:616)
- locked <0xc6ee4da8> (a org.apache.hadoop.ipc.Server$Listener$Reader)
at org.apache.hadoop.ipc.Server$Listener$Reader.run(Server.java:595)
"Timer-0" daemon prio=10 tid=0x25b2b400 nid=0x7104 in Object.wait() [0x27bfe000]
java.lang.Thread.State: TIMED_WAITING (on object monitor)
at java.lang.Object.wait(Native Method)
- waiting on <0x48ae7228> (a java.util.TaskQueue)
at java.util.TimerThread.mainLoop(Timer.java:552)
- locked <0x48ae7228> (a java.util.TaskQueue)
at java.util.TimerThread.run(Timer.java:505)
"16429936@qtp-3631737-1 - Acceptor0 HttpServer2$SelectChannelConnectorWithSafeStartup@localhost:47025" daemon prio=10 tid=0x280db800 nid=0x70a9 runnable [0x28763000]
java.lang.Thread.State: RUNNABLE
at sun.nio.ch.EPollArrayWrapper.epollWait(Native Method)
at sun.nio.ch.EPollArrayWrapper.poll(EPollArrayWrapper.java:228)
at sun.nio.ch.EPollSelectorImpl.doSelect(EPollSelectorImpl.java:81)
at sun.nio.ch.SelectorImpl.lockAndDoSelect(SelectorImpl.java:87)
- locked <0x48aff970> (a sun.nio.ch.Util$2)
- locked <0x48aff8f0> (a java.util.Collections$UnmodifiableSet)
- locked <0x48aff6a0> (a sun.nio.ch.EPollSelectorImpl)
at sun.nio.ch.SelectorImpl.select(SelectorImpl.java:98)
at org.mortbay.io.nio.SelectorManager$SelectSet.doSelect(SelectorManager.java:498)
at org.mortbay.io.nio.SelectorManager.doSelect(SelectorManager.java:192)
at org.mortbay.jetty.nio.SelectChannelConnector.accept(SelectChannelConnector.java:124)
at org.mortbay.jetty.AbstractConnector$Acceptor.run(AbstractConnector.java:708)
at org.mortbay.thread.QueuedThreadPool$PoolThread.run(QueuedThreadPool.java:582)
"5192141@qtp-3631737-0" daemon prio=10 tid=0x280db000 nid=0x70a8 in Object.wait() [0x28c74000]
java.lang.Thread.State: TIMED_WAITING (on object monitor)
at java.lang.Object.wait(Native Method)
- waiting on <0x48ab12b8> (a org.mortbay.thread.QueuedThreadPool$PoolThread)
at org.mortbay.thread.QueuedThreadPool$PoolThread.run(QueuedThreadPool.java:626)
- locked <0x48ab12b8> (a org.mortbay.thread.QueuedThreadPool$PoolThread)
"Timer for 'NameNode' metrics system" daemon prio=10 tid=0x28bb7800 nid=0x7045 in Object.wait() [0x28cd1000]
java.lang.Thread.State: TIMED_WAITING (on object monitor)
at java.lang.Object.wait(Native Method)
- waiting on <0x48a60318> (a java.util.TaskQueue)
at java.util.TimerThread.mainLoop(Timer.java:552)
- locked <0x48a60318> (a java.util.TaskQueue)
at java.util.TimerThread.run(Timer.java:505)
"process reaper" daemon prio=10 tid=0x280ebc00 nid=0x6d68 runnable [0x29556000]
java.lang.Thread.State: RUNNABLE
at java.lang.UNIXProcess.waitForProcessExit(Native Method)
at java.lang.UNIXProcess.access$200(UNIXProcess.java:54)
at java.lang.UNIXProcess$3.run(UNIXProcess.java:174)
at java.util.concurrent.ThreadPoolExecutor.runWorker(ThreadPoolExecutor.java:1145)
at java.util.concurrent.ThreadPoolExecutor$Worker.run(ThreadPoolExecutor.java:615)
at java.lang.Thread.run(Thread.java:724)
"Service Thread" daemon prio=10 tid=0x2a1f7c00 nid=0x6b78 runnable [0x00000000]
java.lang.Thread.State: RUNNABLE
"C2 CompilerThread1" daemon prio=10 tid=0x2a1f5c00 nid=0x6b76 waiting on condition [0x00000000]
java.lang.Thread.State: RUNNABLE
"C2 CompilerThread0" daemon prio=10 tid=0x2a1f3c00 nid=0x6b73 waiting on condition [0x00000000]
java.lang.Thread.State: RUNNABLE
"Signal Dispatcher" daemon prio=10 tid=0x2a1f2400 nid=0x6b6b runnable [0x00000000]
java.lang.Thread.State: RUNNABLE
"Finalizer" daemon prio=10 tid=0x2a1b7000 nid=0x6b67 in Object.wait() [0x3367d000]
java.lang.Thread.State: WAITING (on object monitor)
at java.lang.Object.wait(Native Method)
- waiting on <0x44805240> (a java.lang.ref.ReferenceQueue$Lock)
at java.lang.ref.ReferenceQueue.remove(ReferenceQueue.java:135)
- locked <0x44805240> (a java.lang.ref.ReferenceQueue$Lock)
at java.lang.ref.ReferenceQueue.remove(ReferenceQueue.java:151)
at java.lang.ref.Finalizer$FinalizerThread.run(Finalizer.java:189)
"Reference Handler" daemon prio=10 tid=0x2a1b5400 nid=0x6b66 in Object.wait() [0x3397d000]
java.lang.Thread.State: WAITING (on object monitor)
at java.lang.Object.wait(Native Method)
- waiting on <0x44804cc0> (a java.lang.ref.Reference$Lock)
at java.lang.Object.wait(Object.java:503)
at java.lang.ref.Reference$ReferenceHandler.run(Reference.java:133)
- locked <0x44804cc0> (a java.lang.ref.Reference$Lock)
"main" prio=10 tid=0xf6706800 nid=0x6b4d waiting on condition [0xf6934000]
java.lang.Thread.State: TIMED_WAITING (sleeping)
at java.lang.Thread.sleep(Native Method)
at org.apache.hadoop.mapreduce.Job.monitorAndPrintJob(Job.java:1348)
at org.apache.hadoop.mapreduce.Job.waitForCompletion(Job.java:1306)
at org.apache.hadoop.hbase.mapreduce.TestRowCounter.runRowCount(TestRowCounter.java:207)
at org.apache.hadoop.hbase.mapreduce.TestRowCounter.testRowCounterExclusiveColumn(TestRowCounter.java:118)
at sun.reflect.NativeMethodAccessorImpl.invoke0(Native Method)
at sun.reflect.NativeMethodAccessorImpl.invoke(NativeMethodAccessorImpl.java:57)
at sun.reflect.DelegatingMethodAccessorImpl.invoke(DelegatingMethodAccessorImpl.java:43)
at java.lang.reflect.Method.invoke(Method.java:606)
at org.junit.runners.model.FrameworkMethod$1.runReflectiveCall(FrameworkMethod.java:47)
at org.junit.internal.runners.model.ReflectiveCallable.run(ReflectiveCallable.java:12)
at org.junit.runners.model.FrameworkMethod.invokeExplosively(FrameworkMethod.java:44)
at org.junit.internal.runners.statements.InvokeMethod.evaluate(InvokeMethod.java:17)
at org.junit.runners.ParentRunner.runLeaf(ParentRunner.java:271)
at org.junit.runners.BlockJUnit4ClassRunner.runChild(BlockJUnit4ClassRunner.java:70)
at org.junit.runners.BlockJUnit4ClassRunner.runChild(BlockJUnit4ClassRunner.java:50)
at org.junit.runners.ParentRunner$3.run(ParentRunner.java:238)
at org.junit.runners.ParentRunner$1.schedule(ParentRunner.java:63)
at org.junit.runners.ParentRunner.runChildren(ParentRunner.java:236)
at org.junit.runners.ParentRunner.access$000(ParentRunner.java:53)
at org.junit.runners.ParentRunner$2.evaluate(ParentRunner.java:229)
at org.junit.internal.runners.statements.RunBefores.evaluate(RunBefores.java:26)
at org.junit.internal.runners.statements.RunAfters.evaluate(RunAfters.java:27)
at org.junit.runners.ParentRunner.run(ParentRunner.java:309)
at org.junit.runners.Suite.runChild(Suite.java:127)
at org.junit.runners.Suite.runChild(Suite.java:26)
at org.junit.runners.ParentRunner$3.run(ParentRunner.java:238)
at org.junit.runners.ParentRunner$1.schedule(ParentRunner.java:63)
at org.junit.runners.ParentRunner.runChildren(ParentRunner.java:236)
at org.junit.runners.ParentRunner.access$000(ParentRunner.java:53)
at org.junit.runners.ParentRunner$2.evaluate(ParentRunner.java:229)
at org.junit.runners.ParentRunner.run(ParentRunner.java:309)
at org.junit.runner.JUnitCore.run(JUnitCore.java:160)
at org.junit.runner.JUnitCore.run(JUnitCore.java:138)
at org.apache.maven.surefire.junitcore.JUnitCoreWrapper.createRequestAndRun(JUnitCoreWrapper.java:107)
at org.apache.maven.surefire.junitcore.JUnitCoreWrapper.executeEager(JUnitCoreWrapper.java:77)
at org.apache.maven.surefire.junitcore.JUnitCoreWrapper.execute(JUnitCoreWrapper.java:53)
at org.apache.maven.surefire.junitcore.JUnitCoreProvider.invoke(JUnitCoreProvider.java:144)
at org.apache.maven.surefire.booter.ForkedBooter.invokeProviderInSameClassLoader(ForkedBooter.java:203)
at org.apache.maven.surefire.booter.ForkedBooter.runSuitesInProcess(ForkedBooter.java:155)
at org.apache.maven.surefire.booter.ForkedBooter.main(ForkedBooter.java:103)
"VM Thread" prio=10 tid=0x2a0f8c00 nid=0x6b63 runnable
"GC task thread#0 (ParallelGC)" prio=10 tid=0xf6710c00 nid=0x6b4e runnable
"GC task thread#1 (ParallelGC)" prio=10 tid=0xf6712000 nid=0x6b50 runnable
"GC task thread#2 (ParallelGC)" prio=10 tid=0xf6713800 nid=0x6b51 runnable
"GC task thread#3 (ParallelGC)" prio=10 tid=0xf6715000 nid=0x6b53 runnable
"GC task thread#4 (ParallelGC)" prio=10 tid=0xf6716400 nid=0x6b54 runnable
"GC task thread#5 (ParallelGC)" prio=10 tid=0xf6717c00 nid=0x6b55 runnable
"GC task thread#6 (ParallelGC)" prio=10 tid=0xf6719400 nid=0x6b56 runnable
"GC task thread#7 (ParallelGC)" prio=10 tid=0xf671a800 nid=0x6b57 runnable
"GC task thread#8 (ParallelGC)" prio=10 tid=0xf671c000 nid=0x6b58 runnable
"GC task thread#9 (ParallelGC)" prio=10 tid=0xf671d800 nid=0x6b5a runnable
"GC task thread#10 (ParallelGC)" prio=10 tid=0xf671ec00 nid=0x6b5b runnable
"GC task thread#11 (ParallelGC)" prio=10 tid=0xf6720400 nid=0x6b5c runnable
"GC task thread#12 (ParallelGC)" prio=10 tid=0xf6721c00 nid=0x6b5d runnable
"VM Periodic Task Thread" prio=10 tid=0x2a1f9800 nid=0x6b7a waiting on condition
JNI global references: 290
+ echo '************ END zombies jstack extract'
************ END zombies jstack extract
+ JIRA_COMMENT='
{color:red}-1 core zombie tests{color}. There are 5 zombie test(s): at org.apache.hadoop.hbase.mapreduce.TestImportExport.testDurability(TestImportExport.java:653)
at org.apache.hadoop.hbase.mapreduce.TestImportTsv.testBulkOutputWithoutAnExistingTable(TestImportTsv.java:169)
at org.apache.hadoop.hbase.mapreduce.TestRowCounter.testRowCounterExclusiveColumn(TestRowCounter.java:118)'
+ BAD=1
+ jps
+ grep surefirebooter
+ cut -d ' ' -f 1
+ xargs kill -9
POST BUILD TASK : SUCCESS
END OF POST BUILD TASK : 0
Archiving artifacts
Sending artifact delta relative to HBase-1.1 #594
Archived 1985 artifacts
Archive block size is 32768
Received 41 blocks and 433204855 bytes
Compression is 0.3%
Took 2 min 20 sec
Recording test results
Updating HBASE-14087
Updating HBASE-14176
Jenkins build is back to normal : HBase-1.1 #597
Posted by Apache Jenkins Server <je...@builds.apache.org>.
See <https://builds.apache.org/job/HBase-1.1/597/changes>
Build failed in Jenkins: HBase-1.1 #596
Posted by Apache Jenkins Server <je...@builds.apache.org>.
See <https://builds.apache.org/job/HBase-1.1/596/changes>
Changes:
[apurtell] HBASE-14146 Fix Once replication sees an error it slows down forever
------------------------------------------
[...truncated 6014 lines...]
org.apache.hadoop.hbase.client.TestMultiParallel.testBadFam(org.apache.hadoop.hbase.client.TestMultiParallel)
Run 1: TestMultiParallel.testBadFam:224 » OutOfMemory unable to create new native thr...
Run 2: TestMultiParallel.testBadFam:210 » IO java.lang.reflect.InvocationTargetExcept...
org.apache.hadoop.hbase.client.TestMultiParallel.testBatchWithDelete(org.apache.hadoop.hbase.client.TestMultiParallel)
Run 1: TestMultiParallel.testBatchWithDelete » OutOfMemory unable to create new nativ...
Run 2: TestMultiParallel.testBatchWithDelete » OutOfMemory unable to create new nativ...
org.apache.hadoop.hbase.client.TestMultiParallel.testBatchWithManyColsInOneRowGetAndPut(org.apache.hadoop.hbase.client.TestMultiParallel)
Run 1: TestMultiParallel.testBatchWithManyColsInOneRowGetAndPut:421 » Runtime java.la...
Run 2: TestMultiParallel.testBatchWithManyColsInOneRowGetAndPut » OutOfMemory unable ...
org.apache.hadoop.hbase.client.TestMultiParallel.testBatchWithMixedActions(org.apache.hadoop.hbase.client.TestMultiParallel)
Run 1: TestMultiParallel.testBatchWithMixedActions » OutOfMemory unable to create new...
Run 2: TestMultiParallel.testBatchWithMixedActions:575 » IO java.lang.reflect.Invocat...
org.apache.hadoop.hbase.client.TestMultiParallel.testBatchWithPut(org.apache.hadoop.hbase.client.TestMultiParallel)
Run 1: TestMultiParallel.testBatchWithPut:327 » Runtime java.lang.OutOfMemoryError: u...
Run 2: TestMultiParallel.testBatchWithPut:327 » Runtime java.lang.OutOfMemoryError: u...
org.apache.hadoop.hbase.client.TestMultiParallel.testFlushCommitsNoAbort(org.apache.hadoop.hbase.client.TestMultiParallel)
Run 1: TestMultiParallel.testFlushCommitsNoAbort » OutOfMemory unable to create new n...
Run 2: TestMultiParallel.testFlushCommitsNoAbort » OutOfMemory unable to create new n...
org.apache.hadoop.hbase.client.TestMultiParallel.testFlushCommitsWithAbort(org.apache.hadoop.hbase.client.TestMultiParallel)
Run 1: TestMultiParallel.testFlushCommitsWithAbort:252->doTestFlushCommits:268 » Runtime
Run 2: TestMultiParallel.testFlushCommitsWithAbort » OutOfMemory unable to create new...
org.apache.hadoop.hbase.client.TestMultiParallel.testHTableDeleteWithList(org.apache.hadoop.hbase.client.TestMultiParallel)
Run 1: TestMultiParallel.testHTableDeleteWithList:387 » Runtime java.lang.OutOfMemory...
Run 2: TestMultiParallel.testHTableDeleteWithList » OutOfMemory unable to create new ...
org.apache.hadoop.hbase.client.TestMultiParallel.testNonceCollision(org.apache.hadoop.hbase.client.TestMultiParallel)
Run 1: TestMultiParallel.testNonceCollision » OutOfMemory unable to create new native...
Run 2: TestMultiParallel.testNonceCollision:483 » IO java.lang.reflect.InvocationTarg...
TestRestoreSnapshotFromClient.setUpBeforeClass:81 » IO Shutting down
org.apache.hadoop.hbase.client.TestRestoreSnapshotFromClientWithRegionReplicas.testCloneAndRestoreSnapshot(org.apache.hadoop.hbase.client.TestRestoreSnapshotFromClientWithRegionReplicas)
Run 1: TestRestoreSnapshotFromClientWithRegionReplicas>TestRestoreSnapshotFromClient.setup:128 » Runtime
Run 2: TestRestoreSnapshotFromClientWithRegionReplicas.testCloneAndRestoreSnapshot » Remote
org.apache.hadoop.hbase.client.TestRestoreSnapshotFromClientWithRegionReplicas.testCloneSnapshotOfCloned(org.apache.hadoop.hbase.client.TestRestoreSnapshotFromClientWithRegionReplicas)
Run 1: TestRestoreSnapshotFromClientWithRegionReplicas.testCloneSnapshotOfCloned » Remote
Run 2: TestRestoreSnapshotFromClientWithRegionReplicas>TestRestoreSnapshotFromClient.tearDown:134 » TableNotFound
org.apache.hadoop.hbase.client.TestRestoreSnapshotFromClientWithRegionReplicas.testCorruptedSnapshot(org.apache.hadoop.hbase.client.TestRestoreSnapshotFromClientWithRegionReplicas)
Run 1: TestRestoreSnapshotFromClientWithRegionReplicas.testCorruptedSnapshot » Remote
Run 2: TestRestoreSnapshotFromClientWithRegionReplicas.testCorruptedSnapshot » Remote
org.apache.hadoop.hbase.client.TestRestoreSnapshotFromClientWithRegionReplicas.testRestoreSchemaChange(org.apache.hadoop.hbase.client.TestRestoreSnapshotFromClientWithRegionReplicas)
Run 1: TestRestoreSnapshotFromClientWithRegionReplicas.testRestoreSchemaChange » Remote
Run 2: TestRestoreSnapshotFromClientWithRegionReplicas.testRestoreSchemaChange » Remote
TestRestoreSnapshotFromClientWithRegionReplicas>TestRestoreSnapshotFromClient.testRestoreSnapshot:143 » HBaseSnapshot
TestScannerTimeout.setUpBeforeClass:70 » IO Shutting down
org.apache.hadoop.hbase.client.TestTableSnapshotScanner.testWithMultiRegion(org.apache.hadoop.hbase.client.TestTableSnapshotScanner)
Run 1: TestTableSnapshotScanner.testWithMultiRegion:119->testScanner:129->setupCluster:59 » IO
Run 2: TestTableSnapshotScanner.testWithMultiRegion:119->testScanner:129->setupCluster:59 » OutOfMemory
Run 3: TestTableSnapshotScanner.testWithMultiRegion:119->testScanner:129->setupCluster:59 » OutOfMemory
org.apache.hadoop.hbase.client.TestTableSnapshotScanner.testWithOfflineHBaseMultiRegion(org.apache.hadoop.hbase.client.TestTableSnapshotScanner)
Run 1: TestTableSnapshotScanner.testWithOfflineHBaseMultiRegion:124->testScanner:129->setupCluster:59 » OutOfMemory
Run 2: TestTableSnapshotScanner.testWithOfflineHBaseMultiRegion:124->testScanner:129->setupCluster:59 » OutOfMemory
Run 3: TestTableSnapshotScanner.testWithOfflineHBaseMultiRegion:124->testScanner:129->setupCluster:59 » OutOfMemory
org.apache.hadoop.hbase.client.TestTableSnapshotScanner.testWithSingleRegion(org.apache.hadoop.hbase.client.TestTableSnapshotScanner)
Run 1: TestTableSnapshotScanner.testWithSingleRegion:114->testScanner:129->setupCluster:59 » OutOfMemory
Run 2: TestTableSnapshotScanner.testWithSingleRegion:114->testScanner:129->setupCluster:59 » OutOfMemory
Run 3: TestTableSnapshotScanner.testWithSingleRegion:114->testScanner:129->setupCluster:59 » OutOfMemory
org.apache.hadoop.hbase.client.replication.TestReplicationAdminWithClusters.org.apache.hadoop.hbase.client.replication.TestReplicationAdminWithClusters
Run 1: TestReplicationAdminWithClusters.setUpBeforeClass:46->TestReplicationBase.setUpBeforeClass:128 » IO
Run 2: TestReplicationAdminWithClusters.tearDownAfterClass:55 NullPointer
org.apache.hadoop.hbase.namespace.TestNamespaceAuditor.testCloneSnapshot(org.apache.hadoop.hbase.namespace.TestNamespaceAuditor)
Run 1: TestNamespaceAuditor.testCloneSnapshot » OutOfMemory unable to create new nati...
Run 2: TestNamespaceAuditor.testCloneSnapshot » Remote java.lang.OutOfMemoryError: un...
org.apache.hadoop.hbase.namespace.TestNamespaceAuditor.testCloneSnapshotQuotaExceed(org.apache.hadoop.hbase.namespace.TestNamespaceAuditor)
Run 1: TestNamespaceAuditor.testCloneSnapshotQuotaExceed » Unexpected exception, exp...
Run 2: TestNamespaceAuditor.testCloneSnapshotQuotaExceed » Remote java.lang.OutOfMemo...
org.apache.hadoop.hbase.namespace.TestNamespaceAuditor.testDeleteTable(org.apache.hadoop.hbase.namespace.TestNamespaceAuditor)
Run 1: TestNamespaceAuditor.testDeleteTable » Remote java.lang.OutOfMemoryError: unab...
Run 2: TestNamespaceAuditor.testDeleteTable » Remote unable to create new native thre...
org.apache.hadoop.hbase.namespace.TestNamespaceAuditor.testExceedTableQuotaInNamespace(org.apache.hadoop.hbase.namespace.TestNamespaceAuditor)
Run 1: TestNamespaceAuditor.testExceedTableQuotaInNamespace » OutOfMemory unable to c...
Run 2: TestNamespaceAuditor.testExceedTableQuotaInNamespace » Remote java.lang.OutOfM...
org.apache.hadoop.hbase.namespace.TestNamespaceAuditor.testRegionMerge(org.apache.hadoop.hbase.namespace.TestNamespaceAuditor)
Run 1: TestNamespaceAuditor.testRegionMerge:302 » NamespaceExist org.apache.hadoop.hb...
Run 2: TestNamespaceAuditor.testRegionMerge » Remote java.lang.OutOfMemoryError: unab...
org.apache.hadoop.hbase.namespace.TestNamespaceAuditor.testRegionOperations(org.apache.hadoop.hbase.namespace.TestNamespaceAuditor)
Run 1: TestNamespaceAuditor.testRegionOperations:445 null
Run 2: TestNamespaceAuditor.testRegionOperations » Remote java.lang.OutOfMemoryError:...
org.apache.hadoop.hbase.namespace.TestNamespaceAuditor.testRestoreSnapshot(org.apache.hadoop.hbase.namespace.TestNamespaceAuditor)
Run 1: TestNamespaceAuditor.testRestoreSnapshot:744 » RetriesExhausted Failed after a...
Run 2: TestNamespaceAuditor.testRestoreSnapshot » Remote java.lang.OutOfMemoryError: ...
org.apache.hadoop.hbase.namespace.TestNamespaceAuditor.testRestoreSnapshotQuotaExceed(org.apache.hadoop.hbase.namespace.TestNamespaceAuditor)
Run 1: TestNamespaceAuditor.testRestoreSnapshotQuotaExceed » OutOfMemory unable to cr...
Run 2: TestNamespaceAuditor.testRestoreSnapshotQuotaExceed » Remote java.lang.OutOfMe...
org.apache.hadoop.hbase.namespace.TestNamespaceAuditor.testStatePreserve(org.apache.hadoop.hbase.namespace.TestNamespaceAuditor)
Run 1: TestNamespaceAuditor.testStatePreserve » Remote java.lang.OutOfMemoryError: un...
Run 2: TestNamespaceAuditor.testStatePreserve » Remote java.lang.OutOfMemoryError: un...
org.apache.hadoop.hbase.namespace.TestNamespaceAuditor.testTableOperations(org.apache.hadoop.hbase.namespace.TestNamespaceAuditor)
Run 1: TestNamespaceAuditor.testTableOperations » OutOfMemory unable to create new na...
Run 2: TestNamespaceAuditor.testTableOperations » Remote java.lang.OutOfMemoryError: ...
TestNamespaceAuditor.testValidQuotas » Remote java.lang.OutOfMemoryError: unab...
TestZKLessNamespaceAuditor.before:26->TestNamespaceAuditor.setupOnce:106 » IO ...
TestZKLessNamespaceAuditor.testCloneSnapshot » OutOfMemory unable to create ne...
org.apache.hadoop.hbase.namespace.TestZKLessNamespaceAuditor.testCloneSnapshotQuotaExceed(org.apache.hadoop.hbase.namespace.TestZKLessNamespaceAuditor)
Run 1: TestZKLessNamespaceAuditor.testCloneSnapshotQuotaExceed » OutOfMemory unable t...
Run 2: TestZKLessNamespaceAuditor>TestNamespaceAuditor.cleanup:122 » RetriesExhausted
TestZKLessNamespaceAuditor>TestNamespaceAuditor.cleanup:122 » RetriesExhausted
org.apache.hadoop.hbase.namespace.TestZKLessNamespaceAuditor.testRegionMerge(org.apache.hadoop.hbase.namespace.TestZKLessNamespaceAuditor)
Run 1: TestZKLessNamespaceAuditor>TestNamespaceAuditor.testRegionMerge:302 » NamespaceExist
Run 2: TestZKLessNamespaceAuditor.testRegionMerge » Remote java.lang.OutOfMemoryError...
org.apache.hadoop.hbase.namespace.TestZKLessNamespaceAuditor.testRegionOperations(org.apache.hadoop.hbase.namespace.TestZKLessNamespaceAuditor)
Run 1: TestZKLessNamespaceAuditor>TestNamespaceAuditor.testRegionOperations:452 » OutOfMemory
Run 2: TestZKLessNamespaceAuditor.testRegionOperations » Remote java.lang.OutOfMemory...
TestZKLessNamespaceAuditor.testRestoreSnapshot » OutOfMemory unable to create ...
org.apache.hadoop.hbase.namespace.TestZKLessNamespaceAuditor.testRestoreSnapshotQuotaExceed(org.apache.hadoop.hbase.namespace.TestZKLessNamespaceAuditor)
Run 1: TestZKLessNamespaceAuditor.testRestoreSnapshotQuotaExceed » Remote java.lang.O...
Run 2: TestZKLessNamespaceAuditor>TestNamespaceAuditor.cleanup:122 » RetriesExhausted
org.apache.hadoop.hbase.namespace.TestZKLessNamespaceAuditor.testStatePreserve(org.apache.hadoop.hbase.namespace.TestZKLessNamespaceAuditor)
Run 1: TestZKLessNamespaceAuditor>TestNamespaceAuditor.testStatePreserve:582 » RetriesExhausted
Run 2: TestZKLessNamespaceAuditor.testStatePreserve » Remote java.lang.OutOfMemoryErr...
TestZKLessNamespaceAuditor.testTableOperations » OutOfMemory unable to create ...
TestZKLessNamespaceAuditor.testValidQuotas » Remote java.lang.OutOfMemoryError...
Flaked tests:
org.apache.hadoop.hbase.client.TestClientScannerRPCTimeout.testScannerNextRPCTimesout(org.apache.hadoop.hbase.client.TestClientScannerRPCTimeout)
Run 1: TestClientScannerRPCTimeout.testScannerNextRPCTimesout:103 » Runtime java.lang...
Run 2: PASS
org.apache.hadoop.hbase.client.TestMultiParallel.testBatchWithGet(org.apache.hadoop.hbase.client.TestMultiParallel)
Run 1: TestMultiParallel.testBatchWithGet:175 » Runtime java.lang.OutOfMemoryError: u...
Run 2: PASS
Tests run: 120, Failures: 0, Errors: 57, Skipped: 0, Flakes: 2
[INFO] ------------------------------------------------------------------------
[INFO] Reactor Summary:
[INFO]
[INFO] HBase ............................................. SUCCESS [3.277s]
[INFO] HBase - Checkstyle ................................ SUCCESS [0.657s]
[INFO] HBase - Annotations ............................... SUCCESS [0.900s]
[INFO] HBase - Protocol .................................. SUCCESS [13.008s]
[INFO] HBase - Common .................................... SUCCESS [1:29.037s]
[INFO] HBase - Procedure ................................. SUCCESS [1:12.733s]
[INFO] HBase - Client .................................... SUCCESS [1:23.349s]
[INFO] HBase - Hadoop Compatibility ...................... SUCCESS [7.162s]
[INFO] HBase - Hadoop Two Compatibility .................. SUCCESS [6.650s]
[INFO] HBase - Prefix Tree ............................... SUCCESS [9.163s]
[INFO] HBase - Server .................................... FAILURE [43:41.255s]
[INFO] HBase - Testing Util .............................. SKIPPED
[INFO] HBase - Thrift .................................... SKIPPED
[INFO] HBase - Rest ...................................... SKIPPED
[INFO] HBase - Shell ..................................... SKIPPED
[INFO] HBase - Integration Tests ......................... SKIPPED
[INFO] HBase - Examples .................................. SKIPPED
[INFO] HBase - Assembly .................................. SKIPPED
[INFO] HBase - Shaded .................................... SKIPPED
[INFO] HBase - Shaded - Client ........................... SKIPPED
[INFO] HBase - Shaded - Server ........................... SKIPPED
[INFO] ------------------------------------------------------------------------
[INFO] BUILD FAILURE
[INFO] ------------------------------------------------------------------------
[INFO] Total time: 48:29.209s
[INFO] Finished at: Tue Aug 04 21:21:23 UTC 2015
[INFO] Final Memory: 112M/1587M
[INFO] ------------------------------------------------------------------------
[ERROR] Failed to execute goal org.apache.maven.plugins:maven-surefire-plugin:2.18:test (secondPartTestsExecution) on project hbase-server: ExecutionException: java.lang.RuntimeException: java.lang.RuntimeException: org.apache.maven.surefire.report.ReporterException: When writing xml report stdout/stderr: /tmp/stderr8199742855080775731deferred (No such file or directory) -> [Help 1]
[ERROR]
[ERROR] To see the full stack trace of the errors, re-run Maven with the -e switch.
[ERROR] Re-run Maven using the -X switch to enable full debug logging.
[ERROR]
[ERROR] For more information about the errors and possible solutions, please read the following articles:
[ERROR] [Help 1] http://cwiki.apache.org/confluence/display/MAVEN/MojoFailureException
[ERROR]
[ERROR] After correcting the problems, you can resume the build with the command
[ERROR] mvn <goals> -rf :hbase-server
Build step 'Invoke top-level Maven targets' marked build as failure
Performing Post build task...
Match found for :.* : True
Logical operation result is TRUE
Running script : ZOMBIE_TESTS_COUNT=`jps | grep surefirebooter | wc -l`
if [[ $ZOMBIE_TESTS_COUNT != 0 ]] ; then
#It seems sometimes the tests are not dying immediately. Let's give them 10s
echo "Suspicious java process found - waiting 10s to see if there are just slow to stop"
sleep 10
ZOMBIE_TESTS_COUNT=`jps | grep surefirebooter | wc -l`
if [[ $ZOMBIE_TESTS_COUNT != 0 ]] ; then
echo "There are $ZOMBIE_TESTS_COUNT zombie tests, they should have been killed by surefire but survived"
echo "************ BEGIN zombies jstack extract"
ZB_STACK=`jps | grep surefirebooter | cut -d ' ' -f 1 | xargs -n 1 jstack | grep ".test" | grep "\.java"`
jps | grep surefirebooter | cut -d ' ' -f 1 | xargs -n 1 jstack
echo "************ END zombies jstack extract"
JIRA_COMMENT="$JIRA_COMMENT
{color:red}-1 core zombie tests{color}. There are ${ZOMBIE_TESTS_COUNT} zombie test(s): ${ZB_STACK}"
BAD=1
jps | grep surefirebooter | cut -d ' ' -f 1 | xargs kill -9
else
echo "We're ok: there is no zombie test, but some tests took some time to stop"
fi
else
echo "We're ok: there is no zombie test"
fi
[HBase-1.1] $ /bin/bash -xe /tmp/hudson1879860813489954793.sh
++ jps
++ wc -l
++ grep surefirebooter
+ ZOMBIE_TESTS_COUNT=4
+ [[ 4 != 0 ]]
+ echo 'Suspicious java process found - waiting 10s to see if there are just slow to stop'
Suspicious java process found - waiting 10s to see if there are just slow to stop
+ sleep 10
++ jps
++ grep surefirebooter
++ wc -l
+ ZOMBIE_TESTS_COUNT=0
+ [[ 0 != 0 ]]
+ echo 'We'\''re ok: there is no zombie test, but some tests took some time to stop'
We're ok: there is no zombie test, but some tests took some time to stop
POST BUILD TASK : SUCCESS
END OF POST BUILD TASK : 0
Archiving artifacts
Sending artifact delta relative to HBase-1.1 #594
Archived 1062 artifacts
Archive block size is 32768
Received 5 blocks and 60506893 bytes
Compression is 0.3%
Took 30 sec
Recording test results
Updating HBASE-14146