You are viewing a plain text version of this content. The canonical link for it is here.
Posted to builds@beam.apache.org by Apache Jenkins Server <je...@builds.apache.org> on 2023/06/06 13:01:49 UTC

Build failed in Jenkins: beam_LoadTests_Python_CoGBK_Dataflow_Batch #1418

See <https://ci-beam.apache.org/job/beam_LoadTests_Python_CoGBK_Dataflow_Batch/1418/display/redirect>

Changes:


------------------------------------------
[...truncated 32.98 KB...]
  Using cached google_cloud_spanner-3.35.1-py2.py3-none-any.whl (332 kB)
Collecting google-cloud-dlp<4,>=3.0.0 (from apache-beam==2.49.0.dev0)
  Using cached google_cloud_dlp-3.12.1-py2.py3-none-any.whl (143 kB)
Collecting google-cloud-language<3,>=2.0 (from apache-beam==2.49.0.dev0)
  Using cached google_cloud_language-2.10.0-py2.py3-none-any.whl (101 kB)
Collecting google-cloud-videointelligence<3,>=2.0 (from apache-beam==2.49.0.dev0)
  Using cached google_cloud_videointelligence-2.11.2-py2.py3-none-any.whl (229 kB)
Collecting google-cloud-vision<4,>=2 (from apache-beam==2.49.0.dev0)
  Using cached google_cloud_vision-3.4.2-py2.py3-none-any.whl (444 kB)
Collecting google-cloud-recommendations-ai<0.11.0,>=0.1.0 (from apache-beam==2.49.0.dev0)
  Using cached google_cloud_recommendations_ai-0.10.3-py2.py3-none-any.whl (173 kB)
Collecting boto3<2,>=1.9 (from apache-beam==2.49.0.dev0)
  Using cached boto3-1.26.147-py3-none-any.whl (135 kB)
Requirement already satisfied: six>=1.11.0 in <https://ci-beam.apache.org/job/beam_LoadTests_Python_CoGBK_Dataflow_Batch/ws/src/build/gradleenv/1329484227/lib/python3.7/site-packages> (from azure-core<2,>=1.7.0->apache-beam==2.49.0.dev0) (1.16.0)
Collecting msal<2.0.0,>=1.20.0 (from azure-identity<2,>=1.12.0->apache-beam==2.49.0.dev0)
  Using cached msal-1.22.0-py2.py3-none-any.whl (90 kB)
Collecting msal-extensions<2.0.0,>=0.3.0 (from azure-identity<2,>=1.12.0->apache-beam==2.49.0.dev0)
  Using cached msal_extensions-1.0.0-py2.py3-none-any.whl (19 kB)
Collecting isodate>=0.6.1 (from azure-storage-blob<13,>=12.3.2->apache-beam==2.49.0.dev0)
  Using cached isodate-0.6.1-py2.py3-none-any.whl (41 kB)
Collecting botocore<1.30.0,>=1.29.147 (from boto3<2,>=1.9->apache-beam==2.49.0.dev0)
  Using cached botocore-1.29.147-py3-none-any.whl (10.8 MB)
Collecting jmespath<2.0.0,>=0.7.1 (from boto3<2,>=1.9->apache-beam==2.49.0.dev0)
  Using cached jmespath-1.0.1-py3-none-any.whl (20 kB)
Collecting s3transfer<0.7.0,>=0.6.0 (from boto3<2,>=1.9->apache-beam==2.49.0.dev0)
  Using cached s3transfer-0.6.1-py3-none-any.whl (79 kB)
Collecting cffi>=1.12 (from cryptography>=36.0.0->apache-beam==2.49.0.dev0)
  Using cached cffi-1.15.1-cp37-cp37m-manylinux_2_17_x86_64.manylinux2014_x86_64.whl (427 kB)
Collecting oauth2client>=1.4.12 (from google-apitools<0.5.32,>=0.5.31->apache-beam==2.49.0.dev0)
  Using cached oauth2client-4.1.3-py2.py3-none-any.whl (98 kB)
Collecting pyasn1-modules>=0.2.1 (from google-auth<3,>=1.18.0->apache-beam==2.49.0.dev0)
  Using cached pyasn1_modules-0.3.0-py2.py3-none-any.whl (181 kB)
Collecting rsa<5,>=3.1.4 (from google-auth<3,>=1.18.0->apache-beam==2.49.0.dev0)
  Using cached rsa-4.9-py3-none-any.whl (34 kB)
Collecting urllib3<2.0 (from google-auth<3,>=1.18.0->apache-beam==2.49.0.dev0)
  Using cached urllib3-1.26.16-py2.py3-none-any.whl (143 kB)
Collecting google-api-core[grpc]!=2.0.*,!=2.1.*,!=2.2.*,!=2.3.0,<3.0.0dev,>=1.31.5 (from google-cloud-bigquery<4,>=2.0.0->apache-beam==2.49.0.dev0)
  Using cached google_api_core-2.11.0-py3-none-any.whl (120 kB)
Collecting google-resumable-media<3.0dev,>=0.6.0 (from google-cloud-bigquery<4,>=2.0.0->apache-beam==2.49.0.dev0)
  Using cached google_resumable_media-2.5.0-py2.py3-none-any.whl (77 kB)
Requirement already satisfied: packaging>=20.0.0 in <https://ci-beam.apache.org/job/beam_LoadTests_Python_CoGBK_Dataflow_Batch/ws/src/build/gradleenv/1329484227/lib/python3.7/site-packages> (from google-cloud-bigquery<4,>=2.0.0->apache-beam==2.49.0.dev0) (23.1)
Collecting grpc-google-iam-v1<1.0.0dev,>=0.12.4 (from google-cloud-bigtable<2.18.0,>=2.0.0->apache-beam==2.49.0.dev0)
  Using cached grpc_google_iam_v1-0.12.6-py2.py3-none-any.whl (26 kB)
Collecting grpcio-status>=1.33.2 (from google-cloud-pubsub<3,>=2.1.0->apache-beam==2.49.0.dev0)
  Using cached grpcio_status-1.54.2-py3-none-any.whl (5.1 kB)
Collecting overrides<7.0.0,>=6.0.1 (from google-cloud-pubsublite<2,>=1.2.0->apache-beam==2.49.0.dev0)
  Using cached overrides-6.5.0-py3-none-any.whl (17 kB)
Collecting sqlparse>=0.4.4 (from google-cloud-spanner<4,>=3.0.0->apache-beam==2.49.0.dev0)
  Using cached sqlparse-0.4.4-py3-none-any.whl (41 kB)
Collecting docopt (from hdfs<3.0.0,>=2.1.0->apache-beam==2.49.0.dev0)
  Using cached docopt-0.6.2-py2.py3-none-any.whl
Collecting pyparsing!=3.0.0,!=3.0.1,!=3.0.2,!=3.0.3,<4,>=2.4.2 (from httplib2<0.23.0,>=0.8->apache-beam==2.49.0.dev0)
  Using cached pyparsing-3.0.9-py3-none-any.whl (98 kB)
Collecting attrs>=19.2.0 (from hypothesis<=7.0.0,>5.0.0->apache-beam==2.49.0.dev0)
  Using cached attrs-23.1.0-py3-none-any.whl (61 kB)
Collecting sortedcontainers<3.0.0,>=2.1.0 (from hypothesis<=7.0.0,>5.0.0->apache-beam==2.49.0.dev0)
  Using cached sortedcontainers-2.4.0-py2.py3-none-any.whl (29 kB)
Collecting exceptiongroup>=1.0.0 (from hypothesis<=7.0.0,>5.0.0->apache-beam==2.49.0.dev0)
  Using cached exceptiongroup-1.1.1-py3-none-any.whl (14 kB)
Collecting dnspython<3.0.0,>=1.16.0 (from pymongo<5.0.0,>=3.8.0->apache-beam==2.49.0.dev0)
  Using cached dnspython-2.3.0-py3-none-any.whl (283 kB)
Collecting iniconfig (from pytest<8.0,>=7.1.2->apache-beam==2.49.0.dev0)
  Using cached iniconfig-2.0.0-py3-none-any.whl (5.9 kB)
Requirement already satisfied: pluggy<2.0,>=0.12 in <https://ci-beam.apache.org/job/beam_LoadTests_Python_CoGBK_Dataflow_Batch/ws/src/build/gradleenv/1329484227/lib/python3.7/site-packages> (from pytest<8.0,>=7.1.2->apache-beam==2.49.0.dev0) (1.0.0)
Collecting tomli>=1.0.0 (from pytest<8.0,>=7.1.2->apache-beam==2.49.0.dev0)
  Using cached tomli-2.0.1-py3-none-any.whl (12 kB)
Requirement already satisfied: importlib-metadata>=0.12 in <https://ci-beam.apache.org/job/beam_LoadTests_Python_CoGBK_Dataflow_Batch/ws/src/build/gradleenv/1329484227/lib/python3.7/site-packages> (from pytest<8.0,>=7.1.2->apache-beam==2.49.0.dev0) (2.1.3)
Collecting execnet>=1.1 (from pytest-xdist<4,>=2.5.0->apache-beam==2.49.0.dev0)
  Using cached execnet-1.9.0-py2.py3-none-any.whl (39 kB)
Collecting charset-normalizer<4,>=2 (from requests<3.0.0,>=2.24.0->apache-beam==2.49.0.dev0)
  Using cached charset_normalizer-3.1.0-cp37-cp37m-manylinux_2_17_x86_64.manylinux2014_x86_64.whl (171 kB)
Collecting idna<4,>=2.5 (from requests<3.0.0,>=2.24.0->apache-beam==2.49.0.dev0)
  Using cached idna-3.4-py3-none-any.whl (61 kB)
Collecting certifi>=2017.4.17 (from requests<3.0.0,>=2.24.0->apache-beam==2.49.0.dev0)
  Using cached certifi-2023.5.7-py3-none-any.whl (156 kB)
Collecting scipy>=1.1.0 (from scikit-learn>=0.20.0->apache-beam==2.49.0.dev0)
  Using cached scipy-1.7.3-cp37-cp37m-manylinux_2_12_x86_64.manylinux2010_x86_64.whl (38.1 MB)
Collecting threadpoolctl>=2.0.0 (from scikit-learn>=0.20.0->apache-beam==2.49.0.dev0)
  Using cached threadpoolctl-3.1.0-py3-none-any.whl (14 kB)
Collecting greenlet!=0.4.17 (from sqlalchemy<2.0,>=1.3->apache-beam==2.49.0.dev0)
  Using cached greenlet-2.0.2-cp37-cp37m-manylinux_2_17_x86_64.manylinux2014_x86_64.whl (566 kB)
Collecting docker>=4.0.0 (from testcontainers[mysql]<4.0.0,>=3.0.3->apache-beam==2.49.0.dev0)
  Using cached docker-6.1.3-py3-none-any.whl (148 kB)
Collecting wrapt (from testcontainers[mysql]<4.0.0,>=3.0.3->apache-beam==2.49.0.dev0)
  Using cached wrapt-1.15.0-cp37-cp37m-manylinux_2_5_x86_64.manylinux1_x86_64.manylinux_2_17_x86_64.manylinux2014_x86_64.whl (75 kB)
Collecting deprecation (from testcontainers[mysql]<4.0.0,>=3.0.3->apache-beam==2.49.0.dev0)
  Using cached deprecation-2.1.0-py2.py3-none-any.whl (11 kB)
Collecting pymysql (from testcontainers[mysql]<4.0.0,>=3.0.3->apache-beam==2.49.0.dev0)
  Using cached PyMySQL-1.0.3-py3-none-any.whl (43 kB)
Collecting pycparser (from cffi>=1.12->cryptography>=36.0.0->apache-beam==2.49.0.dev0)
  Using cached pycparser-2.21-py2.py3-none-any.whl (118 kB)
Collecting websocket-client>=0.32.0 (from docker>=4.0.0->testcontainers[mysql]<4.0.0,>=3.0.3->apache-beam==2.49.0.dev0)
  Using cached websocket_client-1.5.2-py3-none-any.whl (56 kB)
Collecting googleapis-common-protos<2.0dev,>=1.56.2 (from google-api-core[grpc]!=2.0.*,!=2.1.*,!=2.2.*,!=2.3.0,<3.0.0dev,>=1.31.5->google-cloud-bigquery<4,>=2.0.0->apache-beam==2.49.0.dev0)
  Using cached googleapis_common_protos-1.59.0-py2.py3-none-any.whl (223 kB)
Collecting google-crc32c<2.0dev,>=1.0 (from google-resumable-media<3.0dev,>=0.6.0->google-cloud-bigquery<4,>=2.0.0->apache-beam==2.49.0.dev0)
  Using cached google_crc32c-1.5.0-cp37-cp37m-manylinux_2_17_x86_64.manylinux2014_x86_64.whl (32 kB)
Requirement already satisfied: zipp>=0.5 in <https://ci-beam.apache.org/job/beam_LoadTests_Python_CoGBK_Dataflow_Batch/ws/src/build/gradleenv/1329484227/lib/python3.7/site-packages> (from importlib-metadata>=0.12->pytest<8.0,>=7.1.2->apache-beam==2.49.0.dev0) (3.15.0)
Collecting PyJWT[crypto]<3,>=1.0.0 (from msal<2.0.0,>=1.20.0->azure-identity<2,>=1.12.0->apache-beam==2.49.0.dev0)
  Using cached PyJWT-2.7.0-py3-none-any.whl (22 kB)
Collecting portalocker<3,>=1.0 (from msal-extensions<2.0.0,>=0.3.0->azure-identity<2,>=1.12.0->apache-beam==2.49.0.dev0)
  Using cached portalocker-2.7.0-py2.py3-none-any.whl (15 kB)
Collecting pyasn1>=0.1.7 (from oauth2client>=1.4.12->google-apitools<0.5.32,>=0.5.31->apache-beam==2.49.0.dev0)
  Using cached pyasn1-0.5.0-py2.py3-none-any.whl (83 kB)
Building wheels for collected packages: apache-beam
  Building wheel for apache-beam (setup.py): started
  Building wheel for apache-beam (setup.py): finished with status 'done'
  Created wheel for apache-beam: filename=apache_beam-2.49.0.dev0-py3-none-any.whl size=3197278 sha256=6ed576876f2d272b3425cabc59786bf3e20bb65a3094712267eb6a3ab0df8733
  Stored in directory: /home/jenkins/.cache/pip/wheels/87/c1/ab/373455ac940ce11c5a367f32de9878735ae28a9495b61a9393
Successfully built apache-beam
Installing collected packages: sortedcontainers, pytz, docopt, crcmod, zstandard, wrapt, websocket-client, urllib3, tomli, threadpoolctl, tenacity, sqlparse, scipy, regex, pyyaml, python-dateutil, pyparsing, pymysql, PyJWT, pyhamcrest, pycparser, pyasn1, pyarrow, psycopg2-binary, proto-plus, portalocker, parameterized, overrides, orjson, objsize, mock, joblib, jmespath, isodate, iniconfig, idna, greenlet, googleapis-common-protos, google-crc32c, fasteners, fastavro, execnet, exceptiongroup, dnspython, dill, deprecation, cloudpickle, charset-normalizer, certifi, cachetools, sqlalchemy, scikit-learn, rsa, requests, pymongo, pydot, pyasn1-modules, pandas, httplib2, grpcio-status, google-resumable-media, freezegun, cffi, botocore, attrs, s3transfer, requests_mock, pytest, oauth2client, hypothesis, hdfs, grpc-google-iam-v1, google-auth, docker, cryptography, azure-core, testcontainers, pytest-xdist, pytest-timeout, google-auth-httplib2, google-apitools, google-api-core, boto3, azure-storage-blob, apache-beam, msal, google-cloud-core, msal-extensions, google-cloud-vision, google-cloud-videointelligence, google-cloud-spanner, google-cloud-recommendations-ai, google-cloud-pubsub, google-cloud-language, google-cloud-dlp, google-cloud-datastore, google-cloud-bigtable, google-cloud-bigquery-storage, google-cloud-bigquery, google-cloud-pubsublite, azure-identity
Successfully installed PyJWT-2.7.0 apache-beam-2.49.0.dev0 attrs-23.1.0 azure-core-1.27.0 azure-identity-1.13.0 azure-storage-blob-12.16.0 boto3-1.26.147 botocore-1.29.147 cachetools-5.3.1 certifi-2023.5.7 cffi-1.15.1 charset-normalizer-3.1.0 cloudpickle-2.2.1 crcmod-1.7 cryptography-41.0.1 deprecation-2.1.0 dill-0.3.1.1 dnspython-2.3.0 docker-6.1.3 docopt-0.6.2 exceptiongroup-1.1.1 execnet-1.9.0 fastavro-1.7.4 fasteners-0.18 freezegun-1.2.2 google-api-core-2.11.0 google-apitools-0.5.31 google-auth-2.19.1 google-auth-httplib2-0.1.0 google-cloud-bigquery-3.11.0 google-cloud-bigquery-storage-2.20.0 google-cloud-bigtable-2.17.0 google-cloud-core-2.3.2 google-cloud-datastore-2.15.2 google-cloud-dlp-3.12.1 google-cloud-language-2.10.0 google-cloud-pubsub-2.17.1 google-cloud-pubsublite-1.7.0 google-cloud-recommendations-ai-0.10.3 google-cloud-spanner-3.35.1 google-cloud-videointelligence-2.11.2 google-cloud-vision-3.4.2 google-crc32c-1.5.0 google-resumable-media-2.5.0 googleapis-common-protos-1.59.0 greenlet-2.0.2 grpc-google-iam-v1-0.12.6 grpcio-status-1.54.2 hdfs-2.7.0 httplib2-0.22.0 hypothesis-6.76.0 idna-3.4 iniconfig-2.0.0 isodate-0.6.1 jmespath-1.0.1 joblib-1.2.0 mock-5.0.2 msal-1.22.0 msal-extensions-1.0.0 oauth2client-4.1.3 objsize-0.6.1 orjson-3.9.0 overrides-6.5.0 pandas-1.3.5 parameterized-0.9.0 portalocker-2.7.0 proto-plus-1.22.2 psycopg2-binary-2.9.6 pyarrow-11.0.0 pyasn1-0.5.0 pyasn1-modules-0.3.0 pycparser-2.21 pydot-1.4.2 pyhamcrest-2.0.4 pymongo-4.3.3 pymysql-1.0.3 pyparsing-3.0.9 pytest-7.3.1 pytest-timeout-2.1.0 pytest-xdist-3.3.1 python-dateutil-2.8.2 pytz-2023.3 pyyaml-6.0 regex-2023.6.3 requests-2.31.0 requests_mock-1.10.0 rsa-4.9 s3transfer-0.6.1 scikit-learn-1.0.2 scipy-1.7.3 sortedcontainers-2.4.0 sqlalchemy-1.4.48 sqlparse-0.4.4 tenacity-8.2.2 testcontainers-3.7.1 threadpoolctl-3.1.0 tomli-2.0.1 urllib3-1.26.16 websocket-client-1.5.2 wrapt-1.15.0 zstandard-0.21.0

> Task :sdks:python:apache_beam:testing:load_tests:run
INFO:apache_beam.runners.portability.stager:Copying Beam SDK "<https://ci-beam.apache.org/job/beam_LoadTests_Python_CoGBK_Dataflow_Batch/ws/src/sdks/python/build/apache-beam.tar.gz"> to staging location.
INFO:root:Using provided Python SDK container image: gcr.io/cloud-dataflow/v1beta3/python37:beam-master-20230601
INFO:root:Python SDK container image set to "gcr.io/cloud-dataflow/v1beta3/python37:beam-master-20230601" for Docker environment
INFO:apache_beam.runners.portability.fn_api_runner.translations:==================== <function pack_combiners at 0x7efd576be320> ====================
INFO:apache_beam.runners.portability.fn_api_runner.translations:==================== <function sort_stages at 0x7efd576beb00> ====================
INFO:apache_beam.runners.dataflow.internal.apiclient:Defaulting to the temp_location as staging_location: gs://temp-storage-for-perf-tests/loadtests
INFO:apache_beam.internal.gcp.auth:Setting socket default timeout to 60 seconds.
INFO:apache_beam.internal.gcp.auth:socket default timeout is 60.0 seconds.
INFO:apache_beam.runners.dataflow.internal.apiclient:Starting GCS upload to gs://temp-storage-for-perf-tests/loadtests/load-tests-python-dataflow-batch-cogbk-1-0606095338.1686052727.881019/dataflow_python_sdk.tar...
INFO:apache_beam.runners.dataflow.internal.apiclient:Completed GCS upload to gs://temp-storage-for-perf-tests/loadtests/load-tests-python-dataflow-batch-cogbk-1-0606095338.1686052727.881019/dataflow_python_sdk.tar in 0 seconds.
INFO:apache_beam.runners.dataflow.internal.apiclient:Starting GCS upload to gs://temp-storage-for-perf-tests/loadtests/load-tests-python-dataflow-batch-cogbk-1-0606095338.1686052727.881019/pipeline.pb...
INFO:apache_beam.runners.dataflow.internal.apiclient:Completed GCS upload to gs://temp-storage-for-perf-tests/loadtests/load-tests-python-dataflow-batch-cogbk-1-0606095338.1686052727.881019/pipeline.pb in 0 seconds.
INFO:apache_beam.runners.dataflow.internal.apiclient:Create job: <Job
 clientRequestId: '20230606115847881950-3980'
 createTime: '2023-06-06T11:58:49.233573Z'
 currentStateTime: '1970-01-01T00:00:00Z'
 id: '2023-06-06_04_58_48-6900115414304048834'
 location: 'us-central1'
 name: 'load-tests-python-dataflow-batch-cogbk-1-0606095338'
 projectId: 'apache-beam-testing'
 stageStates: []
 startTime: '2023-06-06T11:58:49.233573Z'
 steps: []
 tempFiles: []
 type: TypeValueValuesEnum(JOB_TYPE_BATCH, 1)>
INFO:apache_beam.runners.dataflow.internal.apiclient:Created job with id: [2023-06-06_04_58_48-6900115414304048834]
INFO:apache_beam.runners.dataflow.internal.apiclient:Submitted job: 2023-06-06_04_58_48-6900115414304048834
INFO:apache_beam.runners.dataflow.internal.apiclient:To access the Dataflow monitoring console, please navigate to https://console.cloud.google.com/dataflow/jobs/us-central1/2023-06-06_04_58_48-6900115414304048834?project=apache-beam-testing
INFO:apache_beam.runners.dataflow.dataflow_runner:Job 2023-06-06_04_58_48-6900115414304048834 is in state JOB_STATE_PENDING
INFO:apache_beam.runners.dataflow.dataflow_runner:2023-06-06T11:58:48.753Z: JOB_MESSAGE_BASIC: Dataflow Runner V2 auto-enabled. Use --experiments=disable_runner_v2 to opt out.
INFO:apache_beam.runners.dataflow.dataflow_runner:2023-06-06T11:58:51.894Z: JOB_MESSAGE_BASIC: Worker configuration: e2-standard-2 in us-central1-f.
INFO:apache_beam.runners.dataflow.dataflow_runner:2023-06-06T11:58:53.284Z: JOB_MESSAGE_DETAILED: Expanding SplittableParDo operations into optimizable parts.
INFO:apache_beam.runners.dataflow.dataflow_runner:2023-06-06T11:58:53.319Z: JOB_MESSAGE_DETAILED: Expanding CollectionToSingleton operations into optimizable parts.
INFO:apache_beam.runners.dataflow.dataflow_runner:2023-06-06T11:58:53.373Z: JOB_MESSAGE_DETAILED: Expanding CoGroupByKey operations into optimizable parts.
INFO:apache_beam.runners.dataflow.dataflow_runner:2023-06-06T11:58:53.400Z: JOB_MESSAGE_DEBUG: Combiner lifting skipped for step CoGroupByKey /CoGroupByKeyImpl/GroupByKey: GroupByKey not followed by a combiner.
INFO:apache_beam.runners.dataflow.dataflow_runner:2023-06-06T11:58:53.423Z: JOB_MESSAGE_DETAILED: Expanding GroupByKey operations into optimizable parts.
INFO:apache_beam.runners.dataflow.dataflow_runner:2023-06-06T11:58:53.454Z: JOB_MESSAGE_DEBUG: Annotating graph with Autotuner information.
INFO:apache_beam.runners.dataflow.dataflow_runner:2023-06-06T11:58:53.484Z: JOB_MESSAGE_DETAILED: Fusing adjacent ParDo, Read, Write, and Flatten operations
INFO:apache_beam.runners.dataflow.dataflow_runner:2023-06-06T11:58:53.511Z: JOB_MESSAGE_DEBUG: Inserted coder converter after flatten ref_AppliedPTransform_CoGroupByKey-CoGroupByKeyImpl-Flatten_18
INFO:apache_beam.runners.dataflow.dataflow_runner:2023-06-06T11:58:53.532Z: JOB_MESSAGE_DETAILED: Unzipping flatten ref_AppliedPTransform_CoGroupByKey-CoGroupByKeyImpl-Flatten_18 for input ref_AppliedPTransform_CoGroupByKey-CoGroupByKeyImpl-Tag-pc1-_16.None
INFO:apache_beam.runners.dataflow.dataflow_runner:2023-06-06T11:58:53.559Z: JOB_MESSAGE_DETAILED: Fusing unzipped copy of CoGroupByKey /CoGroupByKeyImpl/Flatten/OutputIdentity, through flatten CoGroupByKey /CoGroupByKeyImpl/Flatten, into producer CoGroupByKey /CoGroupByKeyImpl/Tag[pc1]
INFO:apache_beam.runners.dataflow.dataflow_runner:2023-06-06T11:58:53.586Z: JOB_MESSAGE_DETAILED: Fusing consumer CoGroupByKey /CoGroupByKeyImpl/MapTuple(collect_values) into CoGroupByKey /CoGroupByKeyImpl/GroupByKey/Read
INFO:apache_beam.runners.dataflow.dataflow_runner:2023-06-06T11:58:53.607Z: JOB_MESSAGE_DETAILED: Fusing consumer Consume Joined Collections into CoGroupByKey /CoGroupByKeyImpl/MapTuple(collect_values)
INFO:apache_beam.runners.dataflow.dataflow_runner:2023-06-06T11:58:53.624Z: JOB_MESSAGE_DETAILED: Fusing consumer Measure time: End into Consume Joined Collections
INFO:apache_beam.runners.dataflow.dataflow_runner:2023-06-06T11:58:53.653Z: JOB_MESSAGE_DETAILED: Unzipping flatten ref_AppliedPTransform_CoGroupByKey-CoGroupByKeyImpl-Flatten_18-u23 for input ref_AppliedPTransform_CoGroupByKey-CoGroupByKeyImpl-Flatten_18.None-c21
INFO:apache_beam.runners.dataflow.dataflow_runner:2023-06-06T11:58:53.684Z: JOB_MESSAGE_DETAILED: Fusing unzipped copy of CoGroupByKey /CoGroupByKeyImpl/GroupByKey/Write, through flatten CoGroupByKey /CoGroupByKeyImpl/Flatten/Unzipped-1, into producer CoGroupByKey /CoGroupByKeyImpl/Flatten/OutputIdentity
INFO:apache_beam.runners.dataflow.dataflow_runner:2023-06-06T11:58:53.711Z: JOB_MESSAGE_DETAILED: Fusing consumer CoGroupByKey /CoGroupByKeyImpl/Flatten/OutputIdentity into CoGroupByKey /CoGroupByKeyImpl/Tag[pc2]
INFO:apache_beam.runners.dataflow.dataflow_runner:2023-06-06T11:58:53.741Z: JOB_MESSAGE_DETAILED: Fusing consumer CoGroupByKey /CoGroupByKeyImpl/GroupByKey/Write into CoGroupByKey /CoGroupByKeyImpl/Flatten/OutputIdentity
INFO:apache_beam.runners.dataflow.dataflow_runner:2023-06-06T11:58:53.771Z: JOB_MESSAGE_DETAILED: Fusing consumer Read pc1/Map(<lambda at iobase.py:908>) into Read pc1/Impulse
INFO:apache_beam.runners.dataflow.dataflow_runner:2023-06-06T11:58:53.798Z: JOB_MESSAGE_DETAILED: Fusing consumer ref_AppliedPTransform_Read-pc1-SDFBoundedSourceReader-ParDo-SDFBoundedSourceDoFn-_6/PairWithRestriction into Read pc1/Map(<lambda at iobase.py:908>)
INFO:apache_beam.runners.dataflow.dataflow_runner:2023-06-06T11:58:53.829Z: JOB_MESSAGE_DETAILED: Fusing consumer ref_AppliedPTransform_Read-pc1-SDFBoundedSourceReader-ParDo-SDFBoundedSourceDoFn-_6/SplitWithSizing into ref_AppliedPTransform_Read-pc1-SDFBoundedSourceReader-ParDo-SDFBoundedSourceDoFn-_6/PairWithRestriction
INFO:apache_beam.runners.dataflow.dataflow_runner:2023-06-06T11:58:53.853Z: JOB_MESSAGE_DETAILED: Fusing consumer Measure time: Start pc1 into ref_AppliedPTransform_Read-pc1-SDFBoundedSourceReader-ParDo-SDFBoundedSourceDoFn-_6/ProcessElementAndRestrictionWithSizing
INFO:apache_beam.runners.dataflow.dataflow_runner:2023-06-06T11:58:53.886Z: JOB_MESSAGE_DETAILED: Fusing consumer CoGroupByKey /CoGroupByKeyImpl/Tag[pc1] into Measure time: Start pc1
INFO:apache_beam.runners.dataflow.dataflow_runner:2023-06-06T11:58:53.920Z: JOB_MESSAGE_DETAILED: Fusing consumer Read pc2/Map(<lambda at iobase.py:908>) into Read pc2/Impulse
INFO:apache_beam.runners.dataflow.dataflow_runner:2023-06-06T11:58:53.952Z: JOB_MESSAGE_DETAILED: Fusing consumer ref_AppliedPTransform_Read-pc2-SDFBoundedSourceReader-ParDo-SDFBoundedSourceDoFn-_12/PairWithRestriction into Read pc2/Map(<lambda at iobase.py:908>)
INFO:apache_beam.runners.dataflow.dataflow_runner:2023-06-06T11:58:53.984Z: JOB_MESSAGE_DETAILED: Fusing consumer ref_AppliedPTransform_Read-pc2-SDFBoundedSourceReader-ParDo-SDFBoundedSourceDoFn-_12/SplitWithSizing into ref_AppliedPTransform_Read-pc2-SDFBoundedSourceReader-ParDo-SDFBoundedSourceDoFn-_12/PairWithRestriction
INFO:apache_beam.runners.dataflow.dataflow_runner:2023-06-06T11:58:54.018Z: JOB_MESSAGE_DETAILED: Fusing consumer Measure time: Start pc2 into ref_AppliedPTransform_Read-pc2-SDFBoundedSourceReader-ParDo-SDFBoundedSourceDoFn-_12/ProcessElementAndRestrictionWithSizing
INFO:apache_beam.runners.dataflow.dataflow_runner:2023-06-06T11:58:54.042Z: JOB_MESSAGE_DETAILED: Fusing consumer CoGroupByKey /CoGroupByKeyImpl/Tag[pc2] into Measure time: Start pc2
INFO:apache_beam.runners.dataflow.dataflow_runner:2023-06-06T11:58:54.091Z: JOB_MESSAGE_DEBUG: Workflow config is missing a default resource spec.
INFO:apache_beam.runners.dataflow.dataflow_runner:2023-06-06T11:58:54.119Z: JOB_MESSAGE_DEBUG: Adding StepResource setup and teardown to workflow graph.
INFO:apache_beam.runners.dataflow.dataflow_runner:2023-06-06T11:58:54.145Z: JOB_MESSAGE_DEBUG: Adding workflow start and stop steps.
INFO:apache_beam.runners.dataflow.dataflow_runner:2023-06-06T11:58:54.171Z: JOB_MESSAGE_DEBUG: Assigning stage ids.
INFO:apache_beam.runners.dataflow.dataflow_runner:2023-06-06T11:58:54.289Z: JOB_MESSAGE_DEBUG: Executing wait step start33
INFO:apache_beam.runners.dataflow.dataflow_runner:2023-06-06T11:58:54.347Z: JOB_MESSAGE_BASIC: Executing operation Read pc2/Impulse+Read pc2/Map(<lambda at iobase.py:908>)+ref_AppliedPTransform_Read-pc2-SDFBoundedSourceReader-ParDo-SDFBoundedSourceDoFn-_12/PairWithRestriction+ref_AppliedPTransform_Read-pc2-SDFBoundedSourceReader-ParDo-SDFBoundedSourceDoFn-_12/SplitWithSizing
INFO:apache_beam.runners.dataflow.dataflow_runner:2023-06-06T11:58:54.367Z: JOB_MESSAGE_BASIC: Executing operation Read pc1/Impulse+Read pc1/Map(<lambda at iobase.py:908>)+ref_AppliedPTransform_Read-pc1-SDFBoundedSourceReader-ParDo-SDFBoundedSourceDoFn-_6/PairWithRestriction+ref_AppliedPTransform_Read-pc1-SDFBoundedSourceReader-ParDo-SDFBoundedSourceDoFn-_6/SplitWithSizing
INFO:apache_beam.runners.dataflow.dataflow_runner:2023-06-06T11:58:54.390Z: JOB_MESSAGE_DEBUG: Starting **** pool setup.
INFO:apache_beam.runners.dataflow.dataflow_runner:2023-06-06T11:58:54.419Z: JOB_MESSAGE_BASIC: Starting 5 ****s in us-central1-f...
INFO:apache_beam.runners.dataflow.dataflow_runner:Job 2023-06-06_04_58_48-6900115414304048834 is in state JOB_STATE_RUNNING
INFO:apache_beam.runners.dataflow.dataflow_runner:2023-06-06T11:59:08.948Z: JOB_MESSAGE_BASIC: Your project already contains 100 Dataflow-created metric descriptors, so new user metrics of the form custom.googleapis.com/* will not be created. However, all user metrics are also available in the metric dataflow.googleapis.com/job/user_counter. If you rely on the custom metrics, you can delete old / unused metric descriptors. See https://developers.google.com/apis-explorer/#p/monitoring/v3/monitoring.projects.metricDescriptors.list and https://developers.google.com/apis-explorer/#p/monitoring/v3/monitoring.projects.metricDescriptors.delete
INFO:apache_beam.runners.dataflow.dataflow_runner:2023-06-06T11:59:36.946Z: JOB_MESSAGE_DETAILED: Autoscaling: Raised the number of ****s to 3 based on the rate of progress in the currently running stage(s).
INFO:apache_beam.runners.dataflow.dataflow_runner:2023-06-06T11:59:36.967Z: JOB_MESSAGE_DETAILED: Autoscaling: Resized **** pool to 3, though goal was 5.  This could be a quota issue.
INFO:apache_beam.runners.dataflow.dataflow_runner:2023-06-06T11:59:46.802Z: JOB_MESSAGE_DETAILED: Autoscaling: Raised the number of ****s to 5 based on the rate of progress in the currently running stage(s).
INFO:apache_beam.runners.dataflow.dataflow_runner:2023-06-06T12:00:07.238Z: JOB_MESSAGE_DETAILED: Workers have started successfully.
INFO:apache_beam.runners.dataflow.dataflow_runner:2023-06-06T12:58:54.912Z: JOB_MESSAGE_ERROR: Workflow failed. Causes: The Dataflow job appears to be stuck because no **** activity has been seen in the last 1h. Please check the **** logs in Stackdriver Logging. You can also get help with Cloud Dataflow at https://cloud.google.com/dataflow/support.
INFO:apache_beam.runners.dataflow.dataflow_runner:2023-06-06T12:58:54.981Z: JOB_MESSAGE_BASIC: Cancel request is committed for workflow job: 2023-06-06_04_58_48-6900115414304048834.
INFO:apache_beam.runners.dataflow.dataflow_runner:2023-06-06T12:58:54.998Z: JOB_MESSAGE_ERROR: The Dataflow job appears to be stuck because no **** activity has been seen in the last 1h. Please check the **** logs in Stackdriver Logging. You can also get help with Cloud Dataflow at https://cloud.google.com/dataflow/support.
INFO:apache_beam.runners.dataflow.dataflow_runner:2023-06-06T12:58:55.066Z: JOB_MESSAGE_WARNING: Unable to delete temp files: "gs://temp-storage-for-perf-tests/loadtests/load-tests-python-dataflow-batch-cogbk-1-0606095338.1686052727.881019/dax-tmp-2023-06-06_04_58_48-6900115414304048834-S01-0-9fffb319e88263ee/tmp-9fffb319e8826a23@DAX.sdfmeta."
INFO:apache_beam.runners.dataflow.dataflow_runner:2023-06-06T12:58:55.074Z: JOB_MESSAGE_WARNING: Unable to delete temp files: "gs://temp-storage-for-perf-tests/loadtests/load-tests-python-dataflow-batch-cogbk-1-0606095338.1686052727.881019/dax-tmp-2023-06-06_04_58_48-6900115414304048834-S02-0-834a28e3f5b26b88/tmp-834a28e3f5b26af1@DAX.sdfmeta."
INFO:apache_beam.runners.dataflow.dataflow_runner:2023-06-06T12:58:55.087Z: JOB_MESSAGE_WARNING: S01:Read pc1/Impulse+Read pc1/Map(<lambda at iobase.py:908>)+ref_AppliedPTransform_Read-pc1-SDFBoundedSourceReader-ParDo-SDFBoundedSourceDoFn-_6/PairWithRestriction+ref_AppliedPTransform_Read-pc1-SDFBoundedSourceReader-ParDo-SDFBoundedSourceDoFn-_6/SplitWithSizing failed.
INFO:apache_beam.runners.dataflow.dataflow_runner:2023-06-06T12:58:55.097Z: JOB_MESSAGE_WARNING: S02:Read pc2/Impulse+Read pc2/Map(<lambda at iobase.py:908>)+ref_AppliedPTransform_Read-pc2-SDFBoundedSourceReader-ParDo-SDFBoundedSourceDoFn-_12/PairWithRestriction+ref_AppliedPTransform_Read-pc2-SDFBoundedSourceReader-ParDo-SDFBoundedSourceDoFn-_12/SplitWithSizing failed.
INFO:apache_beam.runners.dataflow.dataflow_runner:2023-06-06T12:58:55.111Z: JOB_MESSAGE_BASIC: Finished operation Read pc1/Impulse+Read pc1/Map(<lambda at iobase.py:908>)+ref_AppliedPTransform_Read-pc1-SDFBoundedSourceReader-ParDo-SDFBoundedSourceDoFn-_6/PairWithRestriction+ref_AppliedPTransform_Read-pc1-SDFBoundedSourceReader-ParDo-SDFBoundedSourceDoFn-_6/SplitWithSizing
INFO:apache_beam.runners.dataflow.dataflow_runner:2023-06-06T12:58:55.122Z: JOB_MESSAGE_BASIC: Finished operation Read pc2/Impulse+Read pc2/Map(<lambda at iobase.py:908>)+ref_AppliedPTransform_Read-pc2-SDFBoundedSourceReader-ParDo-SDFBoundedSourceDoFn-_12/PairWithRestriction+ref_AppliedPTransform_Read-pc2-SDFBoundedSourceReader-ParDo-SDFBoundedSourceDoFn-_12/SplitWithSizing
INFO:apache_beam.runners.dataflow.dataflow_runner:2023-06-06T12:58:55.606Z: JOB_MESSAGE_DETAILED: Cleaning up.
INFO:apache_beam.runners.dataflow.dataflow_runner:2023-06-06T12:58:55.641Z: JOB_MESSAGE_DEBUG: Starting **** pool teardown.
INFO:apache_beam.runners.dataflow.dataflow_runner:2023-06-06T12:58:55.660Z: JOB_MESSAGE_BASIC: Stopping **** pool...
INFO:apache_beam.runners.dataflow.dataflow_runner:2023-06-06T13:01:06.423Z: JOB_MESSAGE_DETAILED: Autoscaling: Resized **** pool from 5 to 0.
INFO:apache_beam.runners.dataflow.dataflow_runner:2023-06-06T13:01:06.458Z: JOB_MESSAGE_BASIC: Worker pool stopped.
INFO:apache_beam.runners.dataflow.dataflow_runner:2023-06-06T13:01:06.476Z: JOB_MESSAGE_DEBUG: Tearing down pending resources...
INFO:apache_beam.runners.dataflow.dataflow_runner:Job 2023-06-06_04_58_48-6900115414304048834 is in state JOB_STATE_FAILED
ERROR:apache_beam.runners.dataflow.dataflow_runner:Console URL: https://console.cloud.google.com/dataflow/jobs/<RegionId>/2023-06-06_04_58_48-6900115414304048834?project=<ProjectId>
Traceback (most recent call last):
  File "/usr/lib/python3.7/runpy.py", line 193, in _run_module_as_main
    "__main__", mod_spec)
  File "/usr/lib/python3.7/runpy.py", line 85, in _run_code
    exec(code, run_globals)
  File "<https://ci-beam.apache.org/job/beam_LoadTests_Python_CoGBK_Dataflow_Batch/ws/src/sdks/python/apache_beam/testing/load_tests/co_group_by_key_test.py",> line 144, in <module>
    CoGroupByKeyTest().run()
  File "<https://ci-beam.apache.org/job/beam_LoadTests_Python_CoGBK_Dataflow_Batch/ws/src/sdks/python/apache_beam/testing/load_tests/load_test.py",> line 152, in run
    state = self.result.wait_until_finish(duration=self.timeout_ms)
  File "<https://ci-beam.apache.org/job/beam_LoadTests_Python_CoGBK_Dataflow_Batch/ws/src/sdks/python/apache_beam/runners/dataflow/dataflow_runner.py",> line 1566, in wait_until_finish
    self)
apache_beam.runners.dataflow.dataflow_runner.DataflowRuntimeException: Dataflow pipeline failed. State: FAILED, Error:
The Dataflow job appears to be stuck because no **** activity has been seen in the last 1h. Please check the **** logs in Stackdriver Logging. You can also get help with Cloud Dataflow at https://cloud.google.com/dataflow/support.

> Task :sdks:python:apache_beam:testing:load_tests:run FAILED

FAILURE: Build failed with an exception.

* Where:
Build file '<https://ci-beam.apache.org/job/beam_LoadTests_Python_CoGBK_Dataflow_Batch/ws/src/sdks/python/apache_beam/testing/load_tests/build.gradle'> line: 63

* What went wrong:
Execution failed for task ':sdks:python:apache_beam:testing:load_tests:run'.
> error occurred

* Try:
> Run with --stacktrace option to get the stack trace.
> Run with --info or --debug option to get more log output.

* Get more help at https://help.gradle.org

Deprecated Gradle features were used in this build, making it incompatible with Gradle 8.0.

You can use '--warning-mode all' to show the individual deprecation warnings and determine if they come from your own scripts or plugins.

See https://docs.gradle.org/7.5.1/userguide/command_line_interface.html#sec:command_line_warnings

BUILD FAILED in 1h 4m 23s
15 actionable tasks: 9 executed, 4 from cache, 2 up-to-date

Publishing build scan...
https://ge.apache.org/s/y222zsuvdacg6

Build step 'Invoke Gradle script' changed build result to FAILURE
Build step 'Invoke Gradle script' marked build as failure

---------------------------------------------------------------------
To unsubscribe, e-mail: builds-unsubscribe@beam.apache.org
For additional commands, e-mail: builds-help@beam.apache.org


Jenkins build is back to normal : beam_LoadTests_Python_CoGBK_Dataflow_Batch #1420

Posted by Apache Jenkins Server <je...@builds.apache.org>.
See <https://ci-beam.apache.org/job/beam_LoadTests_Python_CoGBK_Dataflow_Batch/1420/display/redirect?page=changes>


---------------------------------------------------------------------
To unsubscribe, e-mail: builds-unsubscribe@beam.apache.org
For additional commands, e-mail: builds-help@beam.apache.org


Build failed in Jenkins: beam_LoadTests_Python_CoGBK_Dataflow_Batch #1419

Posted by Apache Jenkins Server <je...@builds.apache.org>.
See <https://ci-beam.apache.org/job/beam_LoadTests_Python_CoGBK_Dataflow_Batch/1419/display/redirect>

Changes:


------------------------------------------
[...truncated 32.92 KB...]
  Using cached google_cloud_bigtable-2.17.0-py2.py3-none-any.whl (288 kB)
Collecting google-cloud-spanner<4,>=3.0.0 (from apache-beam==2.49.0.dev0)
  Using cached google_cloud_spanner-3.36.0-py2.py3-none-any.whl (332 kB)
Collecting google-cloud-dlp<4,>=3.0.0 (from apache-beam==2.49.0.dev0)
  Using cached google_cloud_dlp-3.12.1-py2.py3-none-any.whl (143 kB)
Collecting google-cloud-language<3,>=2.0 (from apache-beam==2.49.0.dev0)
  Using cached google_cloud_language-2.10.0-py2.py3-none-any.whl (101 kB)
Collecting google-cloud-videointelligence<3,>=2.0 (from apache-beam==2.49.0.dev0)
  Using cached google_cloud_videointelligence-2.11.2-py2.py3-none-any.whl (229 kB)
Collecting google-cloud-vision<4,>=2 (from apache-beam==2.49.0.dev0)
  Using cached google_cloud_vision-3.4.2-py2.py3-none-any.whl (444 kB)
Collecting google-cloud-recommendations-ai<0.11.0,>=0.1.0 (from apache-beam==2.49.0.dev0)
  Using cached google_cloud_recommendations_ai-0.10.3-py2.py3-none-any.whl (173 kB)
Requirement already satisfied: six>=1.11.0 in <https://ci-beam.apache.org/job/beam_LoadTests_Python_CoGBK_Dataflow_Batch/ws/src/build/gradleenv/1329484227/lib/python3.7/site-packages> (from azure-core<2,>=1.7.0->apache-beam==2.49.0.dev0) (1.16.0)
Collecting msal<2.0.0,>=1.20.0 (from azure-identity<2,>=1.12.0->apache-beam==2.49.0.dev0)
  Using cached msal-1.22.0-py2.py3-none-any.whl (90 kB)
Collecting msal-extensions<2.0.0,>=0.3.0 (from azure-identity<2,>=1.12.0->apache-beam==2.49.0.dev0)
  Using cached msal_extensions-1.0.0-py2.py3-none-any.whl (19 kB)
Collecting isodate>=0.6.1 (from azure-storage-blob<13,>=12.3.2->apache-beam==2.49.0.dev0)
  Using cached isodate-0.6.1-py2.py3-none-any.whl (41 kB)
Collecting botocore<1.30.0,>=1.29.148 (from boto3<2,>=1.9->apache-beam==2.49.0.dev0)
  Using cached botocore-1.29.148-py3-none-any.whl (10.8 MB)
Collecting jmespath<2.0.0,>=0.7.1 (from boto3<2,>=1.9->apache-beam==2.49.0.dev0)
  Using cached jmespath-1.0.1-py3-none-any.whl (20 kB)
Collecting s3transfer<0.7.0,>=0.6.0 (from boto3<2,>=1.9->apache-beam==2.49.0.dev0)
  Using cached s3transfer-0.6.1-py3-none-any.whl (79 kB)
Collecting cffi>=1.12 (from cryptography>=36.0.0->apache-beam==2.49.0.dev0)
  Using cached cffi-1.15.1-cp37-cp37m-manylinux_2_17_x86_64.manylinux2014_x86_64.whl (427 kB)
Collecting oauth2client>=1.4.12 (from google-apitools<0.5.32,>=0.5.31->apache-beam==2.49.0.dev0)
  Using cached oauth2client-4.1.3-py2.py3-none-any.whl (98 kB)
Collecting pyasn1-modules>=0.2.1 (from google-auth<3,>=1.18.0->apache-beam==2.49.0.dev0)
  Using cached pyasn1_modules-0.3.0-py2.py3-none-any.whl (181 kB)
Collecting rsa<5,>=3.1.4 (from google-auth<3,>=1.18.0->apache-beam==2.49.0.dev0)
  Using cached rsa-4.9-py3-none-any.whl (34 kB)
Collecting urllib3<2.0 (from google-auth<3,>=1.18.0->apache-beam==2.49.0.dev0)
  Using cached urllib3-1.26.16-py2.py3-none-any.whl (143 kB)
Collecting google-api-core[grpc]!=2.0.*,!=2.1.*,!=2.2.*,!=2.3.0,<3.0.0dev,>=1.31.5 (from google-cloud-bigquery<4,>=2.0.0->apache-beam==2.49.0.dev0)
  Using cached google_api_core-2.11.0-py3-none-any.whl (120 kB)
Collecting google-resumable-media<3.0dev,>=0.6.0 (from google-cloud-bigquery<4,>=2.0.0->apache-beam==2.49.0.dev0)
  Using cached google_resumable_media-2.5.0-py2.py3-none-any.whl (77 kB)
Requirement already satisfied: packaging>=20.0.0 in <https://ci-beam.apache.org/job/beam_LoadTests_Python_CoGBK_Dataflow_Batch/ws/src/build/gradleenv/1329484227/lib/python3.7/site-packages> (from google-cloud-bigquery<4,>=2.0.0->apache-beam==2.49.0.dev0) (23.1)
Collecting grpc-google-iam-v1<1.0.0dev,>=0.12.4 (from google-cloud-bigtable<2.18.0,>=2.0.0->apache-beam==2.49.0.dev0)
  Using cached grpc_google_iam_v1-0.12.6-py2.py3-none-any.whl (26 kB)
Collecting grpcio-status>=1.33.2 (from google-cloud-pubsub<3,>=2.1.0->apache-beam==2.49.0.dev0)
  Using cached grpcio_status-1.54.2-py3-none-any.whl (5.1 kB)
Collecting overrides<7.0.0,>=6.0.1 (from google-cloud-pubsublite<2,>=1.2.0->apache-beam==2.49.0.dev0)
  Using cached overrides-6.5.0-py3-none-any.whl (17 kB)
Collecting sqlparse>=0.4.4 (from google-cloud-spanner<4,>=3.0.0->apache-beam==2.49.0.dev0)
  Using cached sqlparse-0.4.4-py3-none-any.whl (41 kB)
Collecting docopt (from hdfs<3.0.0,>=2.1.0->apache-beam==2.49.0.dev0)
  Using cached docopt-0.6.2-py2.py3-none-any.whl
Collecting pyparsing!=3.0.0,!=3.0.1,!=3.0.2,!=3.0.3,<4,>=2.4.2 (from httplib2<0.23.0,>=0.8->apache-beam==2.49.0.dev0)
  Using cached pyparsing-3.0.9-py3-none-any.whl (98 kB)
Collecting attrs>=19.2.0 (from hypothesis<=7.0.0,>5.0.0->apache-beam==2.49.0.dev0)
  Using cached attrs-23.1.0-py3-none-any.whl (61 kB)
Collecting sortedcontainers<3.0.0,>=2.1.0 (from hypothesis<=7.0.0,>5.0.0->apache-beam==2.49.0.dev0)
  Using cached sortedcontainers-2.4.0-py2.py3-none-any.whl (29 kB)
Collecting exceptiongroup>=1.0.0 (from hypothesis<=7.0.0,>5.0.0->apache-beam==2.49.0.dev0)
  Using cached exceptiongroup-1.1.1-py3-none-any.whl (14 kB)
Collecting dnspython<3.0.0,>=1.16.0 (from pymongo<5.0.0,>=3.8.0->apache-beam==2.49.0.dev0)
  Using cached dnspython-2.3.0-py3-none-any.whl (283 kB)
Collecting iniconfig (from pytest<8.0,>=7.1.2->apache-beam==2.49.0.dev0)
  Using cached iniconfig-2.0.0-py3-none-any.whl (5.9 kB)
Requirement already satisfied: pluggy<2.0,>=0.12 in <https://ci-beam.apache.org/job/beam_LoadTests_Python_CoGBK_Dataflow_Batch/ws/src/build/gradleenv/1329484227/lib/python3.7/site-packages> (from pytest<8.0,>=7.1.2->apache-beam==2.49.0.dev0) (1.0.0)
Collecting tomli>=1.0.0 (from pytest<8.0,>=7.1.2->apache-beam==2.49.0.dev0)
  Using cached tomli-2.0.1-py3-none-any.whl (12 kB)
Requirement already satisfied: importlib-metadata>=0.12 in <https://ci-beam.apache.org/job/beam_LoadTests_Python_CoGBK_Dataflow_Batch/ws/src/build/gradleenv/1329484227/lib/python3.7/site-packages> (from pytest<8.0,>=7.1.2->apache-beam==2.49.0.dev0) (2.1.3)
Collecting execnet>=1.1 (from pytest-xdist<4,>=2.5.0->apache-beam==2.49.0.dev0)
  Using cached execnet-1.9.0-py2.py3-none-any.whl (39 kB)
Collecting charset-normalizer<4,>=2 (from requests<3.0.0,>=2.24.0->apache-beam==2.49.0.dev0)
  Using cached charset_normalizer-3.1.0-cp37-cp37m-manylinux_2_17_x86_64.manylinux2014_x86_64.whl (171 kB)
Collecting idna<4,>=2.5 (from requests<3.0.0,>=2.24.0->apache-beam==2.49.0.dev0)
  Using cached idna-3.4-py3-none-any.whl (61 kB)
Collecting certifi>=2017.4.17 (from requests<3.0.0,>=2.24.0->apache-beam==2.49.0.dev0)
  Using cached certifi-2023.5.7-py3-none-any.whl (156 kB)
Collecting scipy>=1.1.0 (from scikit-learn>=0.20.0->apache-beam==2.49.0.dev0)
  Using cached scipy-1.7.3-cp37-cp37m-manylinux_2_12_x86_64.manylinux2010_x86_64.whl (38.1 MB)
Collecting threadpoolctl>=2.0.0 (from scikit-learn>=0.20.0->apache-beam==2.49.0.dev0)
  Using cached threadpoolctl-3.1.0-py3-none-any.whl (14 kB)
Collecting greenlet!=0.4.17 (from sqlalchemy<2.0,>=1.3->apache-beam==2.49.0.dev0)
  Using cached greenlet-2.0.2-cp37-cp37m-manylinux_2_17_x86_64.manylinux2014_x86_64.whl (566 kB)
Collecting docker>=4.0.0 (from testcontainers[mysql]<4.0.0,>=3.0.3->apache-beam==2.49.0.dev0)
  Using cached docker-6.1.3-py3-none-any.whl (148 kB)
Collecting wrapt (from testcontainers[mysql]<4.0.0,>=3.0.3->apache-beam==2.49.0.dev0)
  Using cached wrapt-1.15.0-cp37-cp37m-manylinux_2_5_x86_64.manylinux1_x86_64.manylinux_2_17_x86_64.manylinux2014_x86_64.whl (75 kB)
Collecting deprecation (from testcontainers[mysql]<4.0.0,>=3.0.3->apache-beam==2.49.0.dev0)
  Using cached deprecation-2.1.0-py2.py3-none-any.whl (11 kB)
Collecting pymysql (from testcontainers[mysql]<4.0.0,>=3.0.3->apache-beam==2.49.0.dev0)
  Using cached PyMySQL-1.0.3-py3-none-any.whl (43 kB)
Collecting pycparser (from cffi>=1.12->cryptography>=36.0.0->apache-beam==2.49.0.dev0)
  Using cached pycparser-2.21-py2.py3-none-any.whl (118 kB)
Collecting websocket-client>=0.32.0 (from docker>=4.0.0->testcontainers[mysql]<4.0.0,>=3.0.3->apache-beam==2.49.0.dev0)
  Using cached websocket_client-1.5.2-py3-none-any.whl (56 kB)
Collecting googleapis-common-protos<2.0dev,>=1.56.2 (from google-api-core[grpc]!=2.0.*,!=2.1.*,!=2.2.*,!=2.3.0,<3.0.0dev,>=1.31.5->google-cloud-bigquery<4,>=2.0.0->apache-beam==2.49.0.dev0)
  Using cached googleapis_common_protos-1.59.0-py2.py3-none-any.whl (223 kB)
Collecting google-crc32c<2.0dev,>=1.0 (from google-resumable-media<3.0dev,>=0.6.0->google-cloud-bigquery<4,>=2.0.0->apache-beam==2.49.0.dev0)
  Using cached google_crc32c-1.5.0-cp37-cp37m-manylinux_2_17_x86_64.manylinux2014_x86_64.whl (32 kB)
Requirement already satisfied: zipp>=0.5 in <https://ci-beam.apache.org/job/beam_LoadTests_Python_CoGBK_Dataflow_Batch/ws/src/build/gradleenv/1329484227/lib/python3.7/site-packages> (from importlib-metadata>=0.12->pytest<8.0,>=7.1.2->apache-beam==2.49.0.dev0) (3.15.0)
Collecting PyJWT[crypto]<3,>=1.0.0 (from msal<2.0.0,>=1.20.0->azure-identity<2,>=1.12.0->apache-beam==2.49.0.dev0)
  Using cached PyJWT-2.7.0-py3-none-any.whl (22 kB)
Collecting portalocker<3,>=1.0 (from msal-extensions<2.0.0,>=0.3.0->azure-identity<2,>=1.12.0->apache-beam==2.49.0.dev0)
  Using cached portalocker-2.7.0-py2.py3-none-any.whl (15 kB)
Collecting pyasn1>=0.1.7 (from oauth2client>=1.4.12->google-apitools<0.5.32,>=0.5.31->apache-beam==2.49.0.dev0)
  Using cached pyasn1-0.5.0-py2.py3-none-any.whl (83 kB)
Building wheels for collected packages: apache-beam
  Building wheel for apache-beam (setup.py): started
  Building wheel for apache-beam (setup.py): finished with status 'done'
  Created wheel for apache-beam: filename=apache_beam-2.49.0.dev0-py3-none-any.whl size=3199731 sha256=df1bf209fdce9c2160c33087a7d2c57af24c9d864d64da9a20f9aa0a4bcf7102
  Stored in directory: /home/jenkins/.cache/pip/wheels/87/c1/ab/373455ac940ce11c5a367f32de9878735ae28a9495b61a9393
Successfully built apache-beam
Installing collected packages: sortedcontainers, pytz, docopt, crcmod, zstandard, wrapt, websocket-client, urllib3, tomli, threadpoolctl, tenacity, sqlparse, scipy, regex, pyyaml, python-dateutil, pyparsing, pymysql, PyJWT, pyhamcrest, pycparser, pyasn1, pyarrow, psycopg2-binary, proto-plus, portalocker, parameterized, overrides, orjson, objsize, mock, joblib, jmespath, isodate, iniconfig, idna, greenlet, googleapis-common-protos, google-crc32c, fasteners, fastavro, execnet, exceptiongroup, dnspython, dill, deprecation, cloudpickle, charset-normalizer, certifi, cachetools, sqlalchemy, scikit-learn, rsa, requests, pymongo, pydot, pyasn1-modules, pandas, httplib2, grpcio-status, google-resumable-media, freezegun, cffi, botocore, attrs, s3transfer, requests_mock, pytest, oauth2client, hypothesis, hdfs, grpc-google-iam-v1, google-auth, docker, cryptography, azure-core, testcontainers, pytest-xdist, pytest-timeout, google-auth-httplib2, google-apitools, google-api-core, boto3, azure-storage-blob, apache-beam, msal, google-cloud-core, msal-extensions, google-cloud-vision, google-cloud-videointelligence, google-cloud-spanner, google-cloud-recommendations-ai, google-cloud-pubsub, google-cloud-language, google-cloud-dlp, google-cloud-datastore, google-cloud-bigtable, google-cloud-bigquery-storage, google-cloud-bigquery, google-cloud-pubsublite, azure-identity
Successfully installed PyJWT-2.7.0 apache-beam-2.49.0.dev0 attrs-23.1.0 azure-core-1.27.0 azure-identity-1.13.0 azure-storage-blob-12.16.0 boto3-1.26.148 botocore-1.29.148 cachetools-5.3.1 certifi-2023.5.7 cffi-1.15.1 charset-normalizer-3.1.0 cloudpickle-2.2.1 crcmod-1.7 cryptography-41.0.1 deprecation-2.1.0 dill-0.3.1.1 dnspython-2.3.0 docker-6.1.3 docopt-0.6.2 exceptiongroup-1.1.1 execnet-1.9.0 fastavro-1.7.4 fasteners-0.18 freezegun-1.2.2 google-api-core-2.11.0 google-apitools-0.5.31 google-auth-2.19.1 google-auth-httplib2-0.1.0 google-cloud-bigquery-3.11.0 google-cloud-bigquery-storage-2.20.0 google-cloud-bigtable-2.17.0 google-cloud-core-2.3.2 google-cloud-datastore-2.15.2 google-cloud-dlp-3.12.1 google-cloud-language-2.10.0 google-cloud-pubsub-2.17.1 google-cloud-pubsublite-1.7.0 google-cloud-recommendations-ai-0.10.3 google-cloud-spanner-3.36.0 google-cloud-videointelligence-2.11.2 google-cloud-vision-3.4.2 google-crc32c-1.5.0 google-resumable-media-2.5.0 googleapis-common-protos-1.59.0 greenlet-2.0.2 grpc-google-iam-v1-0.12.6 grpcio-status-1.54.2 hdfs-2.7.0 httplib2-0.22.0 hypothesis-6.76.0 idna-3.4 iniconfig-2.0.0 isodate-0.6.1 jmespath-1.0.1 joblib-1.2.0 mock-5.0.2 msal-1.22.0 msal-extensions-1.0.0 oauth2client-4.1.3 objsize-0.6.1 orjson-3.9.0 overrides-6.5.0 pandas-1.3.5 parameterized-0.9.0 portalocker-2.7.0 proto-plus-1.22.2 psycopg2-binary-2.9.6 pyarrow-11.0.0 pyasn1-0.5.0 pyasn1-modules-0.3.0 pycparser-2.21 pydot-1.4.2 pyhamcrest-2.0.4 pymongo-4.3.3 pymysql-1.0.3 pyparsing-3.0.9 pytest-7.3.1 pytest-timeout-2.1.0 pytest-xdist-3.3.1 python-dateutil-2.8.2 pytz-2023.3 pyyaml-6.0 regex-2023.6.3 requests-2.31.0 requests_mock-1.10.0 rsa-4.9 s3transfer-0.6.1 scikit-learn-1.0.2 scipy-1.7.3 sortedcontainers-2.4.0 sqlalchemy-1.4.48 sqlparse-0.4.4 tenacity-8.2.2 testcontainers-3.7.1 threadpoolctl-3.1.0 tomli-2.0.1 urllib3-1.26.16 websocket-client-1.5.2 wrapt-1.15.0 zstandard-0.21.0

> Task :sdks:python:apache_beam:testing:load_tests:run
INFO:apache_beam.runners.portability.stager:Copying Beam SDK "<https://ci-beam.apache.org/job/beam_LoadTests_Python_CoGBK_Dataflow_Batch/ws/src/sdks/python/build/apache-beam.tar.gz"> to staging location.
INFO:root:Using provided Python SDK container image: gcr.io/cloud-dataflow/v1beta3/python37:beam-master-20230601
INFO:root:Python SDK container image set to "gcr.io/cloud-dataflow/v1beta3/python37:beam-master-20230601" for Docker environment
INFO:apache_beam.runners.portability.fn_api_runner.translations:==================== <function pack_combiners at 0x7f73121fd320> ====================
INFO:apache_beam.runners.portability.fn_api_runner.translations:==================== <function sort_stages at 0x7f73121fdb00> ====================
INFO:apache_beam.runners.dataflow.internal.apiclient:Defaulting to the temp_location as staging_location: gs://temp-storage-for-perf-tests/loadtests
INFO:apache_beam.internal.gcp.auth:Setting socket default timeout to 60 seconds.
INFO:apache_beam.internal.gcp.auth:socket default timeout is 60.0 seconds.
INFO:apache_beam.runners.dataflow.internal.apiclient:Starting GCS upload to gs://temp-storage-for-perf-tests/loadtests/load-tests-python-dataflow-batch-cogbk-1-0607095456.1686139131.752697/dataflow_python_sdk.tar...
INFO:apache_beam.runners.dataflow.internal.apiclient:Completed GCS upload to gs://temp-storage-for-perf-tests/loadtests/load-tests-python-dataflow-batch-cogbk-1-0607095456.1686139131.752697/dataflow_python_sdk.tar in 0 seconds.
INFO:apache_beam.runners.dataflow.internal.apiclient:Starting GCS upload to gs://temp-storage-for-perf-tests/loadtests/load-tests-python-dataflow-batch-cogbk-1-0607095456.1686139131.752697/pipeline.pb...
INFO:apache_beam.runners.dataflow.internal.apiclient:Completed GCS upload to gs://temp-storage-for-perf-tests/loadtests/load-tests-python-dataflow-batch-cogbk-1-0607095456.1686139131.752697/pipeline.pb in 0 seconds.
INFO:apache_beam.runners.dataflow.internal.apiclient:Create job: <Job
 clientRequestId: '20230607115851753647-6657'
 createTime: '2023-06-07T11:58:52.937478Z'
 currentStateTime: '1970-01-01T00:00:00Z'
 id: '2023-06-07_04_58_52-525868329847696038'
 location: 'us-central1'
 name: 'load-tests-python-dataflow-batch-cogbk-1-0607095456'
 projectId: 'apache-beam-testing'
 stageStates: []
 startTime: '2023-06-07T11:58:52.937478Z'
 steps: []
 tempFiles: []
 type: TypeValueValuesEnum(JOB_TYPE_BATCH, 1)>
INFO:apache_beam.runners.dataflow.internal.apiclient:Created job with id: [2023-06-07_04_58_52-525868329847696038]
INFO:apache_beam.runners.dataflow.internal.apiclient:Submitted job: 2023-06-07_04_58_52-525868329847696038
INFO:apache_beam.runners.dataflow.internal.apiclient:To access the Dataflow monitoring console, please navigate to https://console.cloud.google.com/dataflow/jobs/us-central1/2023-06-07_04_58_52-525868329847696038?project=apache-beam-testing
INFO:apache_beam.runners.dataflow.dataflow_runner:Job 2023-06-07_04_58_52-525868329847696038 is in state JOB_STATE_PENDING
INFO:apache_beam.runners.dataflow.dataflow_runner:2023-06-07T11:58:52.481Z: JOB_MESSAGE_BASIC: Dataflow Runner V2 auto-enabled. Use --experiments=disable_runner_v2 to opt out.
INFO:apache_beam.runners.dataflow.dataflow_runner:2023-06-07T11:58:55.592Z: JOB_MESSAGE_BASIC: Worker configuration: e2-standard-2 in us-central1-f.
INFO:apache_beam.runners.dataflow.dataflow_runner:2023-06-07T11:58:56.623Z: JOB_MESSAGE_DETAILED: Expanding SplittableParDo operations into optimizable parts.
INFO:apache_beam.runners.dataflow.dataflow_runner:2023-06-07T11:58:56.652Z: JOB_MESSAGE_DETAILED: Expanding CollectionToSingleton operations into optimizable parts.
INFO:apache_beam.runners.dataflow.dataflow_runner:2023-06-07T11:58:56.708Z: JOB_MESSAGE_DETAILED: Expanding CoGroupByKey operations into optimizable parts.
INFO:apache_beam.runners.dataflow.dataflow_runner:2023-06-07T11:58:56.732Z: JOB_MESSAGE_DEBUG: Combiner lifting skipped for step CoGroupByKey /CoGroupByKeyImpl/GroupByKey: GroupByKey not followed by a combiner.
INFO:apache_beam.runners.dataflow.dataflow_runner:2023-06-07T11:58:56.757Z: JOB_MESSAGE_DETAILED: Expanding GroupByKey operations into optimizable parts.
INFO:apache_beam.runners.dataflow.dataflow_runner:2023-06-07T11:58:56.782Z: JOB_MESSAGE_DEBUG: Annotating graph with Autotuner information.
INFO:apache_beam.runners.dataflow.dataflow_runner:2023-06-07T11:58:56.811Z: JOB_MESSAGE_DETAILED: Fusing adjacent ParDo, Read, Write, and Flatten operations
INFO:apache_beam.runners.dataflow.dataflow_runner:2023-06-07T11:58:56.846Z: JOB_MESSAGE_DEBUG: Inserted coder converter after flatten ref_AppliedPTransform_CoGroupByKey-CoGroupByKeyImpl-Flatten_18
INFO:apache_beam.runners.dataflow.dataflow_runner:2023-06-07T11:58:56.880Z: JOB_MESSAGE_DETAILED: Unzipping flatten ref_AppliedPTransform_CoGroupByKey-CoGroupByKeyImpl-Flatten_18 for input ref_AppliedPTransform_CoGroupByKey-CoGroupByKeyImpl-Tag-pc1-_16.None
INFO:apache_beam.runners.dataflow.dataflow_runner:2023-06-07T11:58:56.903Z: JOB_MESSAGE_DETAILED: Fusing unzipped copy of CoGroupByKey /CoGroupByKeyImpl/Flatten/OutputIdentity, through flatten CoGroupByKey /CoGroupByKeyImpl/Flatten, into producer CoGroupByKey /CoGroupByKeyImpl/Tag[pc1]
INFO:apache_beam.runners.dataflow.dataflow_runner:2023-06-07T11:58:56.935Z: JOB_MESSAGE_DETAILED: Fusing consumer CoGroupByKey /CoGroupByKeyImpl/MapTuple(collect_values) into CoGroupByKey /CoGroupByKeyImpl/GroupByKey/Read
INFO:apache_beam.runners.dataflow.dataflow_runner:2023-06-07T11:58:56.959Z: JOB_MESSAGE_DETAILED: Fusing consumer Consume Joined Collections into CoGroupByKey /CoGroupByKeyImpl/MapTuple(collect_values)
INFO:apache_beam.runners.dataflow.dataflow_runner:2023-06-07T11:58:56.983Z: JOB_MESSAGE_DETAILED: Fusing consumer Measure time: End into Consume Joined Collections
INFO:apache_beam.runners.dataflow.dataflow_runner:2023-06-07T11:58:57.011Z: JOB_MESSAGE_DETAILED: Unzipping flatten ref_AppliedPTransform_CoGroupByKey-CoGroupByKeyImpl-Flatten_18-u23 for input ref_AppliedPTransform_CoGroupByKey-CoGroupByKeyImpl-Flatten_18.None-c21
INFO:apache_beam.runners.dataflow.dataflow_runner:2023-06-07T11:58:57.034Z: JOB_MESSAGE_DETAILED: Fusing unzipped copy of CoGroupByKey /CoGroupByKeyImpl/GroupByKey/Write, through flatten CoGroupByKey /CoGroupByKeyImpl/Flatten/Unzipped-1, into producer CoGroupByKey /CoGroupByKeyImpl/Flatten/OutputIdentity
INFO:apache_beam.runners.dataflow.dataflow_runner:2023-06-07T11:58:57.056Z: JOB_MESSAGE_DETAILED: Fusing consumer CoGroupByKey /CoGroupByKeyImpl/Flatten/OutputIdentity into CoGroupByKey /CoGroupByKeyImpl/Tag[pc2]
INFO:apache_beam.runners.dataflow.dataflow_runner:2023-06-07T11:58:57.089Z: JOB_MESSAGE_DETAILED: Fusing consumer CoGroupByKey /CoGroupByKeyImpl/GroupByKey/Write into CoGroupByKey /CoGroupByKeyImpl/Flatten/OutputIdentity
INFO:apache_beam.runners.dataflow.dataflow_runner:2023-06-07T11:58:57.112Z: JOB_MESSAGE_DETAILED: Fusing consumer Read pc1/Map(<lambda at iobase.py:908>) into Read pc1/Impulse
INFO:apache_beam.runners.dataflow.dataflow_runner:2023-06-07T11:58:57.134Z: JOB_MESSAGE_DETAILED: Fusing consumer ref_AppliedPTransform_Read-pc1-SDFBoundedSourceReader-ParDo-SDFBoundedSourceDoFn-_6/PairWithRestriction into Read pc1/Map(<lambda at iobase.py:908>)
INFO:apache_beam.runners.dataflow.dataflow_runner:2023-06-07T11:58:57.166Z: JOB_MESSAGE_DETAILED: Fusing consumer ref_AppliedPTransform_Read-pc1-SDFBoundedSourceReader-ParDo-SDFBoundedSourceDoFn-_6/SplitWithSizing into ref_AppliedPTransform_Read-pc1-SDFBoundedSourceReader-ParDo-SDFBoundedSourceDoFn-_6/PairWithRestriction
INFO:apache_beam.runners.dataflow.dataflow_runner:2023-06-07T11:58:57.198Z: JOB_MESSAGE_DETAILED: Fusing consumer Measure time: Start pc1 into ref_AppliedPTransform_Read-pc1-SDFBoundedSourceReader-ParDo-SDFBoundedSourceDoFn-_6/ProcessElementAndRestrictionWithSizing
INFO:apache_beam.runners.dataflow.dataflow_runner:2023-06-07T11:58:57.232Z: JOB_MESSAGE_DETAILED: Fusing consumer CoGroupByKey /CoGroupByKeyImpl/Tag[pc1] into Measure time: Start pc1
INFO:apache_beam.runners.dataflow.dataflow_runner:2023-06-07T11:58:57.257Z: JOB_MESSAGE_DETAILED: Fusing consumer Read pc2/Map(<lambda at iobase.py:908>) into Read pc2/Impulse
INFO:apache_beam.runners.dataflow.dataflow_runner:2023-06-07T11:58:57.283Z: JOB_MESSAGE_DETAILED: Fusing consumer ref_AppliedPTransform_Read-pc2-SDFBoundedSourceReader-ParDo-SDFBoundedSourceDoFn-_12/PairWithRestriction into Read pc2/Map(<lambda at iobase.py:908>)
INFO:apache_beam.runners.dataflow.dataflow_runner:2023-06-07T11:58:57.307Z: JOB_MESSAGE_DETAILED: Fusing consumer ref_AppliedPTransform_Read-pc2-SDFBoundedSourceReader-ParDo-SDFBoundedSourceDoFn-_12/SplitWithSizing into ref_AppliedPTransform_Read-pc2-SDFBoundedSourceReader-ParDo-SDFBoundedSourceDoFn-_12/PairWithRestriction
INFO:apache_beam.runners.dataflow.dataflow_runner:2023-06-07T11:58:57.331Z: JOB_MESSAGE_DETAILED: Fusing consumer Measure time: Start pc2 into ref_AppliedPTransform_Read-pc2-SDFBoundedSourceReader-ParDo-SDFBoundedSourceDoFn-_12/ProcessElementAndRestrictionWithSizing
INFO:apache_beam.runners.dataflow.dataflow_runner:2023-06-07T11:58:57.358Z: JOB_MESSAGE_DETAILED: Fusing consumer CoGroupByKey /CoGroupByKeyImpl/Tag[pc2] into Measure time: Start pc2
INFO:apache_beam.runners.dataflow.dataflow_runner:2023-06-07T11:58:57.405Z: JOB_MESSAGE_DEBUG: Workflow config is missing a default resource spec.
INFO:apache_beam.runners.dataflow.dataflow_runner:2023-06-07T11:58:57.433Z: JOB_MESSAGE_DEBUG: Adding StepResource setup and teardown to workflow graph.
INFO:apache_beam.runners.dataflow.dataflow_runner:2023-06-07T11:58:57.457Z: JOB_MESSAGE_DEBUG: Adding workflow start and stop steps.
INFO:apache_beam.runners.dataflow.dataflow_runner:2023-06-07T11:58:57.480Z: JOB_MESSAGE_DEBUG: Assigning stage ids.
INFO:apache_beam.runners.dataflow.dataflow_runner:2023-06-07T11:58:57.635Z: JOB_MESSAGE_DEBUG: Executing wait step start33
INFO:apache_beam.runners.dataflow.dataflow_runner:2023-06-07T11:58:57.701Z: JOB_MESSAGE_BASIC: Executing operation Read pc2/Impulse+Read pc2/Map(<lambda at iobase.py:908>)+ref_AppliedPTransform_Read-pc2-SDFBoundedSourceReader-ParDo-SDFBoundedSourceDoFn-_12/PairWithRestriction+ref_AppliedPTransform_Read-pc2-SDFBoundedSourceReader-ParDo-SDFBoundedSourceDoFn-_12/SplitWithSizing
INFO:apache_beam.runners.dataflow.dataflow_runner:2023-06-07T11:58:57.729Z: JOB_MESSAGE_BASIC: Executing operation Read pc1/Impulse+Read pc1/Map(<lambda at iobase.py:908>)+ref_AppliedPTransform_Read-pc1-SDFBoundedSourceReader-ParDo-SDFBoundedSourceDoFn-_6/PairWithRestriction+ref_AppliedPTransform_Read-pc1-SDFBoundedSourceReader-ParDo-SDFBoundedSourceDoFn-_6/SplitWithSizing
INFO:apache_beam.runners.dataflow.dataflow_runner:2023-06-07T11:58:57.742Z: JOB_MESSAGE_DEBUG: Starting **** pool setup.
INFO:apache_beam.runners.dataflow.dataflow_runner:2023-06-07T11:58:57.765Z: JOB_MESSAGE_BASIC: Starting 5 ****s in us-central1-f...
INFO:apache_beam.runners.dataflow.dataflow_runner:Job 2023-06-07_04_58_52-525868329847696038 is in state JOB_STATE_RUNNING
INFO:apache_beam.runners.dataflow.dataflow_runner:2023-06-07T11:59:09.329Z: JOB_MESSAGE_BASIC: Your project already contains 100 Dataflow-created metric descriptors, so new user metrics of the form custom.googleapis.com/* will not be created. However, all user metrics are also available in the metric dataflow.googleapis.com/job/user_counter. If you rely on the custom metrics, you can delete old / unused metric descriptors. See https://developers.google.com/apis-explorer/#p/monitoring/v3/monitoring.projects.metricDescriptors.list and https://developers.google.com/apis-explorer/#p/monitoring/v3/monitoring.projects.metricDescriptors.delete
INFO:apache_beam.runners.dataflow.dataflow_runner:2023-06-07T11:59:47.281Z: JOB_MESSAGE_DETAILED: Autoscaling: Raised the number of ****s to 4 based on the rate of progress in the currently running stage(s).
INFO:apache_beam.runners.dataflow.dataflow_runner:2023-06-07T11:59:47.313Z: JOB_MESSAGE_DETAILED: Autoscaling: Resized **** pool to 4, though goal was 5.  This could be a quota issue.
INFO:apache_beam.runners.dataflow.dataflow_runner:2023-06-07T11:59:57.135Z: JOB_MESSAGE_DETAILED: Autoscaling: Raised the number of ****s to 5 based on the rate of progress in the currently running stage(s).
INFO:apache_beam.runners.dataflow.dataflow_runner:2023-06-07T12:00:16.062Z: JOB_MESSAGE_DETAILED: Workers have started successfully.
INFO:apache_beam.runners.dataflow.dataflow_runner:2023-06-07T12:58:58.300Z: JOB_MESSAGE_ERROR: Workflow failed. Causes: The Dataflow job appears to be stuck because no **** activity has been seen in the last 1h. Please check the **** logs in Stackdriver Logging. You can also get help with Cloud Dataflow at https://cloud.google.com/dataflow/support.
INFO:apache_beam.runners.dataflow.dataflow_runner:2023-06-07T12:58:58.347Z: JOB_MESSAGE_BASIC: Cancel request is committed for workflow job: 2023-06-07_04_58_52-525868329847696038.
INFO:apache_beam.runners.dataflow.dataflow_runner:2023-06-07T12:58:58.368Z: JOB_MESSAGE_ERROR: The Dataflow job appears to be stuck because no **** activity has been seen in the last 1h. Please check the **** logs in Stackdriver Logging. You can also get help with Cloud Dataflow at https://cloud.google.com/dataflow/support.
INFO:apache_beam.runners.dataflow.dataflow_runner:2023-06-07T12:58:58.434Z: JOB_MESSAGE_WARNING: Unable to delete temp files: "gs://temp-storage-for-perf-tests/loadtests/load-tests-python-dataflow-batch-cogbk-1-0607095456.1686139131.752697/dax-tmp-2023-06-07_04_58_52-525868329847696038-S01-0-3703009011a200c7/tmp-3703009011a208d0@DAX.sdfmeta."
INFO:apache_beam.runners.dataflow.dataflow_runner:2023-06-07T12:58:58.449Z: JOB_MESSAGE_WARNING: Unable to delete temp files: "gs://temp-storage-for-perf-tests/loadtests/load-tests-python-dataflow-batch-cogbk-1-0607095456.1686139131.752697/dax-tmp-2023-06-07_04_58_52-525868329847696038-S02-0-95dcf9da96efb53a/tmp-95dcf9da96efbb3f@DAX.sdfmeta."
INFO:apache_beam.runners.dataflow.dataflow_runner:2023-06-07T12:58:58.459Z: JOB_MESSAGE_WARNING: S01:Read pc1/Impulse+Read pc1/Map(<lambda at iobase.py:908>)+ref_AppliedPTransform_Read-pc1-SDFBoundedSourceReader-ParDo-SDFBoundedSourceDoFn-_6/PairWithRestriction+ref_AppliedPTransform_Read-pc1-SDFBoundedSourceReader-ParDo-SDFBoundedSourceDoFn-_6/SplitWithSizing failed.
INFO:apache_beam.runners.dataflow.dataflow_runner:2023-06-07T12:58:58.471Z: JOB_MESSAGE_WARNING: S02:Read pc2/Impulse+Read pc2/Map(<lambda at iobase.py:908>)+ref_AppliedPTransform_Read-pc2-SDFBoundedSourceReader-ParDo-SDFBoundedSourceDoFn-_12/PairWithRestriction+ref_AppliedPTransform_Read-pc2-SDFBoundedSourceReader-ParDo-SDFBoundedSourceDoFn-_12/SplitWithSizing failed.
INFO:apache_beam.runners.dataflow.dataflow_runner:2023-06-07T12:58:58.484Z: JOB_MESSAGE_BASIC: Finished operation Read pc1/Impulse+Read pc1/Map(<lambda at iobase.py:908>)+ref_AppliedPTransform_Read-pc1-SDFBoundedSourceReader-ParDo-SDFBoundedSourceDoFn-_6/PairWithRestriction+ref_AppliedPTransform_Read-pc1-SDFBoundedSourceReader-ParDo-SDFBoundedSourceDoFn-_6/SplitWithSizing
INFO:apache_beam.runners.dataflow.dataflow_runner:2023-06-07T12:58:58.496Z: JOB_MESSAGE_BASIC: Finished operation Read pc2/Impulse+Read pc2/Map(<lambda at iobase.py:908>)+ref_AppliedPTransform_Read-pc2-SDFBoundedSourceReader-ParDo-SDFBoundedSourceDoFn-_12/PairWithRestriction+ref_AppliedPTransform_Read-pc2-SDFBoundedSourceReader-ParDo-SDFBoundedSourceDoFn-_12/SplitWithSizing
INFO:apache_beam.runners.dataflow.dataflow_runner:2023-06-07T12:58:58.843Z: JOB_MESSAGE_DETAILED: Cleaning up.
INFO:apache_beam.runners.dataflow.dataflow_runner:2023-06-07T12:58:58.881Z: JOB_MESSAGE_DEBUG: Starting **** pool teardown.
INFO:apache_beam.runners.dataflow.dataflow_runner:2023-06-07T12:58:58.902Z: JOB_MESSAGE_BASIC: Stopping **** pool...
INFO:apache_beam.runners.dataflow.dataflow_runner:2023-06-07T13:01:13.672Z: JOB_MESSAGE_DETAILED: Autoscaling: Resized **** pool from 5 to 0.
INFO:apache_beam.runners.dataflow.dataflow_runner:2023-06-07T13:01:13.730Z: JOB_MESSAGE_BASIC: Worker pool stopped.
INFO:apache_beam.runners.dataflow.dataflow_runner:2023-06-07T13:01:13.745Z: JOB_MESSAGE_DEBUG: Tearing down pending resources...
INFO:apache_beam.runners.dataflow.dataflow_runner:Job 2023-06-07_04_58_52-525868329847696038 is in state JOB_STATE_FAILED
ERROR:apache_beam.runners.dataflow.dataflow_runner:Console URL: https://console.cloud.google.com/dataflow/jobs/<RegionId>/2023-06-07_04_58_52-525868329847696038?project=<ProjectId>
Traceback (most recent call last):
  File "/usr/lib/python3.7/runpy.py", line 193, in _run_module_as_main
    "__main__", mod_spec)
  File "/usr/lib/python3.7/runpy.py", line 85, in _run_code
    exec(code, run_globals)
  File "<https://ci-beam.apache.org/job/beam_LoadTests_Python_CoGBK_Dataflow_Batch/ws/src/sdks/python/apache_beam/testing/load_tests/co_group_by_key_test.py",> line 144, in <module>
    CoGroupByKeyTest().run()
  File "<https://ci-beam.apache.org/job/beam_LoadTests_Python_CoGBK_Dataflow_Batch/ws/src/sdks/python/apache_beam/testing/load_tests/load_test.py",> line 152, in run
    state = self.result.wait_until_finish(duration=self.timeout_ms)
  File "<https://ci-beam.apache.org/job/beam_LoadTests_Python_CoGBK_Dataflow_Batch/ws/src/sdks/python/apache_beam/runners/dataflow/dataflow_runner.py",> line 1566, in wait_until_finish
    self)
apache_beam.runners.dataflow.dataflow_runner.DataflowRuntimeException: Dataflow pipeline failed. State: FAILED, Error:
The Dataflow job appears to be stuck because no **** activity has been seen in the last 1h. Please check the **** logs in Stackdriver Logging. You can also get help with Cloud Dataflow at https://cloud.google.com/dataflow/support.

> Task :sdks:python:apache_beam:testing:load_tests:run FAILED

FAILURE: Build failed with an exception.

* Where:
Build file '<https://ci-beam.apache.org/job/beam_LoadTests_Python_CoGBK_Dataflow_Batch/ws/src/sdks/python/apache_beam/testing/load_tests/build.gradle'> line: 63

* What went wrong:
Execution failed for task ':sdks:python:apache_beam:testing:load_tests:run'.
> error occurred

* Try:
> Run with --stacktrace option to get the stack trace.
> Run with --info or --debug option to get more log output.

* Get more help at https://help.gradle.org

Deprecated Gradle features were used in this build, making it incompatible with Gradle 8.0.

You can use '--warning-mode all' to show the individual deprecation warnings and determine if they come from your own scripts or plugins.

See https://docs.gradle.org/7.5.1/userguide/command_line_interface.html#sec:command_line_warnings

BUILD FAILED in 1h 4m 26s
15 actionable tasks: 9 executed, 4 from cache, 2 up-to-date

Publishing build scan...
https://ge.apache.org/s/kmqs5hwzu27ek

Build step 'Invoke Gradle script' changed build result to FAILURE
Build step 'Invoke Gradle script' marked build as failure

---------------------------------------------------------------------
To unsubscribe, e-mail: builds-unsubscribe@beam.apache.org
For additional commands, e-mail: builds-help@beam.apache.org