You are viewing a plain text version of this content. The canonical link for it is here.
Posted to builds@beam.apache.org by Apache Jenkins Server <je...@builds.apache.org> on 2023/11/16 11:55:55 UTC
Build failed in Jenkins: beam_PostCommit_Java_PVR_Spark_Batch #2731
See <https://ci-beam.apache.org/job/beam_PostCommit_Java_PVR_Spark_Batch/2731/display/redirect>
Changes:
------------------------------------------
[...truncated 44.41 KB...]
Installing collected packages: pip, setuptools, wheel
Attempting uninstall: pip
Found existing installation: pip 20.0.2
Uninstalling pip-20.0.2:
Successfully uninstalled pip-20.0.2
Attempting uninstall: setuptools
Found existing installation: setuptools 44.0.0
Uninstalling setuptools-44.0.0:
Successfully uninstalled setuptools-44.0.0
Successfully installed pip-23.3.1 setuptools-68.2.2 wheel-0.41.3
Collecting beautifulsoup4<5.0,>=4.9.0 (from -r <https://ci-beam.apache.org/job/beam_PostCommit_Java_PVR_Spark_Batch/ws/src/sdks/java/container/license_scripts/requirement.txt> (line 19))
Using cached beautifulsoup4-4.12.2-py3-none-any.whl (142 kB)
Collecting pyyaml<7,>=6.0.1 (from -r <https://ci-beam.apache.org/job/beam_PostCommit_Java_PVR_Spark_Batch/ws/src/sdks/java/container/license_scripts/requirement.txt> (line 20))
Using cached PyYAML-6.0.1-cp38-cp38-manylinux_2_17_x86_64.manylinux2014_x86_64.whl.metadata (2.1 kB)
Collecting tenacity<9.0,>=6.1.0 (from -r <https://ci-beam.apache.org/job/beam_PostCommit_Java_PVR_Spark_Batch/ws/src/sdks/java/container/license_scripts/requirement.txt> (line 21))
Using cached tenacity-8.2.3-py3-none-any.whl.metadata (1.0 kB)
Collecting soupsieve>1.2 (from beautifulsoup4<5.0,>=4.9.0->-r <https://ci-beam.apache.org/job/beam_PostCommit_Java_PVR_Spark_Batch/ws/src/sdks/java/container/license_scripts/requirement.txt> (line 19))
Using cached soupsieve-2.5-py3-none-any.whl.metadata (4.7 kB)
Using cached PyYAML-6.0.1-cp38-cp38-manylinux_2_17_x86_64.manylinux2014_x86_64.whl (736 kB)
Using cached tenacity-8.2.3-py3-none-any.whl (24 kB)
Using cached soupsieve-2.5-py3-none-any.whl (36 kB)
Installing collected packages: tenacity, soupsieve, pyyaml, beautifulsoup4
Successfully installed beautifulsoup4-4.12.2 pyyaml-6.0.1 soupsieve-2.5 tenacity-8.2.3
Executing python <https://ci-beam.apache.org/job/beam_PostCommit_Java_PVR_Spark_Batch/ws/src/sdks/java/container/license_scripts/pull_licenses_java.py> --license_index=<https://ci-beam.apache.org/job/beam_PostCommit_Java_PVR_Spark_Batch/ws/src/sdks/java/container/build/reports/dependency-license/index.json> --output_dir=<https://ci-beam.apache.org/job/beam_PostCommit_Java_PVR_Spark_Batch/ws/src/sdks/java/container/build/target/java_third_party_licenses> --dep_url_yaml=<https://ci-beam.apache.org/job/beam_PostCommit_Java_PVR_Spark_Batch/ws/src/sdks/java/container/license_scripts/dep_urls_java.yaml> --manual_license_path=<https://ci-beam.apache.org/job/beam_PostCommit_Java_PVR_Spark_Batch/ws/src/sdks/java/container/license_scripts/manual_licenses>
INFO:root:Pulling license for 126 dependencies using 16 threads.
INFO:root:Replaced local file URL with file://<https://ci-beam.apache.org/job/beam_PostCommit_Java_PVR_Spark_Batch/ws/src/sdks/java/container/license_scripts/manual_licenses/xz/COPYING> for xz-1.5
INFO:root:pull_licenses_java.py succeed. It took 1.413914 seconds with 16 threads.
Copying licenses from <https://ci-beam.apache.org/job/beam_PostCommit_Java_PVR_Spark_Batch/ws/src/sdks/java/container/build/target/java_third_party_licenses> to <https://ci-beam.apache.org/job/beam_PostCommit_Java_PVR_Spark_Batch/ws/src/sdks/java/container/build/target/third_party_licenses.>
Finished license_scripts.sh
> Task :release:go-licenses:java:dockerRun
+ rm -rf '/output/*'
+ go get github.com/apache/beam/sdks/v2/java/container
go: downloading github.com/apache/beam/sdks/v2 v2.51.0
go: downloading github.com/apache/beam v2.51.0+incompatible
> Task :sdks:java:container:java8:copyJavaThirdPartyLicenses
> Task :sdks:java:container:downloadCloudProfilerAgent
% Total % Received % Xferd Average Speed Time Time Time Current
Dload Upload Total Spent Left Speed
0 0 0 0 0 0 0 0 --:--:-- --:--:-- --:--:-- 0version.txt
NOTICES
profiler_java_agent.so
100 4183k 100 4183k 0 0 22.6M 0 --:--:-- --:--:-- --:--:-- 22.6M
> Task :sdks:java:container:goPrepare UP-TO-DATE
> Task :release:go-licenses:java:dockerRun
go: downloading github.com/golang/protobuf v1.5.3
go: downloading google.golang.org/grpc v1.58.1
go: downloading google.golang.org/protobuf v1.31.0
go: downloading golang.org/x/sys v0.12.0
go: downloading golang.org/x/net v0.15.0
go: downloading google.golang.org/genproto/googleapis/rpc v0.0.0-20230913181813-007df8e322eb
go: downloading google.golang.org/genproto v0.0.0-20230821184602-ccc8af3d0e93
go: downloading golang.org/x/text v0.13.0
> Task :sdks:java:container:goBuild
/home/jenkins/go/bin/go1.21.4 build -o ./build/target/linux_amd64/boot boot.go boot_test.go pathingjar.go pathingjar_test.go
> Task :sdks:java:container:java8:copySdkHarnessLauncher
> Task :release:go-licenses:java:dockerRun
go: added github.com/apache/beam/sdks/v2 v2.51.0
go: added github.com/golang/protobuf v1.5.3
go: added golang.org/x/net v0.15.0
go: added golang.org/x/sys v0.12.0
go: added golang.org/x/text v0.13.0
go: added google.golang.org/genproto/googleapis/rpc v0.0.0-20230913181813-007df8e322eb
go: added google.golang.org/grpc v1.58.1
go: added google.golang.org/protobuf v1.31.0
+ go-licenses save github.com/apache/beam/sdks/v2/java/container --save_path=/output/licenses
W1116 10:21:13.283913 37 library.go:101] "golang.org/x/sys/unix" contains non-Go code that can't be inspected for further dependencies:
/go/pkg/mod/golang.org/x/sys@v0.12.0/unix/asm_linux_amd64.s
+ go-licenses csv github.com/apache/beam/sdks/v2/java/container
+ tee /output/licenses/list.csv
W1116 10:21:20.351476 81 library.go:101] "golang.org/x/sys/unix" contains non-Go code that can't be inspected for further dependencies:
/go/pkg/mod/golang.org/x/sys@v0.12.0/unix/asm_linux_amd64.s
github.com/apache/beam/sdks/v2/go,https://github.com/apache/beam/blob/sdks/v2.51.0/sdks/go/README.md,Apache-2.0
github.com/apache/beam/sdks/v2/java/container,https://github.com/apache/beam/blob/sdks/v2.51.0/sdks/LICENSE,Apache-2.0
github.com/golang/protobuf,https://github.com/golang/protobuf/blob/v1.5.3/LICENSE,BSD-3-Clause
golang.org/x/net,https://cs.opensource.google/go/x/net/+/v0.15.0:LICENSE,BSD-3-Clause
golang.org/x/sys/unix,https://cs.opensource.google/go/x/sys/+/v0.12.0:LICENSE,BSD-3-Clause
golang.org/x/text,https://cs.opensource.google/go/x/text/+/v0.13.0:LICENSE,BSD-3-Clause
google.golang.org/genproto/googleapis/rpc/status,https://github.com/googleapis/go-genproto/blob/007df8e322eb/googleapis/rpc/LICENSE,Apache-2.0
google.golang.org/grpc,https://github.com/grpc/grpc-go/blob/v1.58.1/LICENSE,Apache-2.0
google.golang.org/protobuf,https://github.com/protocolbuffers/protobuf-go/blob/v1.31.0/LICENSE,BSD-3-Clause
+ chmod -R a+w /output/licenses
> Task :runners:spark:3:job-server:validatesPortableRunnerBatch
> Task :release:go-licenses:java:createLicenses
> Task :sdks:java:container:java8:copyGolangLicenses
> Task :sdks:java:container:java8:dockerPrepare
> Task :sdks:java:container:java8:docker
#1 [internal] load build definition from Dockerfile
#1 transferring dockerfile: 2.59kB done
#1 DONE 0.0s
#2 [internal] load .dockerignore
#2 transferring context: 2B done
#2 DONE 0.0s
#3 [internal] load metadata for docker.io/library/eclipse-temurin:8
#3 DONE 0.4s
#4 [ 1/16] FROM docker.io/library/eclipse-temurin:8@sha256:f451165be121bd40cdc1c2ba5e3039fff4021e038b2b03059179368e2b44e0ec
#4 resolve docker.io/library/eclipse-temurin:8@sha256:f451165be121bd40cdc1c2ba5e3039fff4021e038b2b03059179368e2b44e0ec 0.0s done
#4 ...
#5 [internal] load build context
#5 transferring context: 47.29MB 0.6s done
#5 DONE 0.7s
#6 [ 2/16] ADD target/slf4j-api.jar /opt/apache/beam/jars/
#6 DONE 13.1s
#4 [ 1/16] FROM docker.io/library/eclipse-temurin:8@sha256:f451165be121bd40cdc1c2ba5e3039fff4021e038b2b03059179368e2b44e0ec
#4 ...
#7 [ 3/16] ADD target/slf4j-jdk14.jar /opt/apache/beam/jars/
#7 DONE 4.9s
#4 [ 1/16] FROM docker.io/library/eclipse-temurin:8@sha256:f451165be121bd40cdc1c2ba5e3039fff4021e038b2b03059179368e2b44e0ec
#4 ...
#8 [ 4/16] ADD target/jcl-over-slf4j.jar /opt/apache/beam/jars/
#8 DONE 2.2s
#4 [ 1/16] FROM docker.io/library/eclipse-temurin:8@sha256:f451165be121bd40cdc1c2ba5e3039fff4021e038b2b03059179368e2b44e0ec
#4 ...
#9 [ 5/16] ADD target/log4j-over-slf4j.jar /opt/apache/beam/jars/
#9 DONE 2.3s
#4 [ 1/16] FROM docker.io/library/eclipse-temurin:8@sha256:f451165be121bd40cdc1c2ba5e3039fff4021e038b2b03059179368e2b44e0ec
#4 ...
#10 [ 6/16] ADD target/log4j-to-slf4j.jar /opt/apache/beam/jars/
#10 DONE 1.6s
#11 [ 7/16] ADD target/beam-sdks-java-harness.jar /opt/apache/beam/jars/
#11 DONE 0.1s
#12 [ 8/16] COPY target/jamm.jar target/open-module-agent*.jar /opt/apache/beam/jars/
#12 DONE 0.1s
#4 [ 1/16] FROM docker.io/library/eclipse-temurin:8@sha256:f451165be121bd40cdc1c2ba5e3039fff4021e038b2b03059179368e2b44e0ec
#4 ...
#13 [ 9/16] COPY target/linux_amd64/boot /opt/apache/beam/
#13 DONE 0.2s
#14 [10/16] COPY target/LICENSE /opt/apache/beam/
#14 DONE 0.1s
#4 [ 1/16] FROM docker.io/library/eclipse-temurin:8@sha256:f451165be121bd40cdc1c2ba5e3039fff4021e038b2b03059179368e2b44e0ec
#4 ...
#15 [11/16] COPY target/NOTICE /opt/apache/beam/
#15 DONE 0.1s
#16 [12/16] ADD target/third_party_licenses /opt/apache/beam/third_party_licenses/
#16 DONE 0.2s
#4 [ 1/16] FROM docker.io/library/eclipse-temurin:8@sha256:f451165be121bd40cdc1c2ba5e3039fff4021e038b2b03059179368e2b44e0ec
#4 ...
#17 [13/16] COPY target/LICENSE target/options/* /opt/apache/beam/options/
#17 DONE 0.1s
#18 [14/16] COPY target/go-licenses/* /opt/apache/beam/third_party_licenses/golang/
#18 DONE 0.1s
#19 [15/16] RUN if [ "true" = "false" ] ; then rm -rf /opt/apache/beam/third_party_licenses ; fi
#19 DONE 0.5s
#20 [16/16] COPY target/profiler/* /opt/google_cloud_profiler/
#20 DONE 0.1s
#21 exporting to image
#21 exporting layers
#21 exporting layers 0.4s done
#21 writing image sha256:102978b9c7f916d95e7c0442ce4af19026a2b9605fb69780c79393f79cc25dac done
#21 naming to docker.io/apache/beam_java8_sdk:2.53.0.dev done
#21 DONE 0.4s
#4 [ 1/16] FROM docker.io/library/eclipse-temurin:8@sha256:f451165be121bd40cdc1c2ba5e3039fff4021e038b2b03059179368e2b44e0ec
> Task :runners:spark:3:job-server:validatesPortableRunnerBatch
org.apache.beam.sdk.transforms.ParDoTest$MultipleInputsAndOutputTests > testParDoWithOnlyTaggedOutput FAILED
java.lang.RuntimeException at ParDoTest.java:818
[shutdown-hook-0] INFO org.apache.spark.util.ShutdownHookManager - Shutdown hook called
[shutdown-hook-0] INFO org.apache.spark.util.ShutdownHookManager - Deleting directory /tmp/spark-c65d43bf-11f2-4477-bb33-e44736496284
> Task :runners:spark:3:job-server:validatesPortableRunnerBatch
org.apache.beam.sdk.transforms.ParDoTest$MultipleInputsAndOutputTests > testSideInputAnnotation FAILED
java.lang.RuntimeException at ParDoTest.java:1076
org.apache.beam.sdk.transforms.ParDoTest$MultipleInputsAndOutputTests > testParDoWithEmptyTaggedOutput FAILED
java.lang.RuntimeException at ParDoTest.java:789
org.apache.beam.sdk.transforms.ParDoTest$StateTests > testValueStateSimple FAILED
java.lang.RuntimeException at ParDoTest.java:2292
org.apache.beam.sdk.transforms.ParDoTest$StateTests > testValueStateTaggedOutput FAILED
java.lang.RuntimeException at ParDoTest.java:2579
org.apache.beam.sdk.transforms.ParDoTest$StateTests > testBagStateSideInput FAILED
java.lang.RuntimeException at ParDoTest.java:3583
[shutdown-hook-0] INFO org.apache.spark.util.ShutdownHookManager - Shutdown hook called
[shutdown-hook-0] INFO org.apache.spark.util.ShutdownHookManager - Deleting directory /tmp/spark-4960860e-2df2-47e2-b6b5-0febaa23fb74
[shutdown-hook-0] INFO org.apache.spark.util.ShutdownHookManager - Shutdown hook called
[shutdown-hook-0] INFO org.apache.spark.util.ShutdownHookManager - Deleting directory /tmp/spark-577f9d38-61cc-46aa-ac96-dd3a9286d6d1
[shutdown-hook-0] INFO org.apache.spark.util.ShutdownHookManager - Shutdown hook called
[shutdown-hook-0] INFO org.apache.spark.util.ShutdownHookManager - Deleting directory /tmp/spark-0539646c-1b67-45dc-8b65-0d74fbcb4db0
> Task :runners:spark:3:job-server:validatesPortableRunnerBatch
233 tests completed, 6 failed, 1 skipped
> Task :runners:spark:3:job-server:validatesPortableRunnerBatch FAILED
> Task :runners:spark:3:job-server:validatesPortableRunnerDocker FROM-CACHE
FAILURE: Build failed with an exception.
* What went wrong:
Execution failed for task ':runners:spark:3:job-server:validatesPortableRunnerBatch'.
> There were failing tests. See the report at: file://<https://ci-beam.apache.org/job/beam_PostCommit_Java_PVR_Spark_Batch/ws/src/runners/spark/3/job-server/build/reports/tests/validatesPortableRunnerBatch/index.html>
Deprecated Gradle features were used in this build, making it incompatible with Gradle 9.0.
You can use '--warning-mode all' to show the individual deprecation warnings and determine if they come from your own scripts or plugins.
For more on this, please refer to https://docs.gradle.org/8.4/userguide/command_line_interface.html#sec:command_line_warnings in the Gradle documentation.
BUILD FAILED in 1h 35m 26s
121 actionable tasks: 78 executed, 41 from cache, 2 up-to-date
Publishing build scan...
https://ge.apache.org/s/bok72ix44gxoy
Build step 'Invoke Gradle script' changed build result to FAILURE
Build step 'Invoke Gradle script' marked build as failure
---------------------------------------------------------------------
To unsubscribe, e-mail: builds-unsubscribe@beam.apache.org
For additional commands, e-mail: builds-help@beam.apache.org
Jenkins build is back to normal : beam_PostCommit_Java_PVR_Spark_Batch #2732
Posted by Apache Jenkins Server <je...@builds.apache.org>.
See <https://ci-beam.apache.org/job/beam_PostCommit_Java_PVR_Spark_Batch/2732/display/redirect>
---------------------------------------------------------------------
To unsubscribe, e-mail: builds-unsubscribe@beam.apache.org
For additional commands, e-mail: builds-help@beam.apache.org