You are viewing a plain text version of this content. The canonical link for it is here.
Posted to commits@tuscany.apache.org by Apache Jenkins Server <je...@builds.apache.org> on 2012/01/20 01:52:24 UTC
Build failed in Jenkins: Tuscany-2x #506
See <https://builds.apache.org/job/Tuscany-2x/506/changes>
Changes:
[slaws] TUSCANY-3283 - these are similar changes to those made in 1.x to correct WSDL gen in various areas including, generating unannotated types into the service interface namespace, making wrapper parameters generally non-nillable, using JAXB to generate wrapper XSD (which fixes other failures where our code doesn't support various JAXB annotations), correcting the namespace of generated exceptions and the way that the generated classes are cached. Fixing the WSDL requires other fixes, for example, a new databinding to force ServiceReference to map to anyType (so that we don't try and process these interfaces with JAXB) and a fix to correct the order of response holders. T
[slaws] add ignores
[slaws] TUSCANY-3283 - Port or wsdlgen test from 1.x. Have included wsdl-validator tests here also but not enabled them yet
------------------------------------------
[...truncated 39767 lines...]
Downloading: http://www.intalio.org/public/maven2/org/apache/maven/maven-monitor/2.0/maven-monitor-2.0.pom
400b downloaded (maven-monitor-2.0.pom)
Downloading: http://download.java.net/maven/2/org/apache/maven/wagon/wagon-ssh/1.0-alpha-5/wagon-ssh-1.0-alpha-5.pom
[INFO] Unable to find resource 'org.apache.maven.wagon:wagon-ssh:pom:1.0-alpha-5' in repository java.net2 (http://download.java.net/maven/2)
Downloading: http://www.intalio.org/public/maven2/org/apache/maven/wagon/wagon-ssh/1.0-alpha-5/wagon-ssh-1.0-alpha-5.pom
[INFO] Unable to find resource 'org.apache.maven.wagon:wagon-ssh:pom:1.0-alpha-5' in repository intalio.org (http://www.intalio.org/public/maven2)
Downloading: http://svn.apache.org/repos/asf/openejb/repo/org/apache/maven/wagon/wagon-ssh/1.0-alpha-5/wagon-ssh-1.0-alpha-5.pom
[INFO] Unable to find resource 'org.apache.maven.wagon:wagon-ssh:pom:1.0-alpha-5' in repository openejb-repository (http://svn.apache.org/repos/asf/openejb/repo)
Downloading: http://svn.apache.org/repos/asf/tuscany/maven/org/apache/maven/wagon/wagon-ssh/1.0-alpha-5/wagon-ssh-1.0-alpha-5.pom
[INFO] Unable to find resource 'org.apache.maven.wagon:wagon-ssh:pom:1.0-alpha-5' in repository tuscany.repo (http://svn.apache.org/repos/asf/tuscany/maven)
Downloading: http://repo1.maven.org/maven2/org/apache/maven/wagon/wagon-ssh/1.0-alpha-5/wagon-ssh-1.0-alpha-5.pom
Downloading: http://download.java.net/maven/2/com/jcraft/jsch/0.1.23/jsch-0.1.23.pom
[INFO] Unable to find resource 'com.jcraft:jsch:pom:0.1.23' in repository java.net2 (http://download.java.net/maven/2)
Downloading: http://www.intalio.org/public/maven2/com/jcraft/jsch/0.1.23/jsch-0.1.23.pom
[INFO] Unable to find resource 'com.jcraft:jsch:pom:0.1.23' in repository intalio.org (http://www.intalio.org/public/maven2)
Downloading: http://svn.apache.org/repos/asf/openejb/repo/com/jcraft/jsch/0.1.23/jsch-0.1.23.pom
[INFO] Unable to find resource 'com.jcraft:jsch:pom:0.1.23' in repository openejb-repository (http://svn.apache.org/repos/asf/openejb/repo)
Downloading: http://svn.apache.org/repos/asf/tuscany/maven/com/jcraft/jsch/0.1.23/jsch-0.1.23.pom
[INFO] Unable to find resource 'com.jcraft:jsch:pom:0.1.23' in repository tuscany.repo (http://svn.apache.org/repos/asf/tuscany/maven)
Downloading: http://repo1.maven.org/maven2/com/jcraft/jsch/0.1.23/jsch-0.1.23.pom
Downloading: http://repo1.maven.org/maven2/org/codehaus/plexus/plexus-interpolation/1.7/plexus-interpolation-1.7.pom
Downloading: http://repo1.maven.org/maven2/org/codehaus/plexus/plexus-archiver/1.0-alpha-12/plexus-archiver-1.0-alpha-12.pom
Downloading: http://download.java.net/maven/2/org/codehaus/plexus/plexus-io/1.0-alpha-4/plexus-io-1.0-alpha-4.pom
[INFO] Unable to find resource 'org.codehaus.plexus:plexus-io:pom:1.0-alpha-4' in repository java.net2 (http://download.java.net/maven/2)
Downloading: http://www.intalio.org/public/maven2/org/codehaus/plexus/plexus-io/1.0-alpha-4/plexus-io-1.0-alpha-4.pom
1K downloaded (plexus-io-1.0-alpha-4.pom)
Downloading: http://repo1.maven.org/maven2/org/codehaus/plexus/plexus-active-collections/1.0-beta-2/plexus-active-collections-1.0-beta-2.pom
Downloading: http://download.java.net/maven/2/org/codehaus/plexus/plexus-container-default/1.0-alpha-22/plexus-container-default-1.0-alpha-22.pom
[INFO] Unable to find resource 'org.codehaus.plexus:plexus-container-default:pom:1.0-alpha-22' in repository java.net2 (http://download.java.net/maven/2)
Downloading: http://www.intalio.org/public/maven2/org/codehaus/plexus/plexus-container-default/1.0-alpha-22/plexus-container-default-1.0-alpha-22.pom
[INFO] Unable to find resource 'org.codehaus.plexus:plexus-container-default:pom:1.0-alpha-22' in repository intalio.org (http://www.intalio.org/public/maven2)
Downloading: http://svn.apache.org/repos/asf/openejb/repo/org/codehaus/plexus/plexus-container-default/1.0-alpha-22/plexus-container-default-1.0-alpha-22.pom
[INFO] Unable to find resource 'org.codehaus.plexus:plexus-container-default:pom:1.0-alpha-22' in repository openejb-repository (http://svn.apache.org/repos/asf/openejb/repo)
Downloading: http://svn.apache.org/repos/asf/tuscany/maven/org/codehaus/plexus/plexus-container-default/1.0-alpha-22/plexus-container-default-1.0-alpha-22.pom
[INFO] Unable to find resource 'org.codehaus.plexus:plexus-container-default:pom:1.0-alpha-22' in repository tuscany.repo (http://svn.apache.org/repos/asf/tuscany/maven)
Downloading: http://repo1.maven.org/maven2/org/codehaus/plexus/plexus-container-default/1.0-alpha-22/plexus-container-default-1.0-alpha-22.pom
Downloading: http://download.java.net/maven/2/org/codehaus/plexus/plexus-containers/1.0-alpha-22/plexus-containers-1.0-alpha-22.pom
[INFO] Unable to find resource 'org.codehaus.plexus:plexus-containers:pom:1.0-alpha-22' in repository java.net2 (http://download.java.net/maven/2)
Downloading: http://www.intalio.org/public/maven2/org/codehaus/plexus/plexus-containers/1.0-alpha-22/plexus-containers-1.0-alpha-22.pom
[INFO] Unable to find resource 'org.codehaus.plexus:plexus-containers:pom:1.0-alpha-22' in repository intalio.org (http://www.intalio.org/public/maven2)
Downloading: http://svn.apache.org/repos/asf/openejb/repo/org/codehaus/plexus/plexus-containers/1.0-alpha-22/plexus-containers-1.0-alpha-22.pom
[INFO] Unable to find resource 'org.codehaus.plexus:plexus-containers:pom:1.0-alpha-22' in repository openejb-repository (http://svn.apache.org/repos/asf/openejb/repo)
Downloading: http://svn.apache.org/repos/asf/tuscany/maven/org/codehaus/plexus/plexus-containers/1.0-alpha-22/plexus-containers-1.0-alpha-22.pom
[INFO] Unable to find resource 'org.codehaus.plexus:plexus-containers:pom:1.0-alpha-22' in repository tuscany.repo (http://svn.apache.org/repos/asf/tuscany/maven)
Downloading: http://repo1.maven.org/maven2/org/codehaus/plexus/plexus-containers/1.0-alpha-22/plexus-containers-1.0-alpha-22.pom
Downloading: http://repo1.maven.org/maven2/org/codehaus/plexus/plexus-utils/2.0.1/plexus-utils-2.0.1.pom
Downloading: http://repo1.maven.org/maven2/org/codehaus/plexus/plexus-utils/2.0.1/plexus-utils-2.0.1.jar
Downloading: http://repo1.maven.org/maven2/org/apache/maven/shared/maven-common-artifact-filters/1.1/maven-common-artifact-filters-1.1.jar
Downloading: http://repo1.maven.org/maven2/org/codehaus/plexus/plexus-archiver/1.0-alpha-12/plexus-archiver-1.0-alpha-12.jar
Downloading: http://repo1.maven.org/maven2/org/codehaus/plexus/plexus-interpolation/1.7/plexus-interpolation-1.7.jar
Downloading: http://repo1.maven.org/maven2/org/codehaus/plexus/plexus-io/1.0-alpha-4/plexus-io-1.0-alpha-4.jar
Downloading: http://repo1.maven.org/maven2/org/codehaus/plexus/plexus-active-collections/1.0-beta-2/plexus-active-collections-1.0-beta-2.jar
[INFO] [assembly:single {execution: distribution-package}]
[INFO] Reading assembly descriptor: src/main/assembly/bin-distribution.xml
[INFO] Reading assembly descriptor: src/main/assembly/src.xml
[WARNING] Cannot include project artifact: org.apache.tuscany.sca:tuscany-distribution-all:pom:2.0-SNAPSHOT; it doesn't have an associated file or directory.
[WARNING] Cannot include project artifact: org.apache.tuscany.sca:tuscany-distribution-all:pom:2.0-SNAPSHOT; it doesn't have an associated file or directory.
[INFO] Building tar : <https://builds.apache.org/job/Tuscany-2x/ws/sca-2x/distribution/all/target/apache-tuscany-sca-all-2.0-SNAPSHOT.tar.gz>
[WARNING] Cannot include project artifact: org.apache.tuscany.sca:tuscany-distribution-all:pom:2.0-SNAPSHOT; it doesn't have an associated file or directory.
[WARNING] Cannot include project artifact: org.apache.tuscany.sca:tuscany-distribution-all:pom:2.0-SNAPSHOT; it doesn't have an associated file or directory.
[INFO] Building zip: <https://builds.apache.org/job/Tuscany-2x/ws/sca-2x/distribution/all/target/apache-tuscany-sca-all-2.0-SNAPSHOT.zip>
[INFO] Building tar : <https://builds.apache.org/job/Tuscany-2x/ws/sca-2x/distribution/all/target/apache-tuscany-sca-all-2.0-SNAPSHOT-src.tar.gz>
[INFO] Building zip: <https://builds.apache.org/job/Tuscany-2x/ws/sca-2x/distribution/all/target/apache-tuscany-sca-all-2.0-SNAPSHOT-src.zip>
[INFO] [install:install {execution: default-install}]
[INFO] Installing <https://builds.apache.org/job/Tuscany-2x/ws/sca-2x/distribution/all/pom.xml> to <https://builds.apache.org/job/Tuscany-2x/ws/.repository/org/apache/tuscany/sca/tuscany-distribution-all/2.0-SNAPSHOT/tuscany-distribution-all-2.0-SNAPSHOT.pom>
[INFO] Installing <https://builds.apache.org/job/Tuscany-2x/ws/sca-2x/distribution/all/target/apache-tuscany-sca-all-2.0-SNAPSHOT.tar.gz> to <https://builds.apache.org/job/Tuscany-2x/ws/.repository/org/apache/tuscany/sca/tuscany-distribution-all/2.0-SNAPSHOT/tuscany-distribution-all-2.0-SNAPSHOT.tar.gz>
[INFO] Installing <https://builds.apache.org/job/Tuscany-2x/ws/sca-2x/distribution/all/target/apache-tuscany-sca-all-2.0-SNAPSHOT.zip> to <https://builds.apache.org/job/Tuscany-2x/ws/.repository/org/apache/tuscany/sca/tuscany-distribution-all/2.0-SNAPSHOT/tuscany-distribution-all-2.0-SNAPSHOT.zip>
[INFO] Installing <https://builds.apache.org/job/Tuscany-2x/ws/sca-2x/distribution/all/target/apache-tuscany-sca-all-2.0-SNAPSHOT-src.tar.gz> to <https://builds.apache.org/job/Tuscany-2x/ws/.repository/org/apache/tuscany/sca/tuscany-distribution-all/2.0-SNAPSHOT/tuscany-distribution-all-2.0-SNAPSHOT-src.tar.gz>
[INFO] Installing <https://builds.apache.org/job/Tuscany-2x/ws/sca-2x/distribution/all/target/apache-tuscany-sca-all-2.0-SNAPSHOT-src.zip> to <https://builds.apache.org/job/Tuscany-2x/ws/.repository/org/apache/tuscany/sca/tuscany-distribution-all/2.0-SNAPSHOT/tuscany-distribution-all-2.0-SNAPSHOT-src.zip>
[JENKINS] Archiving disabled - not archiving <https://builds.apache.org/job/Tuscany-2x/ws/sca-2x/distribution/all/pom.xml>
[JENKINS] Archiving disabled - not archiving <https://builds.apache.org/job/Tuscany-2x/ws/.repository/org/apache/tuscany/sca/tuscany-distribution-all/2.0-SNAPSHOT/tuscany-distribution-all-2.0-SNAPSHOT.pom>
[JENKINS] Archiving disabled - not archiving <https://builds.apache.org/job/Tuscany-2x/ws/sca-2x/distribution/all/target/apache-tuscany-sca-all-2.0-SNAPSHOT.tar.gz>
[JENKINS] Archiving disabled - not archiving <https://builds.apache.org/job/Tuscany-2x/ws/sca-2x/distribution/all/target/apache-tuscany-sca-all-2.0-SNAPSHOT.zip>
[JENKINS] Archiving disabled - not archiving <https://builds.apache.org/job/Tuscany-2x/ws/sca-2x/distribution/all/target/apache-tuscany-sca-all-2.0-SNAPSHOT-src.tar.gz>
[JENKINS] Archiving disabled - not archiving <https://builds.apache.org/job/Tuscany-2x/ws/sca-2x/distribution/all/target/apache-tuscany-sca-all-2.0-SNAPSHOT-src.zip>
[INFO] ------------------------------------------------------------------------
[INFO] Building Apache Tuscany SCA iTest Distribution
[INFO] task-segment: [clean, install]
[INFO] ------------------------------------------------------------------------
[INFO] [clean:clean {execution: default-clean}]
[INFO] [enforcer:enforce {execution: enforce-plugin-versions}]
[INFO] [remote-resources:process {execution: default}]
[INFO] [site:attach-descriptor {execution: default-attach-descriptor}]
[INFO] [install:install {execution: default-install}]
[INFO] Installing <https://builds.apache.org/job/Tuscany-2x/ws/sca-2x/testing/itest/distribution/pom.xml> to <https://builds.apache.org/job/Tuscany-2x/ws/.repository/org/apache/tuscany/sca/itest-distribution/2.0-SNAPSHOT/itest-distribution-2.0-SNAPSHOT.pom>
[JENKINS] Archiving disabled - not archiving <https://builds.apache.org/job/Tuscany-2x/ws/sca-2x/testing/itest/distribution/pom.xml>
[JENKINS] Archiving disabled - not archiving <https://builds.apache.org/job/Tuscany-2x/ws/.repository/org/apache/tuscany/sca/itest-distribution/2.0-SNAPSHOT/itest-distribution-2.0-SNAPSHOT.pom>
[INFO] ------------------------------------------------------------------------
[INFO] Building Apache Tuscany SCA iTest Distribution Src Distro Unzip
[INFO] task-segment: [clean, install]
[INFO] ------------------------------------------------------------------------
[INFO] [clean:clean {execution: default-clean}]
[INFO] [enforcer:enforce {execution: enforce-plugin-versions}]
[INFO] [remote-resources:process {execution: default}]
[INFO] [resources:resources {execution: default-resources}]
[INFO] Using 'UTF-8' encoding to copy filtered resources.
[INFO] skip non existing resourceDirectory <https://builds.apache.org/job/Tuscany-2x/ws/sca-2x/testing/itest/distribution/src-distro-unzip/src/main/resources>
[INFO] Copying 0 resource
[INFO] Copying 3 resources
[INFO] [compiler:compile {execution: default-compile}]
[INFO] No sources to compile
[INFO] [resources:testResources {execution: default-testResources}]
[INFO] Using 'UTF-8' encoding to copy filtered resources.
[INFO] skip non existing resourceDirectory <https://builds.apache.org/job/Tuscany-2x/ws/sca-2x/testing/itest/distribution/src-distro-unzip/src/test/resources>
[INFO] Copying 3 resources
[INFO] [compiler:testCompile {execution: default-testCompile}]
[INFO] No sources to compile
[INFO] [surefire:test {execution: default-test}]
[INFO] Surefire report directory: <https://builds.apache.org/job/Tuscany-2x/ws/sca-2x/testing/itest/distribution/src-distro-unzip/target/surefire-reports>
-------------------------------------------------------
T E S T S
-------------------------------------------------------
There are no tests to run.
Results :
Tests run: 0, Failures: 0, Errors: 0, Skipped: 0
[JENKINS] Recording test results
[INFO] [jar:jar {execution: default-jar}]
[INFO] Building jar: <https://builds.apache.org/job/Tuscany-2x/ws/sca-2x/testing/itest/distribution/src-distro-unzip/target/itest-src-distro-unzip-2.0-SNAPSHOT.jar>
[INFO] [antrun:run {execution: run-samples}]
[INFO] Executing tasks
unzip:
[unzip] Expanding: <https://builds.apache.org/job/Tuscany-2x/ws/sca-2x/distribution/all/target/apache-tuscany-sca-all-2.0-SNAPSHOT-src.zip> into <https://builds.apache.org/job/Tuscany-2x/ws/sca-2x/distribution/all/target/apache-tuscany-sca-all-2.0-SNAPSHOT-src.dir>
[INFO] Executed tasks
[INFO] [install:install {execution: default-install}]
[INFO] Installing <https://builds.apache.org/job/Tuscany-2x/ws/sca-2x/testing/itest/distribution/src-distro-unzip/target/itest-src-distro-unzip-2.0-SNAPSHOT.jar> to <https://builds.apache.org/job/Tuscany-2x/ws/.repository/org/apache/tuscany/sca/itest-src-distro-unzip/2.0-SNAPSHOT/itest-src-distro-unzip-2.0-SNAPSHOT.jar>
[JENKINS] Archiving disabled - not archiving <https://builds.apache.org/job/Tuscany-2x/ws/sca-2x/testing/itest/distribution/src-distro-unzip/pom.xml>
[JENKINS] Archiving disabled - not archiving <https://builds.apache.org/job/Tuscany-2x/ws/sca-2x/testing/itest/distribution/src-distro-unzip/target/itest-src-distro-unzip-2.0-SNAPSHOT.jar>
[INFO] ------------------------------------------------------------------------
[INFO] Building Apache Tuscany SCA iTest Distribution Src Distro RAT
[INFO] task-segment: [clean, install]
[INFO] ------------------------------------------------------------------------
Downloading: http://repo1.maven.org/maven2/org/apache/rat/apache-rat-plugin/0.6/apache-rat-plugin-0.6.pom
Downloading: http://repo1.maven.org/maven2/org/apache/rat/apache-rat-project/0.6/apache-rat-project-0.6.pom
Downloading: http://repo1.maven.org/maven2/org/apache/rat/apache-rat-plugin/0.6/apache-rat-plugin-0.6.jar
[INFO] [clean:clean {execution: default-clean}]
[INFO] [enforcer:enforce {execution: enforce-plugin-versions}]
[INFO] [remote-resources:process {execution: default}]
[INFO] [resources:resources {execution: default-resources}]
[INFO] Using 'UTF-8' encoding to copy filtered resources.
[INFO] skip non existing resourceDirectory <https://builds.apache.org/job/Tuscany-2x/ws/sca-2x/testing/itest/distribution/src-distro-rat/src/main/resources>
[INFO] Copying 0 resource
[INFO] Copying 3 resources
[INFO] [compiler:compile {execution: default-compile}]
[INFO] No sources to compile
[INFO] [resources:testResources {execution: default-testResources}]
[INFO] Using 'UTF-8' encoding to copy filtered resources.
[INFO] skip non existing resourceDirectory <https://builds.apache.org/job/Tuscany-2x/ws/sca-2x/testing/itest/distribution/src-distro-rat/src/test/resources>
[INFO] Copying 3 resources
[INFO] [compiler:testCompile {execution: default-testCompile}]
[INFO] No sources to compile
[INFO] [surefire:test {execution: default-test}]
[INFO] Surefire report directory: <https://builds.apache.org/job/Tuscany-2x/ws/sca-2x/testing/itest/distribution/src-distro-rat/target/surefire-reports>
-------------------------------------------------------
T E S T S
-------------------------------------------------------
There are no tests to run.
Results :
Tests run: 0, Failures: 0, Errors: 0, Skipped: 0
[JENKINS] Recording test results
[INFO] [jar:jar {execution: default-jar}]
[INFO] Building jar: <https://builds.apache.org/job/Tuscany-2x/ws/sca-2x/testing/itest/distribution/src-distro-rat/target/itest-distribution-src-dsitro-rat-2.0-SNAPSHOT.jar>
Downloading: http://repo1.maven.org/maven2/org/apache/rat/apache-rat-core/0.6/apache-rat-core-0.6.pom
Downloading: http://repo1.maven.org/maven2/org/apache/maven/shared/maven-plugin-testing-harness/1.0-beta-1/maven-plugin-testing-harness-1.0-beta-1.pom
Downloading: http://repo1.maven.org/maven2/org/apache/maven/shared/maven-shared-components/1/maven-shared-components-1.pom
Downloading: http://repo1.maven.org/maven2/org/codehaus/plexus/plexus-utils/1.4/plexus-utils-1.4.jar
Downloading: http://svn.apache.org/repos/asf/tuscany/maven/junit/junit/3.8.2/junit-3.8.2.jar
Downloading: http://repo1.maven.org/maven2/org/apache/rat/apache-rat-core/0.6/apache-rat-core-0.6.jar
Downloading: http://svn.apache.org/repos/asf/tuscany/maven/org/apache/maven/doxia/doxia-core/1.0-alpha-8/doxia-core-1.0-alpha-8.jar
Downloading: http://repo1.maven.org/maven2/org/apache/maven/shared/maven-plugin-testing-harness/1.0-beta-1/maven-plugin-testing-harness-1.0-beta-1.jar
[INFO] Unable to find resource 'org.apache.maven.doxia:doxia-core:jar:1.0-alpha-8' in repository tuscany.repo (http://svn.apache.org/repos/asf/tuscany/maven)
[INFO] Unable to find resource 'junit:junit:jar:3.8.2' in repository tuscany.repo (http://svn.apache.org/repos/asf/tuscany/maven)
Downloading: http://repo1.maven.org/maven2/org/apache/maven/doxia/doxia-core/1.0-alpha-8/doxia-core-1.0-alpha-8.jar
Downloading: http://repo1.maven.org/maven2/junit/junit/3.8.2/junit-3.8.2.jar
[INFO] [apache-rat:check {execution: default}]
[INFO] Exclude: tuscany-sca-2.0-SNAPSHOT-src/CHANGES
[INFO] Exclude: **/*.MF
[INFO] Exclude: tuscany-sca-2.0-SNAPSHOT-src/testing/itest/spi/spi-safe.txt
[INFO] Exclude: tuscany-sca-2.0-SNAPSHOT-src/testing/compliance-tests/binding-ws/sca_variables.dtd
[INFO] Exclude: tuscany-sca-2.0-SNAPSHOT-src/testing/itest/implementation-spring/src/main/resources/implementation/policies/CalculatorJass.config
[INFO] Exclude: tuscany-sca-2.0-SNAPSHOT-src/modules/binding-ws-runtime-axis2/src/main/resources/org/apache/tuscany/sca/binding/ws/axis2/engine/repository/modules/modules.list
[INFO] Exclude: tuscany-sca-2.0-SNAPSHOT-src/modules/binding-ws-runtime-axis2/src/main/resources/org/apache/tuscany/sca/binding/ws/axis2/engine/repository/services/services.list
[INFO] Exclude: tuscany-sca-2.0-SNAPSHOT-src/modules/implementation-spring-tie/src/main/resources/META-INF/spring.handlers
[INFO] Exclude: tuscany-sca-2.0-SNAPSHOT-src/modules/implementation-spring-tie/src/main/resources/META-INF/spring.schemas
[INFO] Exclude: tuscany-sca-2.0-SNAPSHOT-src/modules/implementation-spring-runtime/src/main/resources/META-INF/spring.handlers
[INFO] Exclude: tuscany-sca-2.0-SNAPSHOT-src/modules/implementation-spring-runtime/src/main/resources/META-INF/spring.schemas
[INFO] Exclude: tuscany-sca-2.0-SNAPSHOT-src/maven/archetypes/binding/src/test/resources/projects/basic/goal.txt
[INFO] Exclude: tuscany-sca-2.0-SNAPSHOT-src/maven/archetypes/implementation/src/test/resources/projects/basic/goal.txt
[INFO] Exclude: tuscany-sca-2.0-SNAPSHOT-src/modules/implementation-python-runtime/src/main/resources/django/__init__.py
[INFO] Exclude: tuscany-sca-2.0-SNAPSHOT-src/modules/implementation-python-runtime/src/main/resources/django/utils/__init__.py
[INFO] Exclude: tuscany-sca-2.0-SNAPSHOT-src/modules/assembly-xsd/**/*.*
[INFO] Exclude: tuscany-sca-2.0-SNAPSHOT-src/modules/sca-api/**/*.*
[INFO] Exclude: tuscany-sca-2.0-SNAPSHOT-src/modules/implementation-web-runtime/src/main/resources/META-INF/sca.tld
[INFO] Exclude: tuscany-sca-2.0-SNAPSHOT-src/modules/assembly-xml/src/main/resources/META-INF/sca-policy-1.1-intents-definitions-cd04.xml
[INFO] Exclude: tuscany-sca-2.0-SNAPSHOT-src/modules/sca-client-impl/src/main/java/org/apache/tuscany/sca/client/impl/SCAClientFactoryFinderImpl.java
[INFO] Exclude: tuscany-sca-2.0-SNAPSHOT-src/modules/binding-comet-runtime/src/main/resources/jquery.guid.js
[INFO] Exclude: tuscany-sca-2.0-SNAPSHOT-src/modules/binding-comet-runtime/src/main/resources/jquery.json-2.2.min.js
[INFO] Exclude: tuscany-sca-2.0-SNAPSHOT-src/modules/implementation-python-runtime/src/main/resources/django/utils/simplejson/*
[INFO] Exclude: tuscany-sca-2.0-SNAPSHOT-src/testing/compliance-tests/binding-jms/src/test/resources/tuscany-oasis-sca-tests-errors.properties
[JENKINS] Archiving disabled - not archiving <https://builds.apache.org/job/Tuscany-2x/ws/sca-2x/testing/itest/distribution/src-distro-rat/pom.xml>
[JENKINS] Archiving disabled - not archiving <https://builds.apache.org/job/Tuscany-2x/ws/sca-2x/testing/itest/distribution/src-distro-rat/target/itest-distribution-src-dsitro-rat-2.0-SNAPSHOT.jar>
[INFO] ------------------------------------------------------------------------
[ERROR] BUILD FAILURE
[INFO] ------------------------------------------------------------------------
[INFO] Too many unapproved licenses: 7
[INFO] ------------------------------------------------------------------------
[INFO] For more information, run Maven with the -e switch
[INFO] ------------------------------------------------------------------------
[INFO] Total time: 31 minutes 16 seconds
[INFO] Finished at: Fri Jan 20 00:52:19 UTC 2012
[INFO] Final Memory: 157M/720M
[INFO] ------------------------------------------------------------------------
Waiting for Jenkins to finish collecting data
channel stopped
2012-01-20 00:52:21.728:INFO::Shutdown hook executing
2012-01-20 00:52:21.728:INFO::Shutdown hook complete
Jenkins build is back to normal : Tuscany-2x #514
Posted by Apache Jenkins Server <je...@builds.apache.org>.
See <https://builds.apache.org/job/Tuscany-2x/514/changes>
Build failed in Jenkins: Tuscany-2x #513
Posted by Apache Jenkins Server <je...@builds.apache.org>.
See <https://builds.apache.org/job/Tuscany-2x/513/>
------------------------------------------
[...truncated 54487 lines...]
at org.apache.tuscany.sca.core.invocation.RuntimeInvoker.invoke(RuntimeInvoker.java:109)
at org.apache.tuscany.sca.core.invocation.RuntimeInvoker.invoke(RuntimeInvoker.java:92)
at org.apache.tuscany.sca.binding.ws.axis2.provider.Axis2ServiceBindingResponseInterceptor.invoke(Axis2ServiceBindingResponseInterceptor.java:59)
at org.apache.tuscany.sca.core.invocation.RuntimeInvoker.invokeBinding(RuntimeInvoker.java:69)
at org.apache.tuscany.sca.core.assembly.impl.RuntimeEndpointImpl.invoke(RuntimeEndpointImpl.java:320)
at org.apache.tuscany.sca.binding.ws.axis2.provider.TuscanyServiceProvider.invoke(TuscanyServiceProvider.java:167)
at org.apache.tuscany.sca.binding.ws.axis2.provider.Axis2ServiceInOutSyncMessageReceiver.invokeBusinessLogic(Axis2ServiceInOutSyncMessageReceiver.java:56)
at org.apache.axis2.receivers.AbstractInOutSyncMessageReceiver.invokeBusinessLogic(AbstractInOutSyncMessageReceiver.java:42)
at org.apache.axis2.receivers.AbstractMessageReceiver.receive(AbstractMessageReceiver.java:114)
at org.apache.axis2.engine.AxisEngine.receive(AxisEngine.java:173)
at org.apache.axis2.transport.http.HTTPTransportUtils.processHTTPPostRequest(HTTPTransportUtils.java:173)
at org.apache.axis2.transport.http.AxisServlet.doPost(AxisServlet.java:142)
at javax.servlet.http.HttpServlet.service(HttpServlet.java:727)
at javax.servlet.http.HttpServlet.service(HttpServlet.java:820)
at org.mortbay.jetty.servlet.ServletHolder.handle(ServletHolder.java:502)
at org.mortbay.jetty.servlet.ServletHandler.handle(ServletHandler.java:389)
at org.mortbay.jetty.servlet.SessionHandler.handle(SessionHandler.java:181)
at org.mortbay.jetty.handler.ContextHandler.handle(ContextHandler.java:765)
at org.mortbay.jetty.handler.HandlerWrapper.handle(HandlerWrapper.java:152)
at org.mortbay.jetty.Server.handle(Server.java:326)
at org.mortbay.jetty.HttpConnection.handleRequest(HttpConnection.java:534)
at org.mortbay.jetty.HttpConnection$RequestHandler.content(HttpConnection.java:879)
at org.mortbay.jetty.HttpParser.parseNext(HttpParser.java:747)
at org.mortbay.jetty.HttpParser.parseAvailable(HttpParser.java:218)
at org.mortbay.jetty.HttpConnection.handle(HttpConnection.java:404)
at org.mortbay.io.nio.SelectChannelEndPoint.run(SelectChannelEndPoint.java:409)
at org.apache.tuscany.sca.core.work.impl.Work.run(Work.java:63)
at org.apache.tuscany.sca.core.work.impl.ThreadPoolWorkManager$DecoratingWork.run(ThreadPoolWorkManager.java:214)
at java.util.concurrent.ThreadPoolExecutor.runWorker(ThreadPoolExecutor.java:1110)
at java.util.concurrent.ThreadPoolExecutor$Worker.run(ThreadPoolExecutor.java:603)
at java.lang.Thread.run(Thread.java:722)
Jan 25, 2012 3:30:24 AM org.apache.tuscany.sca.binding.ws.axis2.provider.Axis2ServiceInOutSyncMessageReceiver invokeBusinessLogic
SEVERE: org.apache.tuscany.sca.interfacedef.util.FaultException cannot be cast to org.apache.axiom.om.OMElement
java.lang.ClassCastException: org.apache.tuscany.sca.interfacedef.util.FaultException cannot be cast to org.apache.axiom.om.OMElement
at org.apache.tuscany.sca.binding.ws.axis2.provider.Axis2ReferenceBindingInvoker.invoke(Axis2ReferenceBindingInvoker.java:132)
at org.apache.tuscany.sca.core.invocation.InterceptorAsyncImpl.invoke(InterceptorAsyncImpl.java:58)
at org.apache.tuscany.sca.core.invocation.impl.JDKInvocationHandler.invoke(JDKInvocationHandler.java:329)
at org.apache.tuscany.sca.core.invocation.impl.JDKInvocationHandler.invoke(JDKInvocationHandler.java:272)
at org.apache.tuscany.sca.core.invocation.impl.JDKInvocationHandler.invoke(JDKInvocationHandler.java:125)
at org.apache.tuscany.sca.core.invocation.impl.AsyncJDKInvocationHandler.doInvokeSync(AsyncJDKInvocationHandler.java:238)
at org.apache.tuscany.sca.core.invocation.impl.AsyncJDKInvocationHandler.invoke(AsyncJDKInvocationHandler.java:157)
at $Proxy134.getGreetingsException(Unknown Source)
at org.apache.tuscany.sca.binding.ws.HelloWorld1Impl.getGreetingsException(HelloWorld1Impl.java:43)
at sun.reflect.NativeMethodAccessorImpl.invoke0(Native Method)
at sun.reflect.NativeMethodAccessorImpl.invoke(NativeMethodAccessorImpl.java:57)
at sun.reflect.DelegatingMethodAccessorImpl.invoke(DelegatingMethodAccessorImpl.java:43)
at java.lang.reflect.Method.invoke(Method.java:601)
at org.apache.tuscany.sca.implementation.java.invocation.JavaImplementationInvoker.invoke(JavaImplementationInvoker.java:190)
at org.apache.tuscany.sca.core.invocation.InterceptorAsyncImpl.invoke(InterceptorAsyncImpl.java:58)
at org.apache.tuscany.sca.core.invocation.RuntimeInvoker.invoke(RuntimeInvoker.java:126)
at org.apache.tuscany.sca.core.invocation.RuntimeInvoker.invoke(RuntimeInvoker.java:109)
at org.apache.tuscany.sca.core.invocation.RuntimeInvoker.invoke(RuntimeInvoker.java:92)
at org.apache.tuscany.sca.binding.ws.axis2.provider.Axis2ServiceBindingResponseInterceptor.invoke(Axis2ServiceBindingResponseInterceptor.java:59)
at org.apache.tuscany.sca.core.invocation.RuntimeInvoker.invokeBinding(RuntimeInvoker.java:69)
at org.apache.tuscany.sca.core.assembly.impl.RuntimeEndpointImpl.invoke(RuntimeEndpointImpl.java:320)
at org.apache.tuscany.sca.binding.ws.axis2.provider.TuscanyServiceProvider.invoke(TuscanyServiceProvider.java:167)
at org.apache.tuscany.sca.binding.ws.axis2.provider.Axis2ServiceInOutSyncMessageReceiver.invokeBusinessLogic(Axis2ServiceInOutSyncMessageReceiver.java:56)
at org.apache.axis2.receivers.AbstractInOutSyncMessageReceiver.invokeBusinessLogic(AbstractInOutSyncMessageReceiver.java:42)
at org.apache.axis2.receivers.AbstractMessageReceiver.receive(AbstractMessageReceiver.java:114)
at org.apache.axis2.engine.AxisEngine.receive(AxisEngine.java:173)
at org.apache.axis2.transport.http.HTTPTransportUtils.processHTTPPostRequest(HTTPTransportUtils.java:173)
at org.apache.axis2.transport.http.AxisServlet.doPost(AxisServlet.java:142)
at javax.servlet.http.HttpServlet.service(HttpServlet.java:727)
at javax.servlet.http.HttpServlet.service(HttpServlet.java:820)
at org.mortbay.jetty.servlet.ServletHolder.handle(ServletHolder.java:502)
at org.mortbay.jetty.servlet.ServletHandler.handle(ServletHandler.java:389)
at org.mortbay.jetty.servlet.SessionHandler.handle(SessionHandler.java:181)
at org.mortbay.jetty.handler.ContextHandler.handle(ContextHandler.java:765)
at org.mortbay.jetty.handler.HandlerWrapper.handle(HandlerWrapper.java:152)
at org.mortbay.jetty.Server.handle(Server.java:326)
at org.mortbay.jetty.HttpConnection.handleRequest(HttpConnection.java:534)
at org.mortbay.jetty.HttpConnection$RequestHandler.content(HttpConnection.java:879)
at org.mortbay.jetty.HttpParser.parseNext(HttpParser.java:747)
at org.mortbay.jetty.HttpParser.parseAvailable(HttpParser.java:218)
at org.mortbay.jetty.HttpConnection.handle(HttpConnection.java:404)
at org.mortbay.io.nio.SelectChannelEndPoint.run(SelectChannelEndPoint.java:409)
at org.apache.tuscany.sca.core.work.impl.Work.run(Work.java:63)
at org.apache.tuscany.sca.core.work.impl.ThreadPoolWorkManager$DecoratingWork.run(ThreadPoolWorkManager.java:214)
at java.util.concurrent.ThreadPoolExecutor.runWorker(ThreadPoolExecutor.java:1110)
at java.util.concurrent.ThreadPoolExecutor$Worker.run(ThreadPoolExecutor.java:603)
at java.lang.Thread.run(Thread.java:722)
Jan 25, 2012 3:30:24 AM org.apache.tuscany.sca.node.impl.NodeImpl stop
INFO: Stopping node: http://tuscany.apache.org/sca/1.1/nodes/default0
Jan 25, 2012 3:30:24 AM org.apache.tuscany.sca.core.assembly.impl.DomainRegistryImpl removeEndpoint
INFO: Remove endpoint - binding.ws - http://localhost:8085/HelloWorldService/HelloWorld
Jan 25, 2012 3:30:24 AM org.apache.tuscany.sca.http.jetty.JettyServer removeServletMapping
INFO: Removed Servlet mapping: /HelloWorldService/HelloWorld
Jan 25, 2012 3:30:24 AM org.apache.tuscany.sca.core.assembly.impl.DomainRegistryImpl removeEndpoint
INFO: Remove endpoint - binding.ws - http://67.195.138.9:8080/HelloWorldService1/HelloWorld1Impl
Jan 25, 2012 3:30:24 AM org.apache.tuscany.sca.http.jetty.JettyServer removeServletMapping
INFO: Removed Servlet mapping: /HelloWorldService1/HelloWorld1Impl
Jan 25, 2012 3:30:24 AM org.apache.tuscany.sca.core.assembly.impl.DomainRegistryImpl removeEndpoint
INFO: Remove endpoint - binding.ws - http://localhost:8087/HelloWorldService/HelloWorld-rpclit-porttype
Jan 25, 2012 3:30:24 AM org.apache.tuscany.sca.http.jetty.JettyServer removeServletMapping
INFO: Removed Servlet mapping: /HelloWorldService/HelloWorld-rpclit-porttype
Jan 25, 2012 3:30:24 AM org.apache.tuscany.sca.core.assembly.impl.DomainRegistryImpl removeEndpoint
INFO: Remove endpoint - binding.ws - http://67.195.138.9:8080/HelloWorldService1a/HelloWorld1Impl
Jan 25, 2012 3:30:24 AM org.apache.tuscany.sca.http.jetty.JettyServer removeServletMapping
INFO: Removed Servlet mapping: /HelloWorldService1a/HelloWorld1Impl
Jan 25, 2012 3:30:24 AM org.apache.tuscany.sca.core.assembly.impl.DomainRegistryImpl removeEndpoint
INFO: Remove endpoint - binding.ws - http://localhost:8087/HelloWorldService/HelloWorld-rpclit
Jan 25, 2012 3:30:24 AM org.apache.tuscany.sca.http.jetty.JettyServer removeServletMapping
INFO: Removed Servlet mapping: /HelloWorldService/HelloWorld-rpclit
Jan 25, 2012 3:30:24 AM org.apache.tuscany.sca.core.assembly.impl.DomainRegistryImpl removeEndpoint
INFO: Remove endpoint - binding.ws - http://67.195.138.9:8080/HelloWorldService2/HelloWorld2Impl
Jan 25, 2012 3:30:24 AM org.apache.tuscany.sca.http.jetty.JettyServer removeServletMapping
INFO: Removed Servlet mapping: /HelloWorldService2/HelloWorld2Impl
>>> Stopping external JAXWS client:
>>> Stopping external JAXWS service at http://localhost:8086/External/HelloWorld
Tests run: 3, Failures: 0, Errors: 0, Skipped: 0, Time elapsed: 2.069 sec
Results :
Tests run: 34, Failures: 0, Errors: 0, Skipped: 5
[JENKINS] Recording test results
[INFO] [jar:jar {execution: default-jar}]
[INFO] Building jar: <https://builds.apache.org/job/Tuscany-2x/ws/sca-2x/testing/itest/ws/launcher-axis2/target/itest-ws-launcher-axis2.jar>
[INFO] [install:install {execution: default-install}]
[INFO] Installing <https://builds.apache.org/job/Tuscany-2x/ws/sca-2x/testing/itest/ws/launcher-axis2/target/itest-ws-launcher-axis2.jar> to <https://builds.apache.org/job/Tuscany-2x/ws/.repository/org/apache/tuscany/sca/itest-ws-launcher-axis2/2.0-SNAPSHOT/itest-ws-launcher-axis2-2.0-SNAPSHOT.jar>
[JENKINS] Archiving disabled - not archiving <https://builds.apache.org/job/Tuscany-2x/ws/sca-2x/testing/itest/ws/launcher-axis2/pom.xml>
[JENKINS] Archiving disabled - not archiving <https://builds.apache.org/job/Tuscany-2x/ws/sca-2x/testing/itest/ws/launcher-axis2/target/itest-ws-launcher-axis2.jar>
[INFO] ------------------------------------------------------------------------
[INFO] Building Apache Tuscany SCA iTest WS WSDL Generation
[INFO] task-segment: [clean, install]
[INFO] ------------------------------------------------------------------------
[INFO] artifact org.codehaus.mojo:jaxws-maven-plugin: checking for updates from central
Downloading: http://repo1.maven.org/maven2/org/codehaus/mojo/jaxws-maven-plugin/1.10/jaxws-maven-plugin-1.10.pom
Downloading: http://repo1.maven.org/maven2/org/jvnet/jax-ws-commons/pom/1.0/pom-1.0.pom
Downloading: http://repo1.maven.org/maven2/org/codehaus/mojo/jaxws-maven-plugin/1.10/jaxws-maven-plugin-1.10.jar
[INFO] [clean:clean {execution: default-clean}]
[INFO] [enforcer:enforce {execution: enforce-plugin-versions}]
[WARNING] Rule 0: org.apache.maven.plugins.enforcer.RequirePluginVersions failed with message:
Some plugins are missing valid versions:(LATEST RELEASE SNAPSHOT are not allowed )
org.codehaus.mojo:jaxws-maven-plugin. The version currently in use is 1.10
Best Practice is to always define released plugin versions!
[INFO] [remote-resources:process {execution: default}]
[INFO] [resources:resources {execution: default-resources}]
[INFO] Using 'UTF-8' encoding to copy filtered resources.
[INFO] Copying 10 resources
[INFO] Copying 0 resource
[INFO] Copying 3 resources
[INFO] [compiler:compile {execution: default-compile}]
[INFO] Compiling 22 source files to <https://builds.apache.org/job/Tuscany-2x/ws/sca-2x/testing/itest/ws/wsdlgen/target/classes>
Downloading: http://repo1.maven.org/maven2/com/sun/xml/ws/jaxws-tools/2.1.3/jaxws-tools-2.1.3.pom
Downloading: http://svn.apache.org/repos/asf/tuscany/maven/com/sun/xml/ws/jaxws-rt/2.1.3/jaxws-rt-2.1.3.pom
[INFO] Unable to find resource 'com.sun.xml.ws:jaxws-rt:pom:2.1.3' in repository tuscany.repo (http://svn.apache.org/repos/asf/tuscany/maven)
Downloading: http://repo1.maven.org/maven2/com/sun/xml/ws/jaxws-rt/2.1.3/jaxws-rt-2.1.3.pom
Downloading: http://svn.apache.org/repos/asf/tuscany/maven/javax/xml/ws/jaxws-api/2.1/jaxws-api-2.1.pom
[INFO] Unable to find resource 'javax.xml.ws:jaxws-api:pom:2.1' in repository tuscany.repo (http://svn.apache.org/repos/asf/tuscany/maven)
Downloading: http://repo1.maven.org/maven2/javax/xml/ws/jaxws-api/2.1/jaxws-api-2.1.pom
Downloading: http://svn.apache.org/repos/asf/tuscany/maven/com/sun/xml/bind/jaxb-impl/2.1.6/jaxb-impl-2.1.6.pom
[INFO] Unable to find resource 'com.sun.xml.bind:jaxb-impl:pom:2.1.6' in repository tuscany.repo (http://svn.apache.org/repos/asf/tuscany/maven)
Downloading: http://repo1.maven.org/maven2/com/sun/xml/bind/jaxb-impl/2.1.6/jaxb-impl-2.1.6.pom
Downloading: http://svn.apache.org/repos/asf/tuscany/maven/com/sun/xml/messaging/saaj/saaj-impl/1.3/saaj-impl-1.3.pom
[INFO] Unable to find resource 'com.sun.xml.messaging.saaj:saaj-impl:pom:1.3' in repository tuscany.repo (http://svn.apache.org/repos/asf/tuscany/maven)
Downloading: http://repo1.maven.org/maven2/com/sun/xml/messaging/saaj/saaj-impl/1.3/saaj-impl-1.3.pom
Downloading: http://svn.apache.org/repos/asf/tuscany/maven/javax/xml/soap/saaj-api/1.3/saaj-api-1.3.pom
[INFO] Unable to find resource 'javax.xml.soap:saaj-api:pom:1.3' in repository tuscany.repo (http://svn.apache.org/repos/asf/tuscany/maven)
Downloading: http://repo1.maven.org/maven2/javax/xml/soap/saaj-api/1.3/saaj-api-1.3.pom
Downloading: http://svn.apache.org/repos/asf/tuscany/maven/activation/activation/1.0.2/activation-1.0.2.pom
[INFO] Unable to find resource 'activation:activation:pom:1.0.2' in repository tuscany.repo (http://svn.apache.org/repos/asf/tuscany/maven)
Downloading: http://repo1.maven.org/maven2/activation/activation/1.0.2/activation-1.0.2.pom
Downloading: http://svn.apache.org/repos/asf/tuscany/maven/javax/activation/activation/1.0.2/activation-1.0.2.pom
[INFO] Unable to find resource 'javax.activation:activation:pom:1.0.2' in repository tuscany.repo (http://svn.apache.org/repos/asf/tuscany/maven)
Downloading: http://repo1.maven.org/maven2/javax/activation/activation/1.0.2/activation-1.0.2.pom
Downloading: http://svn.apache.org/repos/asf/tuscany/maven/com/sun/xml/stream/buffer/streambuffer/0.7/streambuffer-0.7.pom
[INFO] Unable to find resource 'com.sun.xml.stream.buffer:streambuffer:pom:0.7' in repository tuscany.repo (http://svn.apache.org/repos/asf/tuscany/maven)
Downloading: http://repo1.maven.org/maven2/com/sun/xml/stream/buffer/streambuffer/0.7/streambuffer-0.7.pom
Downloading: http://svn.apache.org/repos/asf/tuscany/maven/com/sun/xml/stream/sjsxp/1.0/sjsxp-1.0.pom
[INFO] Unable to find resource 'com.sun.xml.stream:sjsxp:pom:1.0' in repository tuscany.repo (http://svn.apache.org/repos/asf/tuscany/maven)
Downloading: http://repo1.maven.org/maven2/com/sun/xml/stream/sjsxp/1.0/sjsxp-1.0.pom
Downloading: http://svn.apache.org/repos/asf/tuscany/maven/org/jvnet/mimepull/1.1/mimepull-1.1.pom
[INFO] Unable to find resource 'org.jvnet:mimepull:pom:1.1' in repository tuscany.repo (http://svn.apache.org/repos/asf/tuscany/maven)
Downloading: http://repo1.maven.org/maven2/org/jvnet/mimepull/1.1/mimepull-1.1.pom
Downloading: http://svn.apache.org/repos/asf/tuscany/maven/com/sun/xml/bind/jaxb-xjc/2.1.6/jaxb-xjc-2.1.6.pom
[INFO] Unable to find resource 'com.sun.xml.bind:jaxb-xjc:pom:2.1.6' in repository tuscany.repo (http://svn.apache.org/repos/asf/tuscany/maven)
Downloading: http://repo1.maven.org/maven2/com/sun/xml/bind/jaxb-xjc/2.1.6/jaxb-xjc-2.1.6.pom
Downloading: http://svn.apache.org/repos/asf/tuscany/maven/com/sun/xml/stream/buffer/streambuffer/0.7/streambuffer-0.7.jar
Downloading: http://svn.apache.org/repos/asf/tuscany/maven/com/sun/xml/bind/jaxb-impl/2.1.6/jaxb-impl-2.1.6.jar
Downloading: http://svn.apache.org/repos/asf/tuscany/maven/com/sun/xml/stream/sjsxp/1.0/sjsxp-1.0.jar
Downloading: http://svn.apache.org/repos/asf/tuscany/maven/com/sun/xml/messaging/saaj/saaj-impl/1.3/saaj-impl-1.3.jar
Downloading: http://repo1.maven.org/maven2/com/sun/xml/ws/jaxws-tools/2.1.3/jaxws-tools-2.1.3.jar
[INFO] Unable to find resource 'com.sun.xml.stream.buffer:streambuffer:jar:0.7' in repository tuscany.repo (http://svn.apache.org/repos/asf/tuscany/maven)
[INFO] Unable to find resource 'com.sun.xml.bind:jaxb-impl:jar:2.1.6' in repository tuscany.repo (http://svn.apache.org/repos/asf/tuscany/maven)
[INFO] Unable to find resource 'com.sun.xml.stream:sjsxp:jar:1.0' in repository tuscany.repo (http://svn.apache.org/repos/asf/tuscany/maven)
Downloading: http://repo1.maven.org/maven2/com/sun/xml/stream/sjsxp/1.0/sjsxp-1.0.jar
Downloading: http://repo1.maven.org/maven2/com/sun/xml/bind/jaxb-impl/2.1.6/jaxb-impl-2.1.6.jar
[INFO] Unable to find resource 'com.sun.xml.messaging.saaj:saaj-impl:jar:1.3' in repository tuscany.repo (http://svn.apache.org/repos/asf/tuscany/maven)
Downloading: http://repo1.maven.org/maven2/com/sun/xml/stream/buffer/streambuffer/0.7/streambuffer-0.7.jar
Downloading: http://repo1.maven.org/maven2/com/sun/xml/messaging/saaj/saaj-impl/1.3/saaj-impl-1.3.jar
Downloading: http://svn.apache.org/repos/asf/tuscany/maven/javax/xml/soap/saaj-api/1.3/saaj-api-1.3.jar
[INFO] Unable to find resource 'javax.xml.soap:saaj-api:jar:1.3' in repository tuscany.repo (http://svn.apache.org/repos/asf/tuscany/maven)
Downloading: http://repo1.maven.org/maven2/javax/xml/soap/saaj-api/1.3/saaj-api-1.3.jar
Downloading: http://svn.apache.org/repos/asf/tuscany/maven/org/jvnet/mimepull/1.1/mimepull-1.1.jar
[INFO] Unable to find resource 'org.jvnet:mimepull:jar:1.1' in repository tuscany.repo (http://svn.apache.org/repos/asf/tuscany/maven)
Downloading: http://repo1.maven.org/maven2/org/jvnet/mimepull/1.1/mimepull-1.1.jar
Downloading: http://svn.apache.org/repos/asf/tuscany/maven/com/sun/xml/ws/jaxws-rt/2.1.3/jaxws-rt-2.1.3.jar
[INFO] Unable to find resource 'com.sun.xml.ws:jaxws-rt:jar:2.1.3' in repository tuscany.repo (http://svn.apache.org/repos/asf/tuscany/maven)
Downloading: http://repo1.maven.org/maven2/com/sun/xml/ws/jaxws-rt/2.1.3/jaxws-rt-2.1.3.jar
Downloading: http://svn.apache.org/repos/asf/tuscany/maven/com/sun/xml/bind/jaxb-xjc/2.1.6/jaxb-xjc-2.1.6.jar
[INFO] Unable to find resource 'com.sun.xml.bind:jaxb-xjc:jar:2.1.6' in repository tuscany.repo (http://svn.apache.org/repos/asf/tuscany/maven)
Downloading: http://repo1.maven.org/maven2/com/sun/xml/bind/jaxb-xjc/2.1.6/jaxb-xjc-2.1.6.jar
[INFO] [jaxws:wsgen {execution: default}]
[JENKINS] Archiving disabled - not archiving <https://builds.apache.org/job/Tuscany-2x/ws/sca-2x/testing/itest/ws/wsdlgen/pom.xml>
[INFO] ------------------------------------------------------------------------
[ERROR] BUILD ERROR
[INFO] ------------------------------------------------------------------------
[INFO] Failed to execute wsgen
Embedded error: com/sun/mirror/apt/AnnotationProcessorFactory
com.sun.mirror.apt.AnnotationProcessorFactory
[INFO] ------------------------------------------------------------------------
[INFO] For more information, run Maven with the -e switch
[INFO] ------------------------------------------------------------------------
[INFO] Total time: 58 minutes 16 seconds
[INFO] Finished at: Wed Jan 25 03:30:51 UTC 2012
[INFO] Final Memory: 216M/685M
[INFO] ------------------------------------------------------------------------
Maven failed with error.
channel stopped
2012-01-25 03:30:53.099:INFO::Shutdown hook executing
2012-01-25 03:30:53.099:INFO::Shutdown hook complete
Build failed in Jenkins: Tuscany-2x #512
Posted by Apache Jenkins Server <je...@builds.apache.org>.
See <https://builds.apache.org/job/Tuscany-2x/512/changes>
Changes:
[antelder] Add exclude for policy archetype file
[antelder] Add parentheses to force correct evaluation
------------------------------------------
[...truncated 54374 lines...]
Jan 24, 2012 3:23:44 PM org.apache.tuscany.sca.http.jetty.JettyServer addServletMapping
INFO: Added Servlet mapping: http://localhost:8085/HelloWorldService/HelloWorld
Jan 24, 2012 3:23:44 PM org.apache.tuscany.sca.core.assembly.impl.DomainRegistryImpl addEndpoint
INFO: Add endpoint - binding.ws - http://localhost:8085/HelloWorldService/HelloWorld
Jan 24, 2012 3:23:44 PM org.apache.tuscany.sca.http.jetty.JettyLogger info
INFO: jetty-6.1.19
Jan 24, 2012 3:23:44 PM org.apache.tuscany.sca.http.jetty.JettyLogger info
INFO: Started SelectChannelConnector@0.0.0.0:8080
Jan 24, 2012 3:23:44 PM org.apache.tuscany.sca.http.jetty.JettyServer addServletMapping
INFO: Added Servlet mapping: http://67.195.138.8:8080/HelloWorldService1/HelloWorld1Impl
Jan 24, 2012 3:23:44 PM org.apache.tuscany.sca.core.assembly.impl.DomainRegistryImpl addEndpoint
INFO: Add endpoint - binding.ws - http://67.195.138.8:8080/HelloWorldService1/HelloWorld1Impl
Jan 24, 2012 3:23:44 PM org.apache.tuscany.sca.http.jetty.JettyServer addServletMapping
INFO: Added Servlet mapping: http://localhost:8085/HelloWorldService/HelloWorld-doclit
Jan 24, 2012 3:23:44 PM org.apache.tuscany.sca.core.assembly.impl.DomainRegistryImpl addEndpoint
INFO: Add endpoint - binding.ws - http://localhost:8085/HelloWorldService/HelloWorld-doclit
Jan 24, 2012 3:23:44 PM org.apache.tuscany.sca.http.jetty.JettyServer addServletMapping
INFO: Added Servlet mapping: http://67.195.138.8:8080/HelloWorldService2/HelloWorld2Impl
Jan 24, 2012 3:23:44 PM org.apache.tuscany.sca.core.assembly.impl.DomainRegistryImpl addEndpoint
INFO: Add endpoint - binding.ws - http://67.195.138.8:8080/HelloWorldService2/HelloWorld2Impl
>>> Starting external JAXWS client
Entering External Client HelloWorld.getGreetings: Fred
Entering SCA HelloWorld1.getGreetings: Fred
Entering SCA HelloWorld2.getGreetings: Fred
Entering External Service HelloWorld.getGreetings: Fred
Leaving External Service HelloWorld.getGreetings: Hello Fred
Leaving SCA HelloWorld2.getGreetings: Hello Fred
Leaving SCA HelloWorld1.getGreetings: Hello Fred
Leaving External Client HelloWorld.getGreetings: Hello Fred
Jan 24, 2012 3:23:44 PM org.apache.tuscany.sca.node.impl.NodeImpl stop
INFO: Stopping node: http://tuscany.apache.org/sca/1.1/nodes/default0
Jan 24, 2012 3:23:44 PM org.apache.tuscany.sca.core.assembly.impl.DomainRegistryImpl removeEndpoint
INFO: Remove endpoint - binding.ws - http://localhost:8085/HelloWorldService/HelloWorld
Jan 24, 2012 3:23:44 PM org.apache.tuscany.sca.http.jetty.JettyServer removeServletMapping
INFO: Removed Servlet mapping: /HelloWorldService/HelloWorld
Jan 24, 2012 3:23:44 PM org.apache.tuscany.sca.core.assembly.impl.DomainRegistryImpl removeEndpoint
INFO: Remove endpoint - binding.ws - http://67.195.138.8:8080/HelloWorldService1/HelloWorld1Impl
Jan 24, 2012 3:23:44 PM org.apache.tuscany.sca.http.jetty.JettyServer removeServletMapping
INFO: Removed Servlet mapping: /HelloWorldService1/HelloWorld1Impl
Jan 24, 2012 3:23:44 PM org.apache.tuscany.sca.core.assembly.impl.DomainRegistryImpl removeEndpoint
INFO: Remove endpoint - binding.ws - http://localhost:8085/HelloWorldService/HelloWorld-doclit
Jan 24, 2012 3:23:44 PM org.apache.tuscany.sca.http.jetty.JettyServer removeServletMapping
INFO: Removed Servlet mapping: /HelloWorldService/HelloWorld-doclit
Jan 24, 2012 3:23:44 PM org.apache.tuscany.sca.core.assembly.impl.DomainRegistryImpl removeEndpoint
INFO: Remove endpoint - binding.ws - http://67.195.138.8:8080/HelloWorldService2/HelloWorld2Impl
Jan 24, 2012 3:23:44 PM org.apache.tuscany.sca.http.jetty.JettyServer removeServletMapping
INFO: Removed Servlet mapping: /HelloWorldService2/HelloWorld2Impl
>>> Stopping external JAXWS client:
>>> Stopping external JAXWS service at http://localhost:8086/External/HelloWorld
>>> Starting external JAXWS service at http://localhost:8086/External/HelloWorld
Jan 24, 2012 3:23:44 PM org.apache.tuscany.sca.node.impl.NodeImpl start
INFO: Starting node: http://tuscany.apache.org/sca/1.1/nodes/default0 domain: default
Jan 24, 2012 3:23:44 PM org.apache.tuscany.sca.node.impl.NodeFactoryImpl loadContributions
INFO: Loading contribution: <https://builds.apache.org/job/Tuscany-2x/ws/sca-2x/testing/itest/ws/launcher-axis2/../contribution-doc-lit-wrapped/target/itest-ws-contribution-doc-lit-wrapped.jar>
Jan 24, 2012 3:23:44 PM org.apache.tuscany.sca.builder.impl.CompositePolicyBuilderImpl [Composite: {http://docs.oasis-open.org/ns/opencsa/sca/200912}, Component: HelloWorldService1, Reference: helloWorld2] (IntentNotSatisfiedAtBuild)
WARNING: The intent {http://docs.oasis-open.org/ns/opencsa/sca/200912}SOAP.v1_1 associated with policy subject (@23691667)EndpointReference: URI = HelloWorldService1#reference-binding(helloWorld2/helloWorld2) RESOLVED_BINDING Target = (@28961806)Endpoint: has no matching policy set
Jan 24, 2012 3:23:44 PM org.apache.tuscany.sca.builder.impl.CompositePolicyBuilderImpl [Composite: {http://docs.oasis-open.org/ns/opencsa/sca/200912}, Component: HelloWorldService2, Reference: helloWorldExternal] (IntentNotSatisfiedAtBuild)
WARNING: The intent {http://docs.oasis-open.org/ns/opencsa/sca/200912}SOAP.v1_1 associated with policy subject (@20495944)EndpointReference: URI = HelloWorldService2#reference-binding(helloWorldExternal/helloWorldExternal) RESOLVED_BINDING Target = (@5540722)Endpoint: has no matching policy set
Jan 24, 2012 3:23:44 PM org.apache.tuscany.sca.http.jetty.JettyLogger info
INFO: jetty-6.1.19
Jan 24, 2012 3:23:44 PM org.apache.tuscany.sca.http.jetty.JettyLogger info
INFO: Started SelectChannelConnector@localhost:8085
Jan 24, 2012 3:23:44 PM org.apache.tuscany.sca.http.jetty.JettyServer addServletMapping
INFO: Added Servlet mapping: http://localhost:8085/HelloWorldService/HelloWorld
Jan 24, 2012 3:23:44 PM org.apache.tuscany.sca.core.assembly.impl.DomainRegistryImpl addEndpoint
INFO: Add endpoint - binding.ws - http://localhost:8085/HelloWorldService/HelloWorld
Jan 24, 2012 3:23:44 PM org.apache.tuscany.sca.http.jetty.JettyLogger info
INFO: jetty-6.1.19
Jan 24, 2012 3:23:44 PM org.apache.tuscany.sca.http.jetty.JettyLogger info
INFO: Started SelectChannelConnector@0.0.0.0:8080
Jan 24, 2012 3:23:44 PM org.apache.tuscany.sca.http.jetty.JettyServer addServletMapping
INFO: Added Servlet mapping: http://67.195.138.8:8080/HelloWorldService1/HelloWorld1Impl
Jan 24, 2012 3:23:44 PM org.apache.tuscany.sca.core.assembly.impl.DomainRegistryImpl addEndpoint
INFO: Add endpoint - binding.ws - http://67.195.138.8:8080/HelloWorldService1/HelloWorld1Impl
Jan 24, 2012 3:23:44 PM org.apache.tuscany.sca.http.jetty.JettyServer addServletMapping
INFO: Added Servlet mapping: http://localhost:8085/HelloWorldService/HelloWorld-doclit
Jan 24, 2012 3:23:44 PM org.apache.tuscany.sca.core.assembly.impl.DomainRegistryImpl addEndpoint
INFO: Add endpoint - binding.ws - http://localhost:8085/HelloWorldService/HelloWorld-doclit
Jan 24, 2012 3:23:44 PM org.apache.tuscany.sca.http.jetty.JettyServer addServletMapping
INFO: Added Servlet mapping: http://67.195.138.8:8080/HelloWorldService2/HelloWorld2Impl
Jan 24, 2012 3:23:44 PM org.apache.tuscany.sca.core.assembly.impl.DomainRegistryImpl addEndpoint
INFO: Add endpoint - binding.ws - http://67.195.138.8:8080/HelloWorldService2/HelloWorld2Impl
>>> Starting external JAXWS client
Entering External Client HelloWorld.getGreetingsComplex: petra
Entering SCA HelloWorld1.getGreetingsComplex: petra
Entering SCA HelloWorld2.getGreetingsComplex: petra
Entering External Service HelloWorld.getGreetingsComplex: petra
Leaving External Service HelloWorld.getGreetingsComplex: petra
Leaving SCA HelloWorld2.getGreetingsComplex: petra
Leaving SCA HelloWorld1.getGreetingsComplex: petra
Leaving External Client HelloWorld.getGreetingsComplex: petra
Jan 24, 2012 3:23:45 PM org.apache.tuscany.sca.node.impl.NodeImpl stop
INFO: Stopping node: http://tuscany.apache.org/sca/1.1/nodes/default0
Jan 24, 2012 3:23:45 PM org.apache.tuscany.sca.core.assembly.impl.DomainRegistryImpl removeEndpoint
INFO: Remove endpoint - binding.ws - http://localhost:8085/HelloWorldService/HelloWorld
Jan 24, 2012 3:23:45 PM org.apache.tuscany.sca.http.jetty.JettyServer removeServletMapping
INFO: Removed Servlet mapping: /HelloWorldService/HelloWorld
Jan 24, 2012 3:23:45 PM org.apache.tuscany.sca.core.assembly.impl.DomainRegistryImpl removeEndpoint
INFO: Remove endpoint - binding.ws - http://67.195.138.8:8080/HelloWorldService1/HelloWorld1Impl
Jan 24, 2012 3:23:45 PM org.apache.tuscany.sca.http.jetty.JettyServer removeServletMapping
INFO: Removed Servlet mapping: /HelloWorldService1/HelloWorld1Impl
Jan 24, 2012 3:23:45 PM org.apache.tuscany.sca.core.assembly.impl.DomainRegistryImpl removeEndpoint
INFO: Remove endpoint - binding.ws - http://localhost:8085/HelloWorldService/HelloWorld-doclit
Jan 24, 2012 3:23:45 PM org.apache.tuscany.sca.http.jetty.JettyServer removeServletMapping
INFO: Removed Servlet mapping: /HelloWorldService/HelloWorld-doclit
Jan 24, 2012 3:23:45 PM org.apache.tuscany.sca.core.assembly.impl.DomainRegistryImpl removeEndpoint
INFO: Remove endpoint - binding.ws - http://67.195.138.8:8080/HelloWorldService2/HelloWorld2Impl
Jan 24, 2012 3:23:45 PM org.apache.tuscany.sca.http.jetty.JettyServer removeServletMapping
INFO: Removed Servlet mapping: /HelloWorldService2/HelloWorld2Impl
>>> Stopping external JAXWS client:
>>> Stopping external JAXWS service at http://localhost:8086/External/HelloWorld
Tests run: 3, Failures: 0, Errors: 0, Skipped: 0, Time elapsed: 1.492 sec
Results :
Tests run: 34, Failures: 0, Errors: 0, Skipped: 5
[JENKINS] Recording test results
[INFO] [jar:jar {execution: default-jar}]
[INFO] Building jar: <https://builds.apache.org/job/Tuscany-2x/ws/sca-2x/testing/itest/ws/launcher-axis2/target/itest-ws-launcher-axis2.jar>
[INFO] [install:install {execution: default-install}]
[INFO] Installing <https://builds.apache.org/job/Tuscany-2x/ws/sca-2x/testing/itest/ws/launcher-axis2/target/itest-ws-launcher-axis2.jar> to <https://builds.apache.org/job/Tuscany-2x/ws/.repository/org/apache/tuscany/sca/itest-ws-launcher-axis2/2.0-SNAPSHOT/itest-ws-launcher-axis2-2.0-SNAPSHOT.jar>
[JENKINS] Archiving disabled - not archiving <https://builds.apache.org/job/Tuscany-2x/ws/sca-2x/testing/itest/ws/launcher-axis2/pom.xml>
[JENKINS] Archiving disabled - not archiving <https://builds.apache.org/job/Tuscany-2x/ws/sca-2x/testing/itest/ws/launcher-axis2/target/itest-ws-launcher-axis2.jar>
[INFO] ------------------------------------------------------------------------
[INFO] Building Apache Tuscany SCA iTest WS WSDL Generation
[INFO] task-segment: [clean, install]
[INFO] ------------------------------------------------------------------------
[INFO] artifact org.codehaus.mojo:jaxws-maven-plugin: checking for updates from central
Downloading: http://repo1.maven.org/maven2/org/codehaus/mojo/jaxws-maven-plugin/1.10/jaxws-maven-plugin-1.10.pom
Downloading: http://repo1.maven.org/maven2/org/jvnet/jax-ws-commons/pom/1.0/pom-1.0.pom
Downloading: http://repo1.maven.org/maven2/org/codehaus/mojo/jaxws-maven-plugin/1.10/jaxws-maven-plugin-1.10.jar
[INFO] [clean:clean {execution: default-clean}]
[INFO] [enforcer:enforce {execution: enforce-plugin-versions}]
[WARNING] Rule 0: org.apache.maven.plugins.enforcer.RequirePluginVersions failed with message:
Some plugins are missing valid versions:(LATEST RELEASE SNAPSHOT are not allowed )
org.codehaus.mojo:jaxws-maven-plugin. The version currently in use is 1.10
Best Practice is to always define released plugin versions!
[INFO] [remote-resources:process {execution: default}]
[INFO] [resources:resources {execution: default-resources}]
[INFO] Using 'UTF-8' encoding to copy filtered resources.
[INFO] Copying 10 resources
[INFO] Copying 0 resource
[INFO] Copying 3 resources
[INFO] [compiler:compile {execution: default-compile}]
[INFO] Compiling 22 source files to <https://builds.apache.org/job/Tuscany-2x/ws/sca-2x/testing/itest/ws/wsdlgen/target/classes>
Downloading: http://repo1.maven.org/maven2/com/sun/xml/ws/jaxws-tools/2.1.3/jaxws-tools-2.1.3.pom
Downloading: http://svn.apache.org/repos/asf/tuscany/maven/com/sun/xml/ws/jaxws-rt/2.1.3/jaxws-rt-2.1.3.pom
[INFO] Unable to find resource 'com.sun.xml.ws:jaxws-rt:pom:2.1.3' in repository tuscany.repo (http://svn.apache.org/repos/asf/tuscany/maven)
Downloading: http://repo1.maven.org/maven2/com/sun/xml/ws/jaxws-rt/2.1.3/jaxws-rt-2.1.3.pom
Downloading: http://svn.apache.org/repos/asf/tuscany/maven/javax/xml/ws/jaxws-api/2.1/jaxws-api-2.1.pom
[INFO] Unable to find resource 'javax.xml.ws:jaxws-api:pom:2.1' in repository tuscany.repo (http://svn.apache.org/repos/asf/tuscany/maven)
Downloading: http://repo1.maven.org/maven2/javax/xml/ws/jaxws-api/2.1/jaxws-api-2.1.pom
Downloading: http://svn.apache.org/repos/asf/tuscany/maven/com/sun/xml/bind/jaxb-impl/2.1.6/jaxb-impl-2.1.6.pom
[INFO] Unable to find resource 'com.sun.xml.bind:jaxb-impl:pom:2.1.6' in repository tuscany.repo (http://svn.apache.org/repos/asf/tuscany/maven)
Downloading: http://repo1.maven.org/maven2/com/sun/xml/bind/jaxb-impl/2.1.6/jaxb-impl-2.1.6.pom
Downloading: http://svn.apache.org/repos/asf/tuscany/maven/com/sun/xml/messaging/saaj/saaj-impl/1.3/saaj-impl-1.3.pom
[INFO] Unable to find resource 'com.sun.xml.messaging.saaj:saaj-impl:pom:1.3' in repository tuscany.repo (http://svn.apache.org/repos/asf/tuscany/maven)
Downloading: http://repo1.maven.org/maven2/com/sun/xml/messaging/saaj/saaj-impl/1.3/saaj-impl-1.3.pom
Downloading: http://svn.apache.org/repos/asf/tuscany/maven/javax/xml/soap/saaj-api/1.3/saaj-api-1.3.pom
[INFO] Unable to find resource 'javax.xml.soap:saaj-api:pom:1.3' in repository tuscany.repo (http://svn.apache.org/repos/asf/tuscany/maven)
Downloading: http://repo1.maven.org/maven2/javax/xml/soap/saaj-api/1.3/saaj-api-1.3.pom
Downloading: http://svn.apache.org/repos/asf/tuscany/maven/activation/activation/1.0.2/activation-1.0.2.pom
[INFO] Unable to find resource 'activation:activation:pom:1.0.2' in repository tuscany.repo (http://svn.apache.org/repos/asf/tuscany/maven)
Downloading: http://repo1.maven.org/maven2/activation/activation/1.0.2/activation-1.0.2.pom
Downloading: http://svn.apache.org/repos/asf/tuscany/maven/javax/activation/activation/1.0.2/activation-1.0.2.pom
[INFO] Unable to find resource 'javax.activation:activation:pom:1.0.2' in repository tuscany.repo (http://svn.apache.org/repos/asf/tuscany/maven)
Downloading: http://repo1.maven.org/maven2/javax/activation/activation/1.0.2/activation-1.0.2.pom
Downloading: http://svn.apache.org/repos/asf/tuscany/maven/com/sun/xml/stream/buffer/streambuffer/0.7/streambuffer-0.7.pom
[INFO] Unable to find resource 'com.sun.xml.stream.buffer:streambuffer:pom:0.7' in repository tuscany.repo (http://svn.apache.org/repos/asf/tuscany/maven)
Downloading: http://repo1.maven.org/maven2/com/sun/xml/stream/buffer/streambuffer/0.7/streambuffer-0.7.pom
Downloading: http://svn.apache.org/repos/asf/tuscany/maven/com/sun/xml/stream/sjsxp/1.0/sjsxp-1.0.pom
[INFO] Unable to find resource 'com.sun.xml.stream:sjsxp:pom:1.0' in repository tuscany.repo (http://svn.apache.org/repos/asf/tuscany/maven)
Downloading: http://repo1.maven.org/maven2/com/sun/xml/stream/sjsxp/1.0/sjsxp-1.0.pom
Downloading: http://svn.apache.org/repos/asf/tuscany/maven/org/jvnet/mimepull/1.1/mimepull-1.1.pom
[INFO] Unable to find resource 'org.jvnet:mimepull:pom:1.1' in repository tuscany.repo (http://svn.apache.org/repos/asf/tuscany/maven)
Downloading: http://repo1.maven.org/maven2/org/jvnet/mimepull/1.1/mimepull-1.1.pom
Downloading: http://svn.apache.org/repos/asf/tuscany/maven/com/sun/xml/bind/jaxb-xjc/2.1.6/jaxb-xjc-2.1.6.pom
[INFO] Unable to find resource 'com.sun.xml.bind:jaxb-xjc:pom:2.1.6' in repository tuscany.repo (http://svn.apache.org/repos/asf/tuscany/maven)
Downloading: http://repo1.maven.org/maven2/com/sun/xml/bind/jaxb-xjc/2.1.6/jaxb-xjc-2.1.6.pom
Downloading: http://svn.apache.org/repos/asf/tuscany/maven/com/sun/xml/messaging/saaj/saaj-impl/1.3/saaj-impl-1.3.jar
Downloading: http://svn.apache.org/repos/asf/tuscany/maven/com/sun/xml/stream/sjsxp/1.0/sjsxp-1.0.jar
Downloading: http://svn.apache.org/repos/asf/tuscany/maven/com/sun/xml/stream/buffer/streambuffer/0.7/streambuffer-0.7.jar
Downloading: http://repo1.maven.org/maven2/com/sun/xml/ws/jaxws-tools/2.1.3/jaxws-tools-2.1.3.jar
Downloading: http://svn.apache.org/repos/asf/tuscany/maven/com/sun/xml/bind/jaxb-impl/2.1.6/jaxb-impl-2.1.6.jar
[INFO] Unable to find resource 'com.sun.xml.messaging.saaj:saaj-impl:jar:1.3' in repository tuscany.repo (http://svn.apache.org/repos/asf/tuscany/maven)
[INFO] Unable to find resource 'com.sun.xml.stream:sjsxp:jar:1.0' in repository tuscany.repo (http://svn.apache.org/repos/asf/tuscany/maven)
Downloading: http://repo1.maven.org/maven2/com/sun/xml/messaging/saaj/saaj-impl/1.3/saaj-impl-1.3.jar
Downloading: http://repo1.maven.org/maven2/com/sun/xml/stream/sjsxp/1.0/sjsxp-1.0.jar
[INFO] Unable to find resource 'com.sun.xml.stream.buffer:streambuffer:jar:0.7' in repository tuscany.repo (http://svn.apache.org/repos/asf/tuscany/maven)
[WARNING] Component manager not found for returned component. Ignored. component=org.apache.maven.wagon.providers.http.LightweightHttpWagon@1547623
[INFO] Unable to find resource 'com.sun.xml.bind:jaxb-impl:jar:2.1.6' in repository tuscany.repo (http://svn.apache.org/repos/asf/tuscany/maven)
Downloading: http://repo1.maven.org/maven2/com/sun/xml/stream/buffer/streambuffer/0.7/streambuffer-0.7.jar
Downloading: http://repo1.maven.org/maven2/com/sun/xml/bind/jaxb-impl/2.1.6/jaxb-impl-2.1.6.jar
Downloading: http://svn.apache.org/repos/asf/tuscany/maven/javax/xml/soap/saaj-api/1.3/saaj-api-1.3.jar
[INFO] Unable to find resource 'javax.xml.soap:saaj-api:jar:1.3' in repository tuscany.repo (http://svn.apache.org/repos/asf/tuscany/maven)
Downloading: http://repo1.maven.org/maven2/javax/xml/soap/saaj-api/1.3/saaj-api-1.3.jar
Downloading: http://svn.apache.org/repos/asf/tuscany/maven/org/jvnet/mimepull/1.1/mimepull-1.1.jar
[INFO] Unable to find resource 'org.jvnet:mimepull:jar:1.1' in repository tuscany.repo (http://svn.apache.org/repos/asf/tuscany/maven)
Downloading: http://repo1.maven.org/maven2/org/jvnet/mimepull/1.1/mimepull-1.1.jar
Downloading: http://svn.apache.org/repos/asf/tuscany/maven/com/sun/xml/ws/jaxws-rt/2.1.3/jaxws-rt-2.1.3.jar
[INFO] Unable to find resource 'com.sun.xml.ws:jaxws-rt:jar:2.1.3' in repository tuscany.repo (http://svn.apache.org/repos/asf/tuscany/maven)
Downloading: http://repo1.maven.org/maven2/com/sun/xml/ws/jaxws-rt/2.1.3/jaxws-rt-2.1.3.jar
Downloading: http://svn.apache.org/repos/asf/tuscany/maven/com/sun/xml/bind/jaxb-xjc/2.1.6/jaxb-xjc-2.1.6.jar
[INFO] Unable to find resource 'com.sun.xml.bind:jaxb-xjc:jar:2.1.6' in repository tuscany.repo (http://svn.apache.org/repos/asf/tuscany/maven)
Downloading: http://repo1.maven.org/maven2/com/sun/xml/bind/jaxb-xjc/2.1.6/jaxb-xjc-2.1.6.jar
[INFO] [jaxws:wsgen {execution: default}]
[JENKINS] Archiving disabled - not archiving <https://builds.apache.org/job/Tuscany-2x/ws/sca-2x/testing/itest/ws/wsdlgen/pom.xml>
[INFO] ------------------------------------------------------------------------
[ERROR] BUILD ERROR
[INFO] ------------------------------------------------------------------------
[INFO] Failed to execute wsgen
Embedded error: com/sun/mirror/apt/AnnotationProcessorFactory
com.sun.mirror.apt.AnnotationProcessorFactory
[INFO] ------------------------------------------------------------------------
[INFO] For more information, run Maven with the -e switch
[INFO] ------------------------------------------------------------------------
[INFO] Total time: 49 minutes 15 seconds
[INFO] Finished at: Tue Jan 24 15:24:01 UTC 2012
[INFO] Final Memory: 200M/687M
[INFO] ------------------------------------------------------------------------
channel stopped
2012-01-24 15:24:03.318:INFO::Shutdown hook executing
2012-01-24 15:24:03.318:INFO::Shutdown hook complete
Build failed in Jenkins: Tuscany-2x #511
Posted by Apache Jenkins Server <je...@builds.apache.org>.
See <https://builds.apache.org/job/Tuscany-2x/511/changes>
Changes:
[antelder] Add exclude for legal checks
[antelder] Add missing license headers
[antelder] Add meta-inf/service file for all the MessageProcessors
[antelder] Change the JMS binding MessageProcessor discovery to use ServiceDiscovery so that additional processors can be added in OSGi
[antelder] Exclude two JMS callback compliance tests which no longer work
[antelder] Update expected error message for latest JMS binding code
[antelder] Update JMS selectors test to match new selectedOperation behaviour
[antelder] TUSCANY-4008: Apply patch from Jennifer A Thompson to fix JMS binding operationProperties 'selectedOperation' element not selecting the correct operation
[antelder] TUSCANY-4008: Apply patch from Jennifer A Thompson to fix JMS binding operationProperties 'selectedOperation' element not selecting the correct operation
------------------------------------------
[...truncated 39821 lines...]
[INFO] Unable to find resource 'org.apache.maven:maven-monitor:pom:2.0' in repository java.net2 (http://download.java.net/maven/2)
Downloading: http://www.intalio.org/public/maven2/org/apache/maven/maven-monitor/2.0/maven-monitor-2.0.pom
400b downloaded (maven-monitor-2.0.pom)
Downloading: http://download.java.net/maven/2/org/apache/maven/wagon/wagon-ssh/1.0-alpha-5/wagon-ssh-1.0-alpha-5.pom
[INFO] Unable to find resource 'org.apache.maven.wagon:wagon-ssh:pom:1.0-alpha-5' in repository java.net2 (http://download.java.net/maven/2)
Downloading: http://www.intalio.org/public/maven2/org/apache/maven/wagon/wagon-ssh/1.0-alpha-5/wagon-ssh-1.0-alpha-5.pom
[INFO] Unable to find resource 'org.apache.maven.wagon:wagon-ssh:pom:1.0-alpha-5' in repository intalio.org (http://www.intalio.org/public/maven2)
Downloading: http://svn.apache.org/repos/asf/openejb/repo/org/apache/maven/wagon/wagon-ssh/1.0-alpha-5/wagon-ssh-1.0-alpha-5.pom
[INFO] Unable to find resource 'org.apache.maven.wagon:wagon-ssh:pom:1.0-alpha-5' in repository openejb-repository (http://svn.apache.org/repos/asf/openejb/repo)
Downloading: http://svn.apache.org/repos/asf/tuscany/maven/org/apache/maven/wagon/wagon-ssh/1.0-alpha-5/wagon-ssh-1.0-alpha-5.pom
[INFO] Unable to find resource 'org.apache.maven.wagon:wagon-ssh:pom:1.0-alpha-5' in repository tuscany.repo (http://svn.apache.org/repos/asf/tuscany/maven)
Downloading: http://repo1.maven.org/maven2/org/apache/maven/wagon/wagon-ssh/1.0-alpha-5/wagon-ssh-1.0-alpha-5.pom
Downloading: http://download.java.net/maven/2/com/jcraft/jsch/0.1.23/jsch-0.1.23.pom
[INFO] Unable to find resource 'com.jcraft:jsch:pom:0.1.23' in repository java.net2 (http://download.java.net/maven/2)
Downloading: http://www.intalio.org/public/maven2/com/jcraft/jsch/0.1.23/jsch-0.1.23.pom
[INFO] Unable to find resource 'com.jcraft:jsch:pom:0.1.23' in repository intalio.org (http://www.intalio.org/public/maven2)
Downloading: http://svn.apache.org/repos/asf/openejb/repo/com/jcraft/jsch/0.1.23/jsch-0.1.23.pom
[INFO] Unable to find resource 'com.jcraft:jsch:pom:0.1.23' in repository openejb-repository (http://svn.apache.org/repos/asf/openejb/repo)
Downloading: http://svn.apache.org/repos/asf/tuscany/maven/com/jcraft/jsch/0.1.23/jsch-0.1.23.pom
[INFO] Unable to find resource 'com.jcraft:jsch:pom:0.1.23' in repository tuscany.repo (http://svn.apache.org/repos/asf/tuscany/maven)
Downloading: http://repo1.maven.org/maven2/com/jcraft/jsch/0.1.23/jsch-0.1.23.pom
Downloading: http://repo1.maven.org/maven2/org/codehaus/plexus/plexus-interpolation/1.7/plexus-interpolation-1.7.pom
Downloading: http://repo1.maven.org/maven2/org/codehaus/plexus/plexus-archiver/1.0-alpha-12/plexus-archiver-1.0-alpha-12.pom
Downloading: http://download.java.net/maven/2/org/codehaus/plexus/plexus-io/1.0-alpha-4/plexus-io-1.0-alpha-4.pom
[INFO] Unable to find resource 'org.codehaus.plexus:plexus-io:pom:1.0-alpha-4' in repository java.net2 (http://download.java.net/maven/2)
Downloading: http://www.intalio.org/public/maven2/org/codehaus/plexus/plexus-io/1.0-alpha-4/plexus-io-1.0-alpha-4.pom
1K downloaded (plexus-io-1.0-alpha-4.pom)
Downloading: http://repo1.maven.org/maven2/org/codehaus/plexus/plexus-active-collections/1.0-beta-2/plexus-active-collections-1.0-beta-2.pom
Downloading: http://download.java.net/maven/2/org/codehaus/plexus/plexus-container-default/1.0-alpha-22/plexus-container-default-1.0-alpha-22.pom
[INFO] Unable to find resource 'org.codehaus.plexus:plexus-container-default:pom:1.0-alpha-22' in repository java.net2 (http://download.java.net/maven/2)
Downloading: http://www.intalio.org/public/maven2/org/codehaus/plexus/plexus-container-default/1.0-alpha-22/plexus-container-default-1.0-alpha-22.pom
[INFO] Unable to find resource 'org.codehaus.plexus:plexus-container-default:pom:1.0-alpha-22' in repository intalio.org (http://www.intalio.org/public/maven2)
Downloading: http://svn.apache.org/repos/asf/openejb/repo/org/codehaus/plexus/plexus-container-default/1.0-alpha-22/plexus-container-default-1.0-alpha-22.pom
[INFO] Unable to find resource 'org.codehaus.plexus:plexus-container-default:pom:1.0-alpha-22' in repository openejb-repository (http://svn.apache.org/repos/asf/openejb/repo)
Downloading: http://svn.apache.org/repos/asf/tuscany/maven/org/codehaus/plexus/plexus-container-default/1.0-alpha-22/plexus-container-default-1.0-alpha-22.pom
[INFO] Unable to find resource 'org.codehaus.plexus:plexus-container-default:pom:1.0-alpha-22' in repository tuscany.repo (http://svn.apache.org/repos/asf/tuscany/maven)
Downloading: http://repo1.maven.org/maven2/org/codehaus/plexus/plexus-container-default/1.0-alpha-22/plexus-container-default-1.0-alpha-22.pom
Downloading: http://download.java.net/maven/2/org/codehaus/plexus/plexus-containers/1.0-alpha-22/plexus-containers-1.0-alpha-22.pom
[INFO] Unable to find resource 'org.codehaus.plexus:plexus-containers:pom:1.0-alpha-22' in repository java.net2 (http://download.java.net/maven/2)
Downloading: http://www.intalio.org/public/maven2/org/codehaus/plexus/plexus-containers/1.0-alpha-22/plexus-containers-1.0-alpha-22.pom
[INFO] Unable to find resource 'org.codehaus.plexus:plexus-containers:pom:1.0-alpha-22' in repository intalio.org (http://www.intalio.org/public/maven2)
Downloading: http://svn.apache.org/repos/asf/openejb/repo/org/codehaus/plexus/plexus-containers/1.0-alpha-22/plexus-containers-1.0-alpha-22.pom
[INFO] Unable to find resource 'org.codehaus.plexus:plexus-containers:pom:1.0-alpha-22' in repository openejb-repository (http://svn.apache.org/repos/asf/openejb/repo)
Downloading: http://svn.apache.org/repos/asf/tuscany/maven/org/codehaus/plexus/plexus-containers/1.0-alpha-22/plexus-containers-1.0-alpha-22.pom
[INFO] Unable to find resource 'org.codehaus.plexus:plexus-containers:pom:1.0-alpha-22' in repository tuscany.repo (http://svn.apache.org/repos/asf/tuscany/maven)
Downloading: http://repo1.maven.org/maven2/org/codehaus/plexus/plexus-containers/1.0-alpha-22/plexus-containers-1.0-alpha-22.pom
Downloading: http://repo1.maven.org/maven2/org/codehaus/plexus/plexus-utils/2.0.1/plexus-utils-2.0.1.pom
Downloading: http://repo1.maven.org/maven2/org/codehaus/plexus/plexus-utils/2.0.1/plexus-utils-2.0.1.jar
Downloading: http://repo1.maven.org/maven2/org/apache/maven/shared/maven-common-artifact-filters/1.1/maven-common-artifact-filters-1.1.jar
Downloading: http://repo1.maven.org/maven2/org/codehaus/plexus/plexus-archiver/1.0-alpha-12/plexus-archiver-1.0-alpha-12.jar
Downloading: http://repo1.maven.org/maven2/org/codehaus/plexus/plexus-interpolation/1.7/plexus-interpolation-1.7.jar
Downloading: http://repo1.maven.org/maven2/org/codehaus/plexus/plexus-io/1.0-alpha-4/plexus-io-1.0-alpha-4.jar
Downloading: http://repo1.maven.org/maven2/org/codehaus/plexus/plexus-active-collections/1.0-beta-2/plexus-active-collections-1.0-beta-2.jar
[INFO] [assembly:single {execution: distribution-package}]
[INFO] Reading assembly descriptor: src/main/assembly/bin-distribution.xml
[INFO] Reading assembly descriptor: src/main/assembly/src.xml
[WARNING] Cannot include project artifact: org.apache.tuscany.sca:tuscany-distribution-all:pom:2.0-SNAPSHOT; it doesn't have an associated file or directory.
[WARNING] Cannot include project artifact: org.apache.tuscany.sca:tuscany-distribution-all:pom:2.0-SNAPSHOT; it doesn't have an associated file or directory.
[INFO] Building tar : <https://builds.apache.org/job/Tuscany-2x/ws/sca-2x/distribution/all/target/apache-tuscany-sca-all-2.0-SNAPSHOT.tar.gz>
[WARNING] Cannot include project artifact: org.apache.tuscany.sca:tuscany-distribution-all:pom:2.0-SNAPSHOT; it doesn't have an associated file or directory.
[WARNING] Cannot include project artifact: org.apache.tuscany.sca:tuscany-distribution-all:pom:2.0-SNAPSHOT; it doesn't have an associated file or directory.
[INFO] Building zip: <https://builds.apache.org/job/Tuscany-2x/ws/sca-2x/distribution/all/target/apache-tuscany-sca-all-2.0-SNAPSHOT.zip>
[INFO] Building tar : <https://builds.apache.org/job/Tuscany-2x/ws/sca-2x/distribution/all/target/apache-tuscany-sca-all-2.0-SNAPSHOT-src.tar.gz>
[INFO] Building zip: <https://builds.apache.org/job/Tuscany-2x/ws/sca-2x/distribution/all/target/apache-tuscany-sca-all-2.0-SNAPSHOT-src.zip>
[INFO] [install:install {execution: default-install}]
[INFO] Installing <https://builds.apache.org/job/Tuscany-2x/ws/sca-2x/distribution/all/pom.xml> to <https://builds.apache.org/job/Tuscany-2x/ws/.repository/org/apache/tuscany/sca/tuscany-distribution-all/2.0-SNAPSHOT/tuscany-distribution-all-2.0-SNAPSHOT.pom>
[INFO] Installing <https://builds.apache.org/job/Tuscany-2x/ws/sca-2x/distribution/all/target/apache-tuscany-sca-all-2.0-SNAPSHOT.tar.gz> to <https://builds.apache.org/job/Tuscany-2x/ws/.repository/org/apache/tuscany/sca/tuscany-distribution-all/2.0-SNAPSHOT/tuscany-distribution-all-2.0-SNAPSHOT.tar.gz>
[INFO] Installing <https://builds.apache.org/job/Tuscany-2x/ws/sca-2x/distribution/all/target/apache-tuscany-sca-all-2.0-SNAPSHOT.zip> to <https://builds.apache.org/job/Tuscany-2x/ws/.repository/org/apache/tuscany/sca/tuscany-distribution-all/2.0-SNAPSHOT/tuscany-distribution-all-2.0-SNAPSHOT.zip>
[INFO] Installing <https://builds.apache.org/job/Tuscany-2x/ws/sca-2x/distribution/all/target/apache-tuscany-sca-all-2.0-SNAPSHOT-src.tar.gz> to <https://builds.apache.org/job/Tuscany-2x/ws/.repository/org/apache/tuscany/sca/tuscany-distribution-all/2.0-SNAPSHOT/tuscany-distribution-all-2.0-SNAPSHOT-src.tar.gz>
[INFO] Installing <https://builds.apache.org/job/Tuscany-2x/ws/sca-2x/distribution/all/target/apache-tuscany-sca-all-2.0-SNAPSHOT-src.zip> to <https://builds.apache.org/job/Tuscany-2x/ws/.repository/org/apache/tuscany/sca/tuscany-distribution-all/2.0-SNAPSHOT/tuscany-distribution-all-2.0-SNAPSHOT-src.zip>
[JENKINS] Archiving disabled - not archiving <https://builds.apache.org/job/Tuscany-2x/ws/sca-2x/distribution/all/pom.xml>
[JENKINS] Archiving disabled - not archiving <https://builds.apache.org/job/Tuscany-2x/ws/.repository/org/apache/tuscany/sca/tuscany-distribution-all/2.0-SNAPSHOT/tuscany-distribution-all-2.0-SNAPSHOT.pom>
[JENKINS] Archiving disabled - not archiving <https://builds.apache.org/job/Tuscany-2x/ws/sca-2x/distribution/all/target/apache-tuscany-sca-all-2.0-SNAPSHOT.tar.gz>
[JENKINS] Archiving disabled - not archiving <https://builds.apache.org/job/Tuscany-2x/ws/sca-2x/distribution/all/target/apache-tuscany-sca-all-2.0-SNAPSHOT.zip>
[JENKINS] Archiving disabled - not archiving <https://builds.apache.org/job/Tuscany-2x/ws/sca-2x/distribution/all/target/apache-tuscany-sca-all-2.0-SNAPSHOT-src.tar.gz>
[JENKINS] Archiving disabled - not archiving <https://builds.apache.org/job/Tuscany-2x/ws/sca-2x/distribution/all/target/apache-tuscany-sca-all-2.0-SNAPSHOT-src.zip>
[INFO] ------------------------------------------------------------------------
[INFO] Building Apache Tuscany SCA iTest Distribution
[INFO] task-segment: [clean, install]
[INFO] ------------------------------------------------------------------------
[INFO] [clean:clean {execution: default-clean}]
[INFO] [enforcer:enforce {execution: enforce-plugin-versions}]
[INFO] [remote-resources:process {execution: default}]
[INFO] [site:attach-descriptor {execution: default-attach-descriptor}]
[INFO] [install:install {execution: default-install}]
[INFO] Installing <https://builds.apache.org/job/Tuscany-2x/ws/sca-2x/testing/itest/distribution/pom.xml> to <https://builds.apache.org/job/Tuscany-2x/ws/.repository/org/apache/tuscany/sca/itest-distribution/2.0-SNAPSHOT/itest-distribution-2.0-SNAPSHOT.pom>
[JENKINS] Archiving disabled - not archiving <https://builds.apache.org/job/Tuscany-2x/ws/sca-2x/testing/itest/distribution/pom.xml>
[JENKINS] Archiving disabled - not archiving <https://builds.apache.org/job/Tuscany-2x/ws/.repository/org/apache/tuscany/sca/itest-distribution/2.0-SNAPSHOT/itest-distribution-2.0-SNAPSHOT.pom>
[INFO] ------------------------------------------------------------------------
[INFO] Building Apache Tuscany SCA iTest Distribution Src Distro Unzip
[INFO] task-segment: [clean, install]
[INFO] ------------------------------------------------------------------------
[INFO] [clean:clean {execution: default-clean}]
[INFO] [enforcer:enforce {execution: enforce-plugin-versions}]
[INFO] [remote-resources:process {execution: default}]
[INFO] [resources:resources {execution: default-resources}]
[JENKINS] Recording test results[INFO] Using 'UTF-8' encoding to copy filtered resources.
[INFO] skip non existing resourceDirectory <https://builds.apache.org/job/Tuscany-2x/ws/sca-2x/testing/itest/distribution/src-distro-unzip/src/main/resources>
[INFO] Copying 0 resource
[INFO] Copying 3 resources
[INFO] [compiler:compile {execution: default-compile}]
[INFO] No sources to compile
[INFO] [resources:testResources {execution: default-testResources}]
[INFO] Using 'UTF-8' encoding to copy filtered resources.
[INFO] skip non existing resourceDirectory <https://builds.apache.org/job/Tuscany-2x/ws/sca-2x/testing/itest/distribution/src-distro-unzip/src/test/resources>
[INFO] Copying 3 resources
[INFO] [compiler:testCompile {execution: default-testCompile}]
[INFO] No sources to compile
[INFO] [surefire:test {execution: default-test}]
[INFO] Surefire report directory: <https://builds.apache.org/job/Tuscany-2x/ws/sca-2x/testing/itest/distribution/src-distro-unzip/target/surefire-reports>
-------------------------------------------------------
T E S T S
-------------------------------------------------------
There are no tests to run.
Results :
Tests run: 0, Failures: 0, Errors: 0, Skipped: 0
[INFO] [jar:jar {execution: default-jar}]
[INFO] Building jar: <https://builds.apache.org/job/Tuscany-2x/ws/sca-2x/testing/itest/distribution/src-distro-unzip/target/itest-src-distro-unzip-2.0-SNAPSHOT.jar>
[INFO] [antrun:run {execution: run-samples}]
[INFO] Executing tasks
unzip:
[unzip] Expanding: <https://builds.apache.org/job/Tuscany-2x/ws/sca-2x/distribution/all/target/apache-tuscany-sca-all-2.0-SNAPSHOT-src.zip> into <https://builds.apache.org/job/Tuscany-2x/ws/sca-2x/distribution/all/target/apache-tuscany-sca-all-2.0-SNAPSHOT-src.dir>
[INFO] Executed tasks
[INFO] [install:install {execution: default-install}]
[INFO] Installing <https://builds.apache.org/job/Tuscany-2x/ws/sca-2x/testing/itest/distribution/src-distro-unzip/target/itest-src-distro-unzip-2.0-SNAPSHOT.jar> to <https://builds.apache.org/job/Tuscany-2x/ws/.repository/org/apache/tuscany/sca/itest-src-distro-unzip/2.0-SNAPSHOT/itest-src-distro-unzip-2.0-SNAPSHOT.jar>
[JENKINS] Archiving disabled - not archiving <https://builds.apache.org/job/Tuscany-2x/ws/sca-2x/testing/itest/distribution/src-distro-unzip/pom.xml>
[JENKINS] Archiving disabled - not archiving <https://builds.apache.org/job/Tuscany-2x/ws/sca-2x/testing/itest/distribution/src-distro-unzip/target/itest-src-distro-unzip-2.0-SNAPSHOT.jar>
[INFO] ------------------------------------------------------------------------
[INFO] Building Apache Tuscany SCA iTest Distribution Src Distro RAT
[INFO] task-segment: [clean, install]
[INFO] ------------------------------------------------------------------------
Downloading: http://repo1.maven.org/maven2/org/apache/rat/apache-rat-plugin/0.6/apache-rat-plugin-0.6.pom
Downloading: http://repo1.maven.org/maven2/org/apache/rat/apache-rat-project/0.6/apache-rat-project-0.6.pom
Downloading: http://repo1.maven.org/maven2/org/apache/rat/apache-rat-plugin/0.6/apache-rat-plugin-0.6.jar
[INFO] [clean:clean {execution: default-clean}]
[INFO] [enforcer:enforce {execution: enforce-plugin-versions}]
[INFO] [remote-resources:process {execution: default}]
[INFO] [resources:resources {execution: default-resources}]
[INFO] Using 'UTF-8' encoding to copy filtered resources.
[INFO] skip non existing resourceDirectory <https://builds.apache.org/job/Tuscany-2x/ws/sca-2x/testing/itest/distribution/src-distro-rat/src/main/resources>
[INFO] Copying 0 resource
[INFO] Copying 3 resources
[INFO] [compiler:compile {execution: default-compile}]
[INFO] No sources to compile
[INFO] [resources:testResources {execution: default-testResources}]
[INFO] Using 'UTF-8' encoding to copy filtered resources.
[INFO] skip non existing resourceDirectory <https://builds.apache.org/job/Tuscany-2x/ws/sca-2x/testing/itest/distribution/src-distro-rat/src/test/resources>
[INFO] Copying 3 resources
[INFO] [compiler:testCompile {execution: default-testCompile}]
[INFO] No sources to compile
[INFO] [surefire:test {execution: default-test}]
[INFO] Surefire report directory: <https://builds.apache.org/job/Tuscany-2x/ws/sca-2x/testing/itest/distribution/src-distro-rat/target/surefire-reports>
-------------------------------------------------------
T E S T S
-------------------------------------------------------
There are no tests to run.
Results :
Tests run: 0, Failures: 0, Errors: 0, Skipped: 0
[JENKINS] Recording test results
[INFO] [jar:jar {execution: default-jar}]
[INFO] Building jar: <https://builds.apache.org/job/Tuscany-2x/ws/sca-2x/testing/itest/distribution/src-distro-rat/target/itest-distribution-src-dsitro-rat-2.0-SNAPSHOT.jar>
Downloading: http://repo1.maven.org/maven2/org/apache/rat/apache-rat-core/0.6/apache-rat-core-0.6.pom
Downloading: http://repo1.maven.org/maven2/org/apache/maven/shared/maven-plugin-testing-harness/1.0-beta-1/maven-plugin-testing-harness-1.0-beta-1.pom
Downloading: http://repo1.maven.org/maven2/org/apache/maven/shared/maven-shared-components/1/maven-shared-components-1.pom
Downloading: http://svn.apache.org/repos/asf/tuscany/maven/junit/junit/3.8.2/junit-3.8.2.jar
Downloading: http://repo1.maven.org/maven2/org/apache/rat/apache-rat-core/0.6/apache-rat-core-0.6.jar
Downloading: http://repo1.maven.org/maven2/org/codehaus/plexus/plexus-utils/1.4/plexus-utils-1.4.jar
Downloading: http://repo1.maven.org/maven2/org/apache/maven/shared/maven-plugin-testing-harness/1.0-beta-1/maven-plugin-testing-harness-1.0-beta-1.jar
Downloading: http://svn.apache.org/repos/asf/tuscany/maven/org/apache/maven/doxia/doxia-core/1.0-alpha-8/doxia-core-1.0-alpha-8.jar
[INFO] Unable to find resource 'junit:junit:jar:3.8.2' in repository tuscany.repo (http://svn.apache.org/repos/asf/tuscany/maven)
[INFO] Unable to find resource 'org.apache.maven.doxia:doxia-core:jar:1.0-alpha-8' in repository tuscany.repo (http://svn.apache.org/repos/asf/tuscany/maven)
Downloading: http://repo1.maven.org/maven2/junit/junit/3.8.2/junit-3.8.2.jar
Downloading: http://repo1.maven.org/maven2/org/apache/maven/doxia/doxia-core/1.0-alpha-8/doxia-core-1.0-alpha-8.jar
[INFO] [apache-rat:check {execution: default}]
[INFO] Exclude: tuscany-sca-2.0-SNAPSHOT-src/CHANGES
[INFO] Exclude: **/*.MF
[INFO] Exclude: tuscany-sca-2.0-SNAPSHOT-src/testing/itest/spi/spi-safe.txt
[INFO] Exclude: tuscany-sca-2.0-SNAPSHOT-src/testing/compliance-tests/binding-ws/sca_variables.dtd
[INFO] Exclude: tuscany-sca-2.0-SNAPSHOT-src/testing/itest/implementation-spring/src/main/resources/implementation/policies/CalculatorJass.config
[INFO] Exclude: tuscany-sca-2.0-SNAPSHOT-src/modules/binding-ws-runtime-axis2/src/main/resources/org/apache/tuscany/sca/binding/ws/axis2/engine/repository/modules/modules.list
[INFO] Exclude: tuscany-sca-2.0-SNAPSHOT-src/modules/binding-ws-runtime-axis2/src/main/resources/org/apache/tuscany/sca/binding/ws/axis2/engine/repository/services/services.list
[INFO] Exclude: tuscany-sca-2.0-SNAPSHOT-src/modules/implementation-spring-tie/src/main/resources/META-INF/spring.handlers
[INFO] Exclude: tuscany-sca-2.0-SNAPSHOT-src/modules/implementation-spring-tie/src/main/resources/META-INF/spring.schemas
[INFO] Exclude: tuscany-sca-2.0-SNAPSHOT-src/modules/implementation-spring-runtime/src/main/resources/META-INF/spring.handlers
[INFO] Exclude: tuscany-sca-2.0-SNAPSHOT-src/modules/implementation-spring-runtime/src/main/resources/META-INF/spring.schemas
[INFO] Exclude: tuscany-sca-2.0-SNAPSHOT-src/maven/archetypes/binding/src/test/resources/projects/basic/goal.txt
[INFO] Exclude: tuscany-sca-2.0-SNAPSHOT-src/maven/archetypes/implementation/src/test/resources/projects/basic/goal.txt
[INFO] Exclude: tuscany-sca-2.0-SNAPSHOT-src/modules/implementation-python-runtime/src/main/resources/django/__init__.py
[INFO] Exclude: tuscany-sca-2.0-SNAPSHOT-src/modules/implementation-python-runtime/src/main/resources/django/utils/__init__.py
[INFO] Exclude: tuscany-sca-2.0-SNAPSHOT-src/modules/assembly-xsd/**/*.*
[INFO] Exclude: tuscany-sca-2.0-SNAPSHOT-src/modules/sca-api/**/*.*
[INFO] Exclude: tuscany-sca-2.0-SNAPSHOT-src/modules/implementation-web-runtime/src/main/resources/META-INF/sca.tld
[INFO] Exclude: tuscany-sca-2.0-SNAPSHOT-src/modules/assembly-xml/src/main/resources/META-INF/sca-policy-1.1-intents-definitions-cd04.xml
[INFO] Exclude: tuscany-sca-2.0-SNAPSHOT-src/modules/sca-client-impl/src/main/java/org/apache/tuscany/sca/client/impl/SCAClientFactoryFinderImpl.java
[INFO] Exclude: tuscany-sca-2.0-SNAPSHOT-src/modules/binding-comet-runtime/src/main/resources/jquery.guid.js
[INFO] Exclude: tuscany-sca-2.0-SNAPSHOT-src/modules/binding-comet-runtime/src/main/resources/jquery.json-2.2.min.js
[INFO] Exclude: tuscany-sca-2.0-SNAPSHOT-src/modules/implementation-python-runtime/src/main/resources/django/utils/simplejson/*
[INFO] Exclude: tuscany-sca-2.0-SNAPSHOT-src/testing/compliance-tests/binding-jms/src/test/resources/tuscany-oasis-sca-tests-errors.properties
[JENKINS] Archiving disabled - not archiving <https://builds.apache.org/job/Tuscany-2x/ws/sca-2x/testing/itest/distribution/src-distro-rat/pom.xml>
[JENKINS] Archiving disabled - not archiving <https://builds.apache.org/job/Tuscany-2x/ws/sca-2x/testing/itest/distribution/src-distro-rat/target/itest-distribution-src-dsitro-rat-2.0-SNAPSHOT.jar>
[INFO] ------------------------------------------------------------------------
[ERROR] BUILD FAILURE
[INFO] ------------------------------------------------------------------------
[INFO] Too many unapproved licenses: 1
[INFO] ------------------------------------------------------------------------
[INFO] For more information, run Maven with the -e switch
[INFO] ------------------------------------------------------------------------
[INFO] Total time: 32 minutes 3 seconds
[INFO] Finished at: Tue Jan 24 14:08:19 UTC 2012
[INFO] Final Memory: 157M/720M
[INFO] ------------------------------------------------------------------------
channel stopped
2012-01-24 14:08:22.502:INFO::Shutdown hook executing
2012-01-24 14:08:22.502:INFO::Shutdown hook complete
Build failed in Jenkins: Tuscany-2x #510
Posted by Apache Jenkins Server <je...@builds.apache.org>.
See <https://builds.apache.org/job/Tuscany-2x/510/changes>
Changes:
[lresende] Refactoring policy archetype artifacts to properly generate provider folder
------------------------------------------
[...truncated 39876 lines...]
[INFO] Unable to find resource 'org.apache.maven:maven-monitor:pom:2.0' in repository java.net2 (http://download.java.net/maven/2)
Downloading: http://www.intalio.org/public/maven2/org/apache/maven/maven-monitor/2.0/maven-monitor-2.0.pom
400b downloaded (maven-monitor-2.0.pom)
Downloading: http://download.java.net/maven/2/org/apache/maven/wagon/wagon-ssh/1.0-alpha-5/wagon-ssh-1.0-alpha-5.pom
[INFO] Unable to find resource 'org.apache.maven.wagon:wagon-ssh:pom:1.0-alpha-5' in repository java.net2 (http://download.java.net/maven/2)
Downloading: http://www.intalio.org/public/maven2/org/apache/maven/wagon/wagon-ssh/1.0-alpha-5/wagon-ssh-1.0-alpha-5.pom
[INFO] Unable to find resource 'org.apache.maven.wagon:wagon-ssh:pom:1.0-alpha-5' in repository intalio.org (http://www.intalio.org/public/maven2)
Downloading: http://svn.apache.org/repos/asf/openejb/repo/org/apache/maven/wagon/wagon-ssh/1.0-alpha-5/wagon-ssh-1.0-alpha-5.pom
[INFO] Unable to find resource 'org.apache.maven.wagon:wagon-ssh:pom:1.0-alpha-5' in repository openejb-repository (http://svn.apache.org/repos/asf/openejb/repo)
Downloading: http://svn.apache.org/repos/asf/tuscany/maven/org/apache/maven/wagon/wagon-ssh/1.0-alpha-5/wagon-ssh-1.0-alpha-5.pom
[INFO] Unable to find resource 'org.apache.maven.wagon:wagon-ssh:pom:1.0-alpha-5' in repository tuscany.repo (http://svn.apache.org/repos/asf/tuscany/maven)
Downloading: http://repo1.maven.org/maven2/org/apache/maven/wagon/wagon-ssh/1.0-alpha-5/wagon-ssh-1.0-alpha-5.pom
Downloading: http://download.java.net/maven/2/com/jcraft/jsch/0.1.23/jsch-0.1.23.pom
[INFO] Unable to find resource 'com.jcraft:jsch:pom:0.1.23' in repository java.net2 (http://download.java.net/maven/2)
Downloading: http://www.intalio.org/public/maven2/com/jcraft/jsch/0.1.23/jsch-0.1.23.pom
[INFO] Unable to find resource 'com.jcraft:jsch:pom:0.1.23' in repository intalio.org (http://www.intalio.org/public/maven2)
Downloading: http://svn.apache.org/repos/asf/openejb/repo/com/jcraft/jsch/0.1.23/jsch-0.1.23.pom
[INFO] Unable to find resource 'com.jcraft:jsch:pom:0.1.23' in repository openejb-repository (http://svn.apache.org/repos/asf/openejb/repo)
Downloading: http://svn.apache.org/repos/asf/tuscany/maven/com/jcraft/jsch/0.1.23/jsch-0.1.23.pom
[INFO] Unable to find resource 'com.jcraft:jsch:pom:0.1.23' in repository tuscany.repo (http://svn.apache.org/repos/asf/tuscany/maven)
Downloading: http://repo1.maven.org/maven2/com/jcraft/jsch/0.1.23/jsch-0.1.23.pom
Downloading: http://repo1.maven.org/maven2/org/codehaus/plexus/plexus-interpolation/1.7/plexus-interpolation-1.7.pom
Downloading: http://repo1.maven.org/maven2/org/codehaus/plexus/plexus-archiver/1.0-alpha-12/plexus-archiver-1.0-alpha-12.pom
Downloading: http://download.java.net/maven/2/org/codehaus/plexus/plexus-io/1.0-alpha-4/plexus-io-1.0-alpha-4.pom
[INFO] Unable to find resource 'org.codehaus.plexus:plexus-io:pom:1.0-alpha-4' in repository java.net2 (http://download.java.net/maven/2)
Downloading: http://www.intalio.org/public/maven2/org/codehaus/plexus/plexus-io/1.0-alpha-4/plexus-io-1.0-alpha-4.pom
1K downloaded (plexus-io-1.0-alpha-4.pom)
Downloading: http://repo1.maven.org/maven2/org/codehaus/plexus/plexus-active-collections/1.0-beta-2/plexus-active-collections-1.0-beta-2.pom
Downloading: http://download.java.net/maven/2/org/codehaus/plexus/plexus-container-default/1.0-alpha-22/plexus-container-default-1.0-alpha-22.pom
[INFO] Unable to find resource 'org.codehaus.plexus:plexus-container-default:pom:1.0-alpha-22' in repository java.net2 (http://download.java.net/maven/2)
Downloading: http://www.intalio.org/public/maven2/org/codehaus/plexus/plexus-container-default/1.0-alpha-22/plexus-container-default-1.0-alpha-22.pom
[INFO] Unable to find resource 'org.codehaus.plexus:plexus-container-default:pom:1.0-alpha-22' in repository intalio.org (http://www.intalio.org/public/maven2)
Downloading: http://svn.apache.org/repos/asf/openejb/repo/org/codehaus/plexus/plexus-container-default/1.0-alpha-22/plexus-container-default-1.0-alpha-22.pom
[INFO] Unable to find resource 'org.codehaus.plexus:plexus-container-default:pom:1.0-alpha-22' in repository openejb-repository (http://svn.apache.org/repos/asf/openejb/repo)
Downloading: http://svn.apache.org/repos/asf/tuscany/maven/org/codehaus/plexus/plexus-container-default/1.0-alpha-22/plexus-container-default-1.0-alpha-22.pom
[INFO] Unable to find resource 'org.codehaus.plexus:plexus-container-default:pom:1.0-alpha-22' in repository tuscany.repo (http://svn.apache.org/repos/asf/tuscany/maven)
Downloading: http://repo1.maven.org/maven2/org/codehaus/plexus/plexus-container-default/1.0-alpha-22/plexus-container-default-1.0-alpha-22.pom
Downloading: http://download.java.net/maven/2/org/codehaus/plexus/plexus-containers/1.0-alpha-22/plexus-containers-1.0-alpha-22.pom
[INFO] Unable to find resource 'org.codehaus.plexus:plexus-containers:pom:1.0-alpha-22' in repository java.net2 (http://download.java.net/maven/2)
Downloading: http://www.intalio.org/public/maven2/org/codehaus/plexus/plexus-containers/1.0-alpha-22/plexus-containers-1.0-alpha-22.pom
[INFO] Unable to find resource 'org.codehaus.plexus:plexus-containers:pom:1.0-alpha-22' in repository intalio.org (http://www.intalio.org/public/maven2)
Downloading: http://svn.apache.org/repos/asf/openejb/repo/org/codehaus/plexus/plexus-containers/1.0-alpha-22/plexus-containers-1.0-alpha-22.pom
[INFO] Unable to find resource 'org.codehaus.plexus:plexus-containers:pom:1.0-alpha-22' in repository openejb-repository (http://svn.apache.org/repos/asf/openejb/repo)
Downloading: http://svn.apache.org/repos/asf/tuscany/maven/org/codehaus/plexus/plexus-containers/1.0-alpha-22/plexus-containers-1.0-alpha-22.pom
[INFO] Unable to find resource 'org.codehaus.plexus:plexus-containers:pom:1.0-alpha-22' in repository tuscany.repo (http://svn.apache.org/repos/asf/tuscany/maven)
Downloading: http://repo1.maven.org/maven2/org/codehaus/plexus/plexus-containers/1.0-alpha-22/plexus-containers-1.0-alpha-22.pom
Downloading: http://repo1.maven.org/maven2/org/codehaus/plexus/plexus-utils/2.0.1/plexus-utils-2.0.1.pom
Downloading: http://repo1.maven.org/maven2/org/codehaus/plexus/plexus-utils/2.0.1/plexus-utils-2.0.1.jar
Downloading: http://repo1.maven.org/maven2/org/apache/maven/shared/maven-common-artifact-filters/1.1/maven-common-artifact-filters-1.1.jar
Downloading: http://repo1.maven.org/maven2/org/codehaus/plexus/plexus-archiver/1.0-alpha-12/plexus-archiver-1.0-alpha-12.jar
Downloading: http://repo1.maven.org/maven2/org/codehaus/plexus/plexus-interpolation/1.7/plexus-interpolation-1.7.jar
Downloading: http://repo1.maven.org/maven2/org/codehaus/plexus/plexus-io/1.0-alpha-4/plexus-io-1.0-alpha-4.jar
Downloading: http://repo1.maven.org/maven2/org/codehaus/plexus/plexus-active-collections/1.0-beta-2/plexus-active-collections-1.0-beta-2.jar
[INFO] [assembly:single {execution: distribution-package}]
[INFO] Reading assembly descriptor: src/main/assembly/bin-distribution.xml
[INFO] Reading assembly descriptor: src/main/assembly/src.xml
[WARNING] Cannot include project artifact: org.apache.tuscany.sca:tuscany-distribution-all:pom:2.0-SNAPSHOT; it doesn't have an associated file or directory.
[WARNING] Cannot include project artifact: org.apache.tuscany.sca:tuscany-distribution-all:pom:2.0-SNAPSHOT; it doesn't have an associated file or directory.
[INFO] Building tar : <https://builds.apache.org/job/Tuscany-2x/ws/sca-2x/distribution/all/target/apache-tuscany-sca-all-2.0-SNAPSHOT.tar.gz>
[WARNING] Cannot include project artifact: org.apache.tuscany.sca:tuscany-distribution-all:pom:2.0-SNAPSHOT; it doesn't have an associated file or directory.
[WARNING] Cannot include project artifact: org.apache.tuscany.sca:tuscany-distribution-all:pom:2.0-SNAPSHOT; it doesn't have an associated file or directory.
[INFO] Building zip: <https://builds.apache.org/job/Tuscany-2x/ws/sca-2x/distribution/all/target/apache-tuscany-sca-all-2.0-SNAPSHOT.zip>
[INFO] Building tar : <https://builds.apache.org/job/Tuscany-2x/ws/sca-2x/distribution/all/target/apache-tuscany-sca-all-2.0-SNAPSHOT-src.tar.gz>
[INFO] Building zip: <https://builds.apache.org/job/Tuscany-2x/ws/sca-2x/distribution/all/target/apache-tuscany-sca-all-2.0-SNAPSHOT-src.zip>
[INFO] [install:install {execution: default-install}]
[INFO] Installing <https://builds.apache.org/job/Tuscany-2x/ws/sca-2x/distribution/all/pom.xml> to <https://builds.apache.org/job/Tuscany-2x/ws/.repository/org/apache/tuscany/sca/tuscany-distribution-all/2.0-SNAPSHOT/tuscany-distribution-all-2.0-SNAPSHOT.pom>
[INFO] Installing <https://builds.apache.org/job/Tuscany-2x/ws/sca-2x/distribution/all/target/apache-tuscany-sca-all-2.0-SNAPSHOT.tar.gz> to <https://builds.apache.org/job/Tuscany-2x/ws/.repository/org/apache/tuscany/sca/tuscany-distribution-all/2.0-SNAPSHOT/tuscany-distribution-all-2.0-SNAPSHOT.tar.gz>
[INFO] Installing <https://builds.apache.org/job/Tuscany-2x/ws/sca-2x/distribution/all/target/apache-tuscany-sca-all-2.0-SNAPSHOT.zip> to <https://builds.apache.org/job/Tuscany-2x/ws/.repository/org/apache/tuscany/sca/tuscany-distribution-all/2.0-SNAPSHOT/tuscany-distribution-all-2.0-SNAPSHOT.zip>
[INFO] Installing <https://builds.apache.org/job/Tuscany-2x/ws/sca-2x/distribution/all/target/apache-tuscany-sca-all-2.0-SNAPSHOT-src.tar.gz> to <https://builds.apache.org/job/Tuscany-2x/ws/.repository/org/apache/tuscany/sca/tuscany-distribution-all/2.0-SNAPSHOT/tuscany-distribution-all-2.0-SNAPSHOT-src.tar.gz>
[INFO] Installing <https://builds.apache.org/job/Tuscany-2x/ws/sca-2x/distribution/all/target/apache-tuscany-sca-all-2.0-SNAPSHOT-src.zip> to <https://builds.apache.org/job/Tuscany-2x/ws/.repository/org/apache/tuscany/sca/tuscany-distribution-all/2.0-SNAPSHOT/tuscany-distribution-all-2.0-SNAPSHOT-src.zip>
[JENKINS] Archiving disabled - not archiving <https://builds.apache.org/job/Tuscany-2x/ws/sca-2x/distribution/all/pom.xml>
[JENKINS] Archiving disabled - not archiving <https://builds.apache.org/job/Tuscany-2x/ws/.repository/org/apache/tuscany/sca/tuscany-distribution-all/2.0-SNAPSHOT/tuscany-distribution-all-2.0-SNAPSHOT.pom>
[JENKINS] Archiving disabled - not archiving <https://builds.apache.org/job/Tuscany-2x/ws/sca-2x/distribution/all/target/apache-tuscany-sca-all-2.0-SNAPSHOT.tar.gz>
[JENKINS] Archiving disabled - not archiving <https://builds.apache.org/job/Tuscany-2x/ws/sca-2x/distribution/all/target/apache-tuscany-sca-all-2.0-SNAPSHOT.zip>
[JENKINS] Archiving disabled - not archiving <https://builds.apache.org/job/Tuscany-2x/ws/sca-2x/distribution/all/target/apache-tuscany-sca-all-2.0-SNAPSHOT-src.tar.gz>
[JENKINS] Archiving disabled - not archiving <https://builds.apache.org/job/Tuscany-2x/ws/sca-2x/distribution/all/target/apache-tuscany-sca-all-2.0-SNAPSHOT-src.zip>
[INFO] ------------------------------------------------------------------------
[INFO] Building Apache Tuscany SCA iTest Distribution
[INFO] task-segment: [clean, install]
[INFO] ------------------------------------------------------------------------
[INFO] [clean:clean {execution: default-clean}]
[INFO] [enforcer:enforce {execution: enforce-plugin-versions}]
[INFO] [remote-resources:process {execution: default}]
[INFO] [site:attach-descriptor {execution: default-attach-descriptor}]
[INFO] [install:install {execution: default-install}]
[INFO] Installing <https://builds.apache.org/job/Tuscany-2x/ws/sca-2x/testing/itest/distribution/pom.xml> to <https://builds.apache.org/job/Tuscany-2x/ws/.repository/org/apache/tuscany/sca/itest-distribution/2.0-SNAPSHOT/itest-distribution-2.0-SNAPSHOT.pom>
[JENKINS] Archiving disabled - not archiving <https://builds.apache.org/job/Tuscany-2x/ws/sca-2x/testing/itest/distribution/pom.xml>
[JENKINS] Archiving disabled - not archiving <https://builds.apache.org/job/Tuscany-2x/ws/.repository/org/apache/tuscany/sca/itest-distribution/2.0-SNAPSHOT/itest-distribution-2.0-SNAPSHOT.pom>
[INFO] ------------------------------------------------------------------------
[INFO] Building Apache Tuscany SCA iTest Distribution Src Distro Unzip
[INFO] task-segment: [clean, install]
[INFO] ------------------------------------------------------------------------
[INFO] [clean:clean {execution: default-clean}]
[INFO] [enforcer:enforce {execution: enforce-plugin-versions}]
[INFO] [remote-resources:process {execution: default}]
[INFO] [resources:resources {execution: default-resources}]
[INFO] Using 'UTF-8' encoding to copy filtered resources.
[INFO] skip non existing resourceDirectory <https://builds.apache.org/job/Tuscany-2x/ws/sca-2x/testing/itest/distribution/src-distro-unzip/src/main/resources>
[INFO] Copying 0 resource
[INFO] Copying 3 resources
[INFO] [compiler:compile {execution: default-compile}]
[INFO] No sources to compile
[INFO] [resources:testResources {execution: default-testResources}]
[INFO] Using 'UTF-8' encoding to copy filtered resources.
[INFO] skip non existing resourceDirectory <https://builds.apache.org/job/Tuscany-2x/ws/sca-2x/testing/itest/distribution/src-distro-unzip/src/test/resources>
[INFO] Copying 3 resources
[INFO] [compiler:testCompile {execution: default-testCompile}]
[INFO] No sources to compile
[INFO] [surefire:test {execution: default-test}]
[INFO] Surefire report directory: <https://builds.apache.org/job/Tuscany-2x/ws/sca-2x/testing/itest/distribution/src-distro-unzip/target/surefire-reports>
-------------------------------------------------------
T E S T S
-------------------------------------------------------
There are no tests to run.
Results :
Tests run: 0, Failures: 0, Errors: 0, Skipped: 0
[JENKINS] Recording test results
[INFO] [jar:jar {execution: default-jar}]
[INFO] Building jar: <https://builds.apache.org/job/Tuscany-2x/ws/sca-2x/testing/itest/distribution/src-distro-unzip/target/itest-src-distro-unzip-2.0-SNAPSHOT.jar>
[INFO] [antrun:run {execution: run-samples}]
[INFO] Executing tasks
unzip:
[unzip] Expanding: <https://builds.apache.org/job/Tuscany-2x/ws/sca-2x/distribution/all/target/apache-tuscany-sca-all-2.0-SNAPSHOT-src.zip> into <https://builds.apache.org/job/Tuscany-2x/ws/sca-2x/distribution/all/target/apache-tuscany-sca-all-2.0-SNAPSHOT-src.dir>
[INFO] Executed tasks
[INFO] [install:install {execution: default-install}]
[INFO] Installing <https://builds.apache.org/job/Tuscany-2x/ws/sca-2x/testing/itest/distribution/src-distro-unzip/target/itest-src-distro-unzip-2.0-SNAPSHOT.jar> to <https://builds.apache.org/job/Tuscany-2x/ws/.repository/org/apache/tuscany/sca/itest-src-distro-unzip/2.0-SNAPSHOT/itest-src-distro-unzip-2.0-SNAPSHOT.jar>
[JENKINS] Archiving disabled - not archiving <https://builds.apache.org/job/Tuscany-2x/ws/sca-2x/testing/itest/distribution/src-distro-unzip/pom.xml>
[JENKINS] Archiving disabled - not archiving <https://builds.apache.org/job/Tuscany-2x/ws/sca-2x/testing/itest/distribution/src-distro-unzip/target/itest-src-distro-unzip-2.0-SNAPSHOT.jar>
[INFO] ------------------------------------------------------------------------
[INFO] Building Apache Tuscany SCA iTest Distribution Src Distro RAT
[INFO] task-segment: [clean, install]
[INFO] ------------------------------------------------------------------------
Downloading: http://repo1.maven.org/maven2/org/apache/rat/apache-rat-plugin/0.6/apache-rat-plugin-0.6.pom
Downloading: http://repo1.maven.org/maven2/org/apache/rat/apache-rat-project/0.6/apache-rat-project-0.6.pom
Downloading: http://repo1.maven.org/maven2/org/apache/rat/apache-rat-plugin/0.6/apache-rat-plugin-0.6.jar
[INFO] [clean:clean {execution: default-clean}]
[INFO] [enforcer:enforce {execution: enforce-plugin-versions}]
[INFO] [remote-resources:process {execution: default}]
[INFO] [resources:resources {execution: default-resources}]
[INFO] Using 'UTF-8' encoding to copy filtered resources.
[INFO] skip non existing resourceDirectory <https://builds.apache.org/job/Tuscany-2x/ws/sca-2x/testing/itest/distribution/src-distro-rat/src/main/resources>
[INFO] Copying 0 resource
[INFO] Copying 3 resources
[INFO] [compiler:compile {execution: default-compile}]
[INFO] No sources to compile
[INFO] [resources:testResources {execution: default-testResources}]
[INFO] Using 'UTF-8' encoding to copy filtered resources.
[INFO] skip non existing resourceDirectory <https://builds.apache.org/job/Tuscany-2x/ws/sca-2x/testing/itest/distribution/src-distro-rat/src/test/resources>
[INFO] Copying 3 resources
[INFO] [compiler:testCompile {execution: default-testCompile}]
[INFO] No sources to compile
[INFO] [surefire:test {execution: default-test}]
[INFO] Surefire report directory: <https://builds.apache.org/job/Tuscany-2x/ws/sca-2x/testing/itest/distribution/src-distro-rat/target/surefire-reports>
-------------------------------------------------------
T E S T S
-------------------------------------------------------
There are no tests to run.
Results :
Tests run: 0, Failures: 0, Errors: 0, Skipped: 0
[JENKINS] Recording test results
[INFO] [jar:jar {execution: default-jar}]
[INFO] Building jar: <https://builds.apache.org/job/Tuscany-2x/ws/sca-2x/testing/itest/distribution/src-distro-rat/target/itest-distribution-src-dsitro-rat-2.0-SNAPSHOT.jar>
Downloading: http://repo1.maven.org/maven2/org/apache/rat/apache-rat-core/0.6/apache-rat-core-0.6.pom
Downloading: http://repo1.maven.org/maven2/org/apache/maven/shared/maven-plugin-testing-harness/1.0-beta-1/maven-plugin-testing-harness-1.0-beta-1.pom
Downloading: http://repo1.maven.org/maven2/org/apache/maven/shared/maven-shared-components/1/maven-shared-components-1.pom
Downloading: http://repo1.maven.org/maven2/org/apache/rat/apache-rat-core/0.6/apache-rat-core-0.6.jar
Downloading: http://repo1.maven.org/maven2/org/apache/maven/shared/maven-plugin-testing-harness/1.0-beta-1/maven-plugin-testing-harness-1.0-beta-1.jar
Downloading: http://repo1.maven.org/maven2/org/codehaus/plexus/plexus-utils/1.4/plexus-utils-1.4.jar
Downloading: http://svn.apache.org/repos/asf/tuscany/maven/junit/junit/3.8.2/junit-3.8.2.jar
Downloading: http://svn.apache.org/repos/asf/tuscany/maven/org/apache/maven/doxia/doxia-core/1.0-alpha-8/doxia-core-1.0-alpha-8.jar
[INFO] Unable to find resource 'junit:junit:jar:3.8.2' in repository tuscany.repo (http://svn.apache.org/repos/asf/tuscany/maven)
Downloading: http://repo1.maven.org/maven2/junit/junit/3.8.2/junit-3.8.2.jar
[INFO] Unable to find resource 'org.apache.maven.doxia:doxia-core:jar:1.0-alpha-8' in repository tuscany.repo (http://svn.apache.org/repos/asf/tuscany/maven)
Downloading: http://repo1.maven.org/maven2/org/apache/maven/doxia/doxia-core/1.0-alpha-8/doxia-core-1.0-alpha-8.jar
[INFO] [apache-rat:check {execution: default}]
[INFO] Exclude: tuscany-sca-2.0-SNAPSHOT-src/CHANGES
[INFO] Exclude: **/*.MF
[INFO] Exclude: tuscany-sca-2.0-SNAPSHOT-src/testing/itest/spi/spi-safe.txt
[INFO] Exclude: tuscany-sca-2.0-SNAPSHOT-src/testing/compliance-tests/binding-ws/sca_variables.dtd
[INFO] Exclude: tuscany-sca-2.0-SNAPSHOT-src/testing/itest/implementation-spring/src/main/resources/implementation/policies/CalculatorJass.config
[INFO] Exclude: tuscany-sca-2.0-SNAPSHOT-src/modules/binding-ws-runtime-axis2/src/main/resources/org/apache/tuscany/sca/binding/ws/axis2/engine/repository/modules/modules.list
[INFO] Exclude: tuscany-sca-2.0-SNAPSHOT-src/modules/binding-ws-runtime-axis2/src/main/resources/org/apache/tuscany/sca/binding/ws/axis2/engine/repository/services/services.list
[INFO] Exclude: tuscany-sca-2.0-SNAPSHOT-src/modules/implementation-spring-tie/src/main/resources/META-INF/spring.handlers
[INFO] Exclude: tuscany-sca-2.0-SNAPSHOT-src/modules/implementation-spring-tie/src/main/resources/META-INF/spring.schemas
[INFO] Exclude: tuscany-sca-2.0-SNAPSHOT-src/modules/implementation-spring-runtime/src/main/resources/META-INF/spring.handlers
[INFO] Exclude: tuscany-sca-2.0-SNAPSHOT-src/modules/implementation-spring-runtime/src/main/resources/META-INF/spring.schemas
[INFO] Exclude: tuscany-sca-2.0-SNAPSHOT-src/maven/archetypes/binding/src/test/resources/projects/basic/goal.txt
[INFO] Exclude: tuscany-sca-2.0-SNAPSHOT-src/maven/archetypes/implementation/src/test/resources/projects/basic/goal.txt
[INFO] Exclude: tuscany-sca-2.0-SNAPSHOT-src/modules/implementation-python-runtime/src/main/resources/django/__init__.py
[INFO] Exclude: tuscany-sca-2.0-SNAPSHOT-src/modules/implementation-python-runtime/src/main/resources/django/utils/__init__.py
[INFO] Exclude: tuscany-sca-2.0-SNAPSHOT-src/modules/assembly-xsd/**/*.*
[INFO] Exclude: tuscany-sca-2.0-SNAPSHOT-src/modules/sca-api/**/*.*
[INFO] Exclude: tuscany-sca-2.0-SNAPSHOT-src/modules/implementation-web-runtime/src/main/resources/META-INF/sca.tld
[INFO] Exclude: tuscany-sca-2.0-SNAPSHOT-src/modules/assembly-xml/src/main/resources/META-INF/sca-policy-1.1-intents-definitions-cd04.xml
[INFO] Exclude: tuscany-sca-2.0-SNAPSHOT-src/modules/sca-client-impl/src/main/java/org/apache/tuscany/sca/client/impl/SCAClientFactoryFinderImpl.java
[INFO] Exclude: tuscany-sca-2.0-SNAPSHOT-src/modules/binding-comet-runtime/src/main/resources/jquery.guid.js
[INFO] Exclude: tuscany-sca-2.0-SNAPSHOT-src/modules/binding-comet-runtime/src/main/resources/jquery.json-2.2.min.js
[INFO] Exclude: tuscany-sca-2.0-SNAPSHOT-src/modules/implementation-python-runtime/src/main/resources/django/utils/simplejson/*
[INFO] Exclude: tuscany-sca-2.0-SNAPSHOT-src/testing/compliance-tests/binding-jms/src/test/resources/tuscany-oasis-sca-tests-errors.properties
[JENKINS] Archiving disabled - not archiving <https://builds.apache.org/job/Tuscany-2x/ws/sca-2x/testing/itest/distribution/src-distro-rat/pom.xml>
[JENKINS] Archiving disabled - not archiving <https://builds.apache.org/job/Tuscany-2x/ws/sca-2x/testing/itest/distribution/src-distro-rat/target/itest-distribution-src-dsitro-rat-2.0-SNAPSHOT.jar>
[INFO] ------------------------------------------------------------------------
[ERROR] BUILD FAILURE
[INFO] ------------------------------------------------------------------------
[INFO] Too many unapproved licenses: 7
[INFO] ------------------------------------------------------------------------
[INFO] For more information, run Maven with the -e switch
[INFO] ------------------------------------------------------------------------
[INFO] Total time: 31 minutes 26 seconds
[INFO] Finished at: Tue Jan 24 02:04:29 UTC 2012
[INFO] Final Memory: 157M/721M
[INFO] ------------------------------------------------------------------------
channel stopped
2012-01-24 02:04:35.391:INFO::Shutdown hook executing
2012-01-24 02:04:35.391:INFO::Shutdown hook complete
Build failed in Jenkins: Tuscany-2x #509
Posted by Apache Jenkins Server <je...@builds.apache.org>.
See <https://builds.apache.org/job/Tuscany-2x/509/>
------------------------------------------
[...truncated 39810 lines...]
Downloading: http://www.intalio.org/public/maven2/org/apache/maven/maven-monitor/2.0/maven-monitor-2.0.pom
400b downloaded (maven-monitor-2.0.pom)
Downloading: http://download.java.net/maven/2/org/apache/maven/wagon/wagon-ssh/1.0-alpha-5/wagon-ssh-1.0-alpha-5.pom
[INFO] Unable to find resource 'org.apache.maven.wagon:wagon-ssh:pom:1.0-alpha-5' in repository java.net2 (http://download.java.net/maven/2)
Downloading: http://www.intalio.org/public/maven2/org/apache/maven/wagon/wagon-ssh/1.0-alpha-5/wagon-ssh-1.0-alpha-5.pom
[INFO] Unable to find resource 'org.apache.maven.wagon:wagon-ssh:pom:1.0-alpha-5' in repository intalio.org (http://www.intalio.org/public/maven2)
Downloading: http://svn.apache.org/repos/asf/openejb/repo/org/apache/maven/wagon/wagon-ssh/1.0-alpha-5/wagon-ssh-1.0-alpha-5.pom
[INFO] Unable to find resource 'org.apache.maven.wagon:wagon-ssh:pom:1.0-alpha-5' in repository openejb-repository (http://svn.apache.org/repos/asf/openejb/repo)
Downloading: http://svn.apache.org/repos/asf/tuscany/maven/org/apache/maven/wagon/wagon-ssh/1.0-alpha-5/wagon-ssh-1.0-alpha-5.pom
[INFO] Unable to find resource 'org.apache.maven.wagon:wagon-ssh:pom:1.0-alpha-5' in repository tuscany.repo (http://svn.apache.org/repos/asf/tuscany/maven)
Downloading: http://repo1.maven.org/maven2/org/apache/maven/wagon/wagon-ssh/1.0-alpha-5/wagon-ssh-1.0-alpha-5.pom
Downloading: http://download.java.net/maven/2/com/jcraft/jsch/0.1.23/jsch-0.1.23.pom
[INFO] Unable to find resource 'com.jcraft:jsch:pom:0.1.23' in repository java.net2 (http://download.java.net/maven/2)
Downloading: http://www.intalio.org/public/maven2/com/jcraft/jsch/0.1.23/jsch-0.1.23.pom
[INFO] Unable to find resource 'com.jcraft:jsch:pom:0.1.23' in repository intalio.org (http://www.intalio.org/public/maven2)
Downloading: http://svn.apache.org/repos/asf/openejb/repo/com/jcraft/jsch/0.1.23/jsch-0.1.23.pom
[INFO] Unable to find resource 'com.jcraft:jsch:pom:0.1.23' in repository openejb-repository (http://svn.apache.org/repos/asf/openejb/repo)
Downloading: http://svn.apache.org/repos/asf/tuscany/maven/com/jcraft/jsch/0.1.23/jsch-0.1.23.pom
[INFO] Unable to find resource 'com.jcraft:jsch:pom:0.1.23' in repository tuscany.repo (http://svn.apache.org/repos/asf/tuscany/maven)
Downloading: http://repo1.maven.org/maven2/com/jcraft/jsch/0.1.23/jsch-0.1.23.pom
Downloading: http://repo1.maven.org/maven2/org/codehaus/plexus/plexus-interpolation/1.7/plexus-interpolation-1.7.pom
Downloading: http://repo1.maven.org/maven2/org/codehaus/plexus/plexus-archiver/1.0-alpha-12/plexus-archiver-1.0-alpha-12.pom
Downloading: http://download.java.net/maven/2/org/codehaus/plexus/plexus-io/1.0-alpha-4/plexus-io-1.0-alpha-4.pom
[INFO] Unable to find resource 'org.codehaus.plexus:plexus-io:pom:1.0-alpha-4' in repository java.net2 (http://download.java.net/maven/2)
Downloading: http://www.intalio.org/public/maven2/org/codehaus/plexus/plexus-io/1.0-alpha-4/plexus-io-1.0-alpha-4.pom
1K downloaded (plexus-io-1.0-alpha-4.pom)
Downloading: http://repo1.maven.org/maven2/org/codehaus/plexus/plexus-active-collections/1.0-beta-2/plexus-active-collections-1.0-beta-2.pom
Downloading: http://download.java.net/maven/2/org/codehaus/plexus/plexus-container-default/1.0-alpha-22/plexus-container-default-1.0-alpha-22.pom
[INFO] Unable to find resource 'org.codehaus.plexus:plexus-container-default:pom:1.0-alpha-22' in repository java.net2 (http://download.java.net/maven/2)
Downloading: http://www.intalio.org/public/maven2/org/codehaus/plexus/plexus-container-default/1.0-alpha-22/plexus-container-default-1.0-alpha-22.pom
[INFO] Unable to find resource 'org.codehaus.plexus:plexus-container-default:pom:1.0-alpha-22' in repository intalio.org (http://www.intalio.org/public/maven2)
Downloading: http://svn.apache.org/repos/asf/openejb/repo/org/codehaus/plexus/plexus-container-default/1.0-alpha-22/plexus-container-default-1.0-alpha-22.pom
[INFO] Unable to find resource 'org.codehaus.plexus:plexus-container-default:pom:1.0-alpha-22' in repository openejb-repository (http://svn.apache.org/repos/asf/openejb/repo)
Downloading: http://svn.apache.org/repos/asf/tuscany/maven/org/codehaus/plexus/plexus-container-default/1.0-alpha-22/plexus-container-default-1.0-alpha-22.pom
[INFO] Unable to find resource 'org.codehaus.plexus:plexus-container-default:pom:1.0-alpha-22' in repository tuscany.repo (http://svn.apache.org/repos/asf/tuscany/maven)
Downloading: http://repo1.maven.org/maven2/org/codehaus/plexus/plexus-container-default/1.0-alpha-22/plexus-container-default-1.0-alpha-22.pom
Downloading: http://download.java.net/maven/2/org/codehaus/plexus/plexus-containers/1.0-alpha-22/plexus-containers-1.0-alpha-22.pom
[INFO] Unable to find resource 'org.codehaus.plexus:plexus-containers:pom:1.0-alpha-22' in repository java.net2 (http://download.java.net/maven/2)
Downloading: http://www.intalio.org/public/maven2/org/codehaus/plexus/plexus-containers/1.0-alpha-22/plexus-containers-1.0-alpha-22.pom
[INFO] Unable to find resource 'org.codehaus.plexus:plexus-containers:pom:1.0-alpha-22' in repository intalio.org (http://www.intalio.org/public/maven2)
Downloading: http://svn.apache.org/repos/asf/openejb/repo/org/codehaus/plexus/plexus-containers/1.0-alpha-22/plexus-containers-1.0-alpha-22.pom
[INFO] Unable to find resource 'org.codehaus.plexus:plexus-containers:pom:1.0-alpha-22' in repository openejb-repository (http://svn.apache.org/repos/asf/openejb/repo)
Downloading: http://svn.apache.org/repos/asf/tuscany/maven/org/codehaus/plexus/plexus-containers/1.0-alpha-22/plexus-containers-1.0-alpha-22.pom
[INFO] Unable to find resource 'org.codehaus.plexus:plexus-containers:pom:1.0-alpha-22' in repository tuscany.repo (http://svn.apache.org/repos/asf/tuscany/maven)
Downloading: http://repo1.maven.org/maven2/org/codehaus/plexus/plexus-containers/1.0-alpha-22/plexus-containers-1.0-alpha-22.pom
Downloading: http://repo1.maven.org/maven2/org/codehaus/plexus/plexus-utils/2.0.1/plexus-utils-2.0.1.pom
Downloading: http://repo1.maven.org/maven2/org/codehaus/plexus/plexus-utils/2.0.1/plexus-utils-2.0.1.jar
Downloading: http://repo1.maven.org/maven2/org/apache/maven/shared/maven-common-artifact-filters/1.1/maven-common-artifact-filters-1.1.jar
Downloading: http://repo1.maven.org/maven2/org/codehaus/plexus/plexus-archiver/1.0-alpha-12/plexus-archiver-1.0-alpha-12.jar
Downloading: http://repo1.maven.org/maven2/org/codehaus/plexus/plexus-interpolation/1.7/plexus-interpolation-1.7.jar
Downloading: http://repo1.maven.org/maven2/org/codehaus/plexus/plexus-io/1.0-alpha-4/plexus-io-1.0-alpha-4.jar
Downloading: http://repo1.maven.org/maven2/org/codehaus/plexus/plexus-active-collections/1.0-beta-2/plexus-active-collections-1.0-beta-2.jar
[INFO] [assembly:single {execution: distribution-package}]
[INFO] Reading assembly descriptor: src/main/assembly/bin-distribution.xml
[INFO] Reading assembly descriptor: src/main/assembly/src.xml
[WARNING] Cannot include project artifact: org.apache.tuscany.sca:tuscany-distribution-all:pom:2.0-SNAPSHOT; it doesn't have an associated file or directory.
[WARNING] Cannot include project artifact: org.apache.tuscany.sca:tuscany-distribution-all:pom:2.0-SNAPSHOT; it doesn't have an associated file or directory.
[INFO] Building tar : <https://builds.apache.org/job/Tuscany-2x/ws/sca-2x/distribution/all/target/apache-tuscany-sca-all-2.0-SNAPSHOT.tar.gz>
[WARNING] Cannot include project artifact: org.apache.tuscany.sca:tuscany-distribution-all:pom:2.0-SNAPSHOT; it doesn't have an associated file or directory.
[WARNING] Cannot include project artifact: org.apache.tuscany.sca:tuscany-distribution-all:pom:2.0-SNAPSHOT; it doesn't have an associated file or directory.
[INFO] Building zip: <https://builds.apache.org/job/Tuscany-2x/ws/sca-2x/distribution/all/target/apache-tuscany-sca-all-2.0-SNAPSHOT.zip>
[INFO] Building tar : <https://builds.apache.org/job/Tuscany-2x/ws/sca-2x/distribution/all/target/apache-tuscany-sca-all-2.0-SNAPSHOT-src.tar.gz>
[INFO] Building zip: <https://builds.apache.org/job/Tuscany-2x/ws/sca-2x/distribution/all/target/apache-tuscany-sca-all-2.0-SNAPSHOT-src.zip>
[INFO] [install:install {execution: default-install}]
[INFO] Installing <https://builds.apache.org/job/Tuscany-2x/ws/sca-2x/distribution/all/pom.xml> to <https://builds.apache.org/job/Tuscany-2x/ws/.repository/org/apache/tuscany/sca/tuscany-distribution-all/2.0-SNAPSHOT/tuscany-distribution-all-2.0-SNAPSHOT.pom>
[INFO] Installing <https://builds.apache.org/job/Tuscany-2x/ws/sca-2x/distribution/all/target/apache-tuscany-sca-all-2.0-SNAPSHOT.tar.gz> to <https://builds.apache.org/job/Tuscany-2x/ws/.repository/org/apache/tuscany/sca/tuscany-distribution-all/2.0-SNAPSHOT/tuscany-distribution-all-2.0-SNAPSHOT.tar.gz>
[INFO] Installing <https://builds.apache.org/job/Tuscany-2x/ws/sca-2x/distribution/all/target/apache-tuscany-sca-all-2.0-SNAPSHOT.zip> to <https://builds.apache.org/job/Tuscany-2x/ws/.repository/org/apache/tuscany/sca/tuscany-distribution-all/2.0-SNAPSHOT/tuscany-distribution-all-2.0-SNAPSHOT.zip>
[INFO] Installing <https://builds.apache.org/job/Tuscany-2x/ws/sca-2x/distribution/all/target/apache-tuscany-sca-all-2.0-SNAPSHOT-src.tar.gz> to <https://builds.apache.org/job/Tuscany-2x/ws/.repository/org/apache/tuscany/sca/tuscany-distribution-all/2.0-SNAPSHOT/tuscany-distribution-all-2.0-SNAPSHOT-src.tar.gz>
[INFO] Installing <https://builds.apache.org/job/Tuscany-2x/ws/sca-2x/distribution/all/target/apache-tuscany-sca-all-2.0-SNAPSHOT-src.zip> to <https://builds.apache.org/job/Tuscany-2x/ws/.repository/org/apache/tuscany/sca/tuscany-distribution-all/2.0-SNAPSHOT/tuscany-distribution-all-2.0-SNAPSHOT-src.zip>
[JENKINS] Archiving disabled - not archiving <https://builds.apache.org/job/Tuscany-2x/ws/sca-2x/distribution/all/pom.xml>
[JENKINS] Archiving disabled - not archiving <https://builds.apache.org/job/Tuscany-2x/ws/.repository/org/apache/tuscany/sca/tuscany-distribution-all/2.0-SNAPSHOT/tuscany-distribution-all-2.0-SNAPSHOT.pom>
[JENKINS] Archiving disabled - not archiving <https://builds.apache.org/job/Tuscany-2x/ws/sca-2x/distribution/all/target/apache-tuscany-sca-all-2.0-SNAPSHOT.tar.gz>
[JENKINS] Archiving disabled - not archiving <https://builds.apache.org/job/Tuscany-2x/ws/sca-2x/distribution/all/target/apache-tuscany-sca-all-2.0-SNAPSHOT.zip>
[JENKINS] Archiving disabled - not archiving <https://builds.apache.org/job/Tuscany-2x/ws/sca-2x/distribution/all/target/apache-tuscany-sca-all-2.0-SNAPSHOT-src.tar.gz>
[JENKINS] Archiving disabled - not archiving <https://builds.apache.org/job/Tuscany-2x/ws/sca-2x/distribution/all/target/apache-tuscany-sca-all-2.0-SNAPSHOT-src.zip>
[INFO] ------------------------------------------------------------------------
[INFO] Building Apache Tuscany SCA iTest Distribution
[INFO] task-segment: [clean, install]
[INFO] ------------------------------------------------------------------------
[INFO] [clean:clean {execution: default-clean}]
[INFO] [enforcer:enforce {execution: enforce-plugin-versions}]
[INFO] [remote-resources:process {execution: default}]
[INFO] [site:attach-descriptor {execution: default-attach-descriptor}]
[INFO] [install:install {execution: default-install}]
[INFO] Installing <https://builds.apache.org/job/Tuscany-2x/ws/sca-2x/testing/itest/distribution/pom.xml> to <https://builds.apache.org/job/Tuscany-2x/ws/.repository/org/apache/tuscany/sca/itest-distribution/2.0-SNAPSHOT/itest-distribution-2.0-SNAPSHOT.pom>
[JENKINS] Archiving disabled - not archiving <https://builds.apache.org/job/Tuscany-2x/ws/sca-2x/testing/itest/distribution/pom.xml>
[JENKINS] Archiving disabled - not archiving <https://builds.apache.org/job/Tuscany-2x/ws/.repository/org/apache/tuscany/sca/itest-distribution/2.0-SNAPSHOT/itest-distribution-2.0-SNAPSHOT.pom>
[INFO] ------------------------------------------------------------------------
[INFO] Building Apache Tuscany SCA iTest Distribution Src Distro Unzip
[INFO] task-segment: [clean, install]
[INFO] ------------------------------------------------------------------------
[INFO] [clean:clean {execution: default-clean}]
[INFO] [enforcer:enforce {execution: enforce-plugin-versions}]
[INFO] [remote-resources:process {execution: default}]
[INFO] [resources:resources {execution: default-resources}]
[INFO] Using 'UTF-8' encoding to copy filtered resources.
[INFO] skip non existing resourceDirectory <https://builds.apache.org/job/Tuscany-2x/ws/sca-2x/testing/itest/distribution/src-distro-unzip/src/main/resources>
[INFO] Copying 0 resource
[INFO] Copying 3 resources
[INFO] [compiler:compile {execution: default-compile}]
[INFO] No sources to compile
[INFO] [resources:testResources {execution: default-testResources}]
[INFO] Using 'UTF-8' encoding to copy filtered resources.
[INFO] skip non existing resourceDirectory <https://builds.apache.org/job/Tuscany-2x/ws/sca-2x/testing/itest/distribution/src-distro-unzip/src/test/resources>
[INFO] Copying 3 resources
[INFO] [compiler:testCompile {execution: default-testCompile}]
[INFO] No sources to compile
[INFO] [surefire:test {execution: default-test}]
[INFO] Surefire report directory: <https://builds.apache.org/job/Tuscany-2x/ws/sca-2x/testing/itest/distribution/src-distro-unzip/target/surefire-reports>
-------------------------------------------------------
T E S T S
-------------------------------------------------------
There are no tests to run.
Results :
Tests run: 0, Failures: 0, Errors: 0, Skipped: 0
[JENKINS] Recording test results
[INFO] [jar:jar {execution: default-jar}]
[INFO] Building jar: <https://builds.apache.org/job/Tuscany-2x/ws/sca-2x/testing/itest/distribution/src-distro-unzip/target/itest-src-distro-unzip-2.0-SNAPSHOT.jar>
[INFO] [antrun:run {execution: run-samples}]
[INFO] Executing tasks
unzip:
[unzip] Expanding: <https://builds.apache.org/job/Tuscany-2x/ws/sca-2x/distribution/all/target/apache-tuscany-sca-all-2.0-SNAPSHOT-src.zip> into <https://builds.apache.org/job/Tuscany-2x/ws/sca-2x/distribution/all/target/apache-tuscany-sca-all-2.0-SNAPSHOT-src.dir>
[INFO] Executed tasks
[INFO] [install:install {execution: default-install}]
[INFO] Installing <https://builds.apache.org/job/Tuscany-2x/ws/sca-2x/testing/itest/distribution/src-distro-unzip/target/itest-src-distro-unzip-2.0-SNAPSHOT.jar> to <https://builds.apache.org/job/Tuscany-2x/ws/.repository/org/apache/tuscany/sca/itest-src-distro-unzip/2.0-SNAPSHOT/itest-src-distro-unzip-2.0-SNAPSHOT.jar>
[JENKINS] Archiving disabled - not archiving <https://builds.apache.org/job/Tuscany-2x/ws/sca-2x/testing/itest/distribution/src-distro-unzip/pom.xml>
[JENKINS] Archiving disabled - not archiving <https://builds.apache.org/job/Tuscany-2x/ws/sca-2x/testing/itest/distribution/src-distro-unzip/target/itest-src-distro-unzip-2.0-SNAPSHOT.jar>
[INFO] ------------------------------------------------------------------------
[INFO] Building Apache Tuscany SCA iTest Distribution Src Distro RAT
[INFO] task-segment: [clean, install]
[INFO] ------------------------------------------------------------------------
Downloading: http://repo1.maven.org/maven2/org/apache/rat/apache-rat-plugin/0.6/apache-rat-plugin-0.6.pom
Downloading: http://repo1.maven.org/maven2/org/apache/rat/apache-rat-project/0.6/apache-rat-project-0.6.pom
Downloading: http://repo1.maven.org/maven2/org/apache/rat/apache-rat-plugin/0.6/apache-rat-plugin-0.6.jar
[INFO] [clean:clean {execution: default-clean}]
[INFO] [enforcer:enforce {execution: enforce-plugin-versions}]
[INFO] [remote-resources:process {execution: default}]
[INFO] [resources:resources {execution: default-resources}]
[INFO] Using 'UTF-8' encoding to copy filtered resources.
[INFO] skip non existing resourceDirectory <https://builds.apache.org/job/Tuscany-2x/ws/sca-2x/testing/itest/distribution/src-distro-rat/src/main/resources>
[INFO] Copying 0 resource
[INFO] Copying 3 resources
[INFO] [compiler:compile {execution: default-compile}]
[INFO] No sources to compile
[INFO] [resources:testResources {execution: default-testResources}]
[INFO] Using 'UTF-8' encoding to copy filtered resources.
[INFO] skip non existing resourceDirectory <https://builds.apache.org/job/Tuscany-2x/ws/sca-2x/testing/itest/distribution/src-distro-rat/src/test/resources>
[INFO] Copying 3 resources
[INFO] [compiler:testCompile {execution: default-testCompile}]
[INFO] No sources to compile
[INFO] [surefire:test {execution: default-test}]
[INFO] Surefire report directory: <https://builds.apache.org/job/Tuscany-2x/ws/sca-2x/testing/itest/distribution/src-distro-rat/target/surefire-reports>
-------------------------------------------------------
T E S T S
-------------------------------------------------------
There are no tests to run.
Results :
Tests run: 0, Failures: 0, Errors: 0, Skipped: 0
[JENKINS] Recording test results
[INFO] [jar:jar {execution: default-jar}]
[INFO] Building jar: <https://builds.apache.org/job/Tuscany-2x/ws/sca-2x/testing/itest/distribution/src-distro-rat/target/itest-distribution-src-dsitro-rat-2.0-SNAPSHOT.jar>
Downloading: http://repo1.maven.org/maven2/org/apache/rat/apache-rat-core/0.6/apache-rat-core-0.6.pom
Downloading: http://repo1.maven.org/maven2/org/apache/maven/shared/maven-plugin-testing-harness/1.0-beta-1/maven-plugin-testing-harness-1.0-beta-1.pom
Downloading: http://repo1.maven.org/maven2/org/apache/maven/shared/maven-shared-components/1/maven-shared-components-1.pom
Downloading: http://repo1.maven.org/maven2/org/codehaus/plexus/plexus-utils/1.4/plexus-utils-1.4.jar
Downloading: http://repo1.maven.org/maven2/org/apache/maven/shared/maven-plugin-testing-harness/1.0-beta-1/maven-plugin-testing-harness-1.0-beta-1.jar
Downloading: http://svn.apache.org/repos/asf/tuscany/maven/junit/junit/3.8.2/junit-3.8.2.jar
Downloading: http://svn.apache.org/repos/asf/tuscany/maven/org/apache/maven/doxia/doxia-core/1.0-alpha-8/doxia-core-1.0-alpha-8.jar
Downloading: http://repo1.maven.org/maven2/org/apache/rat/apache-rat-core/0.6/apache-rat-core-0.6.jar
[INFO] Unable to find resource 'junit:junit:jar:3.8.2' in repository tuscany.repo (http://svn.apache.org/repos/asf/tuscany/maven)
Downloading: http://repo1.maven.org/maven2/junit/junit/3.8.2/junit-3.8.2.jar
[INFO] Unable to find resource 'org.apache.maven.doxia:doxia-core:jar:1.0-alpha-8' in repository tuscany.repo (http://svn.apache.org/repos/asf/tuscany/maven)
Downloading: http://repo1.maven.org/maven2/org/apache/maven/doxia/doxia-core/1.0-alpha-8/doxia-core-1.0-alpha-8.jar
[INFO] [apache-rat:check {execution: default}]
[INFO] Exclude: tuscany-sca-2.0-SNAPSHOT-src/CHANGES
[INFO] Exclude: **/*.MF
[INFO] Exclude: tuscany-sca-2.0-SNAPSHOT-src/testing/itest/spi/spi-safe.txt
[INFO] Exclude: tuscany-sca-2.0-SNAPSHOT-src/testing/compliance-tests/binding-ws/sca_variables.dtd
[INFO] Exclude: tuscany-sca-2.0-SNAPSHOT-src/testing/itest/implementation-spring/src/main/resources/implementation/policies/CalculatorJass.config
[INFO] Exclude: tuscany-sca-2.0-SNAPSHOT-src/modules/binding-ws-runtime-axis2/src/main/resources/org/apache/tuscany/sca/binding/ws/axis2/engine/repository/modules/modules.list
[INFO] Exclude: tuscany-sca-2.0-SNAPSHOT-src/modules/binding-ws-runtime-axis2/src/main/resources/org/apache/tuscany/sca/binding/ws/axis2/engine/repository/services/services.list
[INFO] Exclude: tuscany-sca-2.0-SNAPSHOT-src/modules/implementation-spring-tie/src/main/resources/META-INF/spring.handlers
[INFO] Exclude: tuscany-sca-2.0-SNAPSHOT-src/modules/implementation-spring-tie/src/main/resources/META-INF/spring.schemas
[INFO] Exclude: tuscany-sca-2.0-SNAPSHOT-src/modules/implementation-spring-runtime/src/main/resources/META-INF/spring.handlers
[INFO] Exclude: tuscany-sca-2.0-SNAPSHOT-src/modules/implementation-spring-runtime/src/main/resources/META-INF/spring.schemas
[INFO] Exclude: tuscany-sca-2.0-SNAPSHOT-src/maven/archetypes/binding/src/test/resources/projects/basic/goal.txt
[INFO] Exclude: tuscany-sca-2.0-SNAPSHOT-src/maven/archetypes/implementation/src/test/resources/projects/basic/goal.txt
[INFO] Exclude: tuscany-sca-2.0-SNAPSHOT-src/modules/implementation-python-runtime/src/main/resources/django/__init__.py
[INFO] Exclude: tuscany-sca-2.0-SNAPSHOT-src/modules/implementation-python-runtime/src/main/resources/django/utils/__init__.py
[INFO] Exclude: tuscany-sca-2.0-SNAPSHOT-src/modules/assembly-xsd/**/*.*
[INFO] Exclude: tuscany-sca-2.0-SNAPSHOT-src/modules/sca-api/**/*.*
[INFO] Exclude: tuscany-sca-2.0-SNAPSHOT-src/modules/implementation-web-runtime/src/main/resources/META-INF/sca.tld
[INFO] Exclude: tuscany-sca-2.0-SNAPSHOT-src/modules/assembly-xml/src/main/resources/META-INF/sca-policy-1.1-intents-definitions-cd04.xml
[INFO] Exclude: tuscany-sca-2.0-SNAPSHOT-src/modules/sca-client-impl/src/main/java/org/apache/tuscany/sca/client/impl/SCAClientFactoryFinderImpl.java
[INFO] Exclude: tuscany-sca-2.0-SNAPSHOT-src/modules/binding-comet-runtime/src/main/resources/jquery.guid.js
[INFO] Exclude: tuscany-sca-2.0-SNAPSHOT-src/modules/binding-comet-runtime/src/main/resources/jquery.json-2.2.min.js
[INFO] Exclude: tuscany-sca-2.0-SNAPSHOT-src/modules/implementation-python-runtime/src/main/resources/django/utils/simplejson/*
[INFO] Exclude: tuscany-sca-2.0-SNAPSHOT-src/testing/compliance-tests/binding-jms/src/test/resources/tuscany-oasis-sca-tests-errors.properties
[JENKINS] Archiving disabled - not archiving <https://builds.apache.org/job/Tuscany-2x/ws/sca-2x/testing/itest/distribution/src-distro-rat/pom.xml>
[JENKINS] Archiving disabled - not archiving <https://builds.apache.org/job/Tuscany-2x/ws/sca-2x/testing/itest/distribution/src-distro-rat/target/itest-distribution-src-dsitro-rat-2.0-SNAPSHOT.jar>
[INFO] ------------------------------------------------------------------------
[ERROR] BUILD FAILURE
[INFO] ------------------------------------------------------------------------
[INFO] Too many unapproved licenses: 7
[INFO] ------------------------------------------------------------------------
[INFO] For more information, run Maven with the -e switch
[INFO] ------------------------------------------------------------------------
[INFO] Total time: 38 minutes 11 seconds
[INFO] Finished at: Mon Jan 23 01:13:16 UTC 2012
[INFO] Final Memory: 160M/723M
[INFO] ------------------------------------------------------------------------
Waiting for Jenkins to finish collecting data
channel stopped
2012-01-23 01:13:22.256:INFO::Shutdown hook executing
2012-01-23 01:13:22.256:INFO::Shutdown hook complete
Build failed in Jenkins: Tuscany-2x #508
Posted by Apache Jenkins Server <je...@builds.apache.org>.
See <https://builds.apache.org/job/Tuscany-2x/508/>
------------------------------------------
[...truncated 39893 lines...]
Downloading: http://www.intalio.org/public/maven2/org/apache/maven/maven-monitor/2.0/maven-monitor-2.0.pom
400b downloaded (maven-monitor-2.0.pom)
Downloading: http://download.java.net/maven/2/org/apache/maven/wagon/wagon-ssh/1.0-alpha-5/wagon-ssh-1.0-alpha-5.pom
[INFO] Unable to find resource 'org.apache.maven.wagon:wagon-ssh:pom:1.0-alpha-5' in repository java.net2 (http://download.java.net/maven/2)
Downloading: http://www.intalio.org/public/maven2/org/apache/maven/wagon/wagon-ssh/1.0-alpha-5/wagon-ssh-1.0-alpha-5.pom
[INFO] Unable to find resource 'org.apache.maven.wagon:wagon-ssh:pom:1.0-alpha-5' in repository intalio.org (http://www.intalio.org/public/maven2)
Downloading: http://svn.apache.org/repos/asf/openejb/repo/org/apache/maven/wagon/wagon-ssh/1.0-alpha-5/wagon-ssh-1.0-alpha-5.pom
[INFO] Unable to find resource 'org.apache.maven.wagon:wagon-ssh:pom:1.0-alpha-5' in repository openejb-repository (http://svn.apache.org/repos/asf/openejb/repo)
Downloading: http://svn.apache.org/repos/asf/tuscany/maven/org/apache/maven/wagon/wagon-ssh/1.0-alpha-5/wagon-ssh-1.0-alpha-5.pom
[INFO] Unable to find resource 'org.apache.maven.wagon:wagon-ssh:pom:1.0-alpha-5' in repository tuscany.repo (http://svn.apache.org/repos/asf/tuscany/maven)
Downloading: http://repo1.maven.org/maven2/org/apache/maven/wagon/wagon-ssh/1.0-alpha-5/wagon-ssh-1.0-alpha-5.pom
Downloading: http://download.java.net/maven/2/com/jcraft/jsch/0.1.23/jsch-0.1.23.pom
[INFO] Unable to find resource 'com.jcraft:jsch:pom:0.1.23' in repository java.net2 (http://download.java.net/maven/2)
Downloading: http://www.intalio.org/public/maven2/com/jcraft/jsch/0.1.23/jsch-0.1.23.pom
[INFO] Unable to find resource 'com.jcraft:jsch:pom:0.1.23' in repository intalio.org (http://www.intalio.org/public/maven2)
Downloading: http://svn.apache.org/repos/asf/openejb/repo/com/jcraft/jsch/0.1.23/jsch-0.1.23.pom
[INFO] Unable to find resource 'com.jcraft:jsch:pom:0.1.23' in repository openejb-repository (http://svn.apache.org/repos/asf/openejb/repo)
Downloading: http://svn.apache.org/repos/asf/tuscany/maven/com/jcraft/jsch/0.1.23/jsch-0.1.23.pom
[INFO] Unable to find resource 'com.jcraft:jsch:pom:0.1.23' in repository tuscany.repo (http://svn.apache.org/repos/asf/tuscany/maven)
Downloading: http://repo1.maven.org/maven2/com/jcraft/jsch/0.1.23/jsch-0.1.23.pom
Downloading: http://repo1.maven.org/maven2/org/codehaus/plexus/plexus-interpolation/1.7/plexus-interpolation-1.7.pom
Downloading: http://repo1.maven.org/maven2/org/codehaus/plexus/plexus-archiver/1.0-alpha-12/plexus-archiver-1.0-alpha-12.pom
Downloading: http://download.java.net/maven/2/org/codehaus/plexus/plexus-io/1.0-alpha-4/plexus-io-1.0-alpha-4.pom
[INFO] Unable to find resource 'org.codehaus.plexus:plexus-io:pom:1.0-alpha-4' in repository java.net2 (http://download.java.net/maven/2)
Downloading: http://www.intalio.org/public/maven2/org/codehaus/plexus/plexus-io/1.0-alpha-4/plexus-io-1.0-alpha-4.pom
1K downloaded (plexus-io-1.0-alpha-4.pom)
Downloading: http://repo1.maven.org/maven2/org/codehaus/plexus/plexus-active-collections/1.0-beta-2/plexus-active-collections-1.0-beta-2.pom
Downloading: http://download.java.net/maven/2/org/codehaus/plexus/plexus-container-default/1.0-alpha-22/plexus-container-default-1.0-alpha-22.pom
[INFO] Unable to find resource 'org.codehaus.plexus:plexus-container-default:pom:1.0-alpha-22' in repository java.net2 (http://download.java.net/maven/2)
Downloading: http://www.intalio.org/public/maven2/org/codehaus/plexus/plexus-container-default/1.0-alpha-22/plexus-container-default-1.0-alpha-22.pom
[INFO] Unable to find resource 'org.codehaus.plexus:plexus-container-default:pom:1.0-alpha-22' in repository intalio.org (http://www.intalio.org/public/maven2)
Downloading: http://svn.apache.org/repos/asf/openejb/repo/org/codehaus/plexus/plexus-container-default/1.0-alpha-22/plexus-container-default-1.0-alpha-22.pom
[INFO] Unable to find resource 'org.codehaus.plexus:plexus-container-default:pom:1.0-alpha-22' in repository openejb-repository (http://svn.apache.org/repos/asf/openejb/repo)
Downloading: http://svn.apache.org/repos/asf/tuscany/maven/org/codehaus/plexus/plexus-container-default/1.0-alpha-22/plexus-container-default-1.0-alpha-22.pom
[INFO] Unable to find resource 'org.codehaus.plexus:plexus-container-default:pom:1.0-alpha-22' in repository tuscany.repo (http://svn.apache.org/repos/asf/tuscany/maven)
Downloading: http://repo1.maven.org/maven2/org/codehaus/plexus/plexus-container-default/1.0-alpha-22/plexus-container-default-1.0-alpha-22.pom
Downloading: http://download.java.net/maven/2/org/codehaus/plexus/plexus-containers/1.0-alpha-22/plexus-containers-1.0-alpha-22.pom
[INFO] Unable to find resource 'org.codehaus.plexus:plexus-containers:pom:1.0-alpha-22' in repository java.net2 (http://download.java.net/maven/2)
Downloading: http://www.intalio.org/public/maven2/org/codehaus/plexus/plexus-containers/1.0-alpha-22/plexus-containers-1.0-alpha-22.pom
[INFO] Unable to find resource 'org.codehaus.plexus:plexus-containers:pom:1.0-alpha-22' in repository intalio.org (http://www.intalio.org/public/maven2)
Downloading: http://svn.apache.org/repos/asf/openejb/repo/org/codehaus/plexus/plexus-containers/1.0-alpha-22/plexus-containers-1.0-alpha-22.pom
[INFO] Unable to find resource 'org.codehaus.plexus:plexus-containers:pom:1.0-alpha-22' in repository openejb-repository (http://svn.apache.org/repos/asf/openejb/repo)
Downloading: http://svn.apache.org/repos/asf/tuscany/maven/org/codehaus/plexus/plexus-containers/1.0-alpha-22/plexus-containers-1.0-alpha-22.pom
[INFO] Unable to find resource 'org.codehaus.plexus:plexus-containers:pom:1.0-alpha-22' in repository tuscany.repo (http://svn.apache.org/repos/asf/tuscany/maven)
Downloading: http://repo1.maven.org/maven2/org/codehaus/plexus/plexus-containers/1.0-alpha-22/plexus-containers-1.0-alpha-22.pom
Downloading: http://repo1.maven.org/maven2/org/codehaus/plexus/plexus-utils/2.0.1/plexus-utils-2.0.1.pom
Downloading: http://repo1.maven.org/maven2/org/apache/maven/shared/maven-common-artifact-filters/1.1/maven-common-artifact-filters-1.1.jar
Downloading: http://repo1.maven.org/maven2/org/codehaus/plexus/plexus-utils/2.0.1/plexus-utils-2.0.1.jar
Downloading: http://repo1.maven.org/maven2/org/codehaus/plexus/plexus-archiver/1.0-alpha-12/plexus-archiver-1.0-alpha-12.jar
Downloading: http://repo1.maven.org/maven2/org/codehaus/plexus/plexus-interpolation/1.7/plexus-interpolation-1.7.jar
Downloading: http://repo1.maven.org/maven2/org/codehaus/plexus/plexus-io/1.0-alpha-4/plexus-io-1.0-alpha-4.jar
Downloading: http://repo1.maven.org/maven2/org/codehaus/plexus/plexus-active-collections/1.0-beta-2/plexus-active-collections-1.0-beta-2.jar
[INFO] [assembly:single {execution: distribution-package}]
[INFO] Reading assembly descriptor: src/main/assembly/bin-distribution.xml
[INFO] Reading assembly descriptor: src/main/assembly/src.xml
[WARNING] Cannot include project artifact: org.apache.tuscany.sca:tuscany-distribution-all:pom:2.0-SNAPSHOT; it doesn't have an associated file or directory.
[WARNING] Cannot include project artifact: org.apache.tuscany.sca:tuscany-distribution-all:pom:2.0-SNAPSHOT; it doesn't have an associated file or directory.
[INFO] Building tar : <https://builds.apache.org/job/Tuscany-2x/ws/sca-2x/distribution/all/target/apache-tuscany-sca-all-2.0-SNAPSHOT.tar.gz>
[WARNING] Cannot include project artifact: org.apache.tuscany.sca:tuscany-distribution-all:pom:2.0-SNAPSHOT; it doesn't have an associated file or directory.
[WARNING] Cannot include project artifact: org.apache.tuscany.sca:tuscany-distribution-all:pom:2.0-SNAPSHOT; it doesn't have an associated file or directory.
[INFO] Building zip: <https://builds.apache.org/job/Tuscany-2x/ws/sca-2x/distribution/all/target/apache-tuscany-sca-all-2.0-SNAPSHOT.zip>
[INFO] Building tar : <https://builds.apache.org/job/Tuscany-2x/ws/sca-2x/distribution/all/target/apache-tuscany-sca-all-2.0-SNAPSHOT-src.tar.gz>
[INFO] Building zip: <https://builds.apache.org/job/Tuscany-2x/ws/sca-2x/distribution/all/target/apache-tuscany-sca-all-2.0-SNAPSHOT-src.zip>
[INFO] [install:install {execution: default-install}]
[INFO] Installing <https://builds.apache.org/job/Tuscany-2x/ws/sca-2x/distribution/all/pom.xml> to <https://builds.apache.org/job/Tuscany-2x/ws/.repository/org/apache/tuscany/sca/tuscany-distribution-all/2.0-SNAPSHOT/tuscany-distribution-all-2.0-SNAPSHOT.pom>
[INFO] Installing <https://builds.apache.org/job/Tuscany-2x/ws/sca-2x/distribution/all/target/apache-tuscany-sca-all-2.0-SNAPSHOT.tar.gz> to <https://builds.apache.org/job/Tuscany-2x/ws/.repository/org/apache/tuscany/sca/tuscany-distribution-all/2.0-SNAPSHOT/tuscany-distribution-all-2.0-SNAPSHOT.tar.gz>
[INFO] Installing <https://builds.apache.org/job/Tuscany-2x/ws/sca-2x/distribution/all/target/apache-tuscany-sca-all-2.0-SNAPSHOT.zip> to <https://builds.apache.org/job/Tuscany-2x/ws/.repository/org/apache/tuscany/sca/tuscany-distribution-all/2.0-SNAPSHOT/tuscany-distribution-all-2.0-SNAPSHOT.zip>
[INFO] Installing <https://builds.apache.org/job/Tuscany-2x/ws/sca-2x/distribution/all/target/apache-tuscany-sca-all-2.0-SNAPSHOT-src.tar.gz> to <https://builds.apache.org/job/Tuscany-2x/ws/.repository/org/apache/tuscany/sca/tuscany-distribution-all/2.0-SNAPSHOT/tuscany-distribution-all-2.0-SNAPSHOT-src.tar.gz>
[INFO] Installing <https://builds.apache.org/job/Tuscany-2x/ws/sca-2x/distribution/all/target/apache-tuscany-sca-all-2.0-SNAPSHOT-src.zip> to <https://builds.apache.org/job/Tuscany-2x/ws/.repository/org/apache/tuscany/sca/tuscany-distribution-all/2.0-SNAPSHOT/tuscany-distribution-all-2.0-SNAPSHOT-src.zip>
[JENKINS] Archiving disabled - not archiving <https://builds.apache.org/job/Tuscany-2x/ws/sca-2x/distribution/all/pom.xml>
[JENKINS] Archiving disabled - not archiving <https://builds.apache.org/job/Tuscany-2x/ws/.repository/org/apache/tuscany/sca/tuscany-distribution-all/2.0-SNAPSHOT/tuscany-distribution-all-2.0-SNAPSHOT.pom>
[JENKINS] Archiving disabled - not archiving <https://builds.apache.org/job/Tuscany-2x/ws/sca-2x/distribution/all/target/apache-tuscany-sca-all-2.0-SNAPSHOT.tar.gz>
[JENKINS] Archiving disabled - not archiving <https://builds.apache.org/job/Tuscany-2x/ws/sca-2x/distribution/all/target/apache-tuscany-sca-all-2.0-SNAPSHOT.zip>
[JENKINS] Archiving disabled - not archiving <https://builds.apache.org/job/Tuscany-2x/ws/sca-2x/distribution/all/target/apache-tuscany-sca-all-2.0-SNAPSHOT-src.tar.gz>
[JENKINS] Archiving disabled - not archiving <https://builds.apache.org/job/Tuscany-2x/ws/sca-2x/distribution/all/target/apache-tuscany-sca-all-2.0-SNAPSHOT-src.zip>
[INFO] ------------------------------------------------------------------------
[INFO] Building Apache Tuscany SCA iTest Distribution
[INFO] task-segment: [clean, install]
[INFO] ------------------------------------------------------------------------
[INFO] [clean:clean {execution: default-clean}]
[INFO] [enforcer:enforce {execution: enforce-plugin-versions}]
[INFO] [remote-resources:process {execution: default}]
[INFO] [site:attach-descriptor {execution: default-attach-descriptor}]
[INFO] [install:install {execution: default-install}]
[INFO] Installing <https://builds.apache.org/job/Tuscany-2x/ws/sca-2x/testing/itest/distribution/pom.xml> to <https://builds.apache.org/job/Tuscany-2x/ws/.repository/org/apache/tuscany/sca/itest-distribution/2.0-SNAPSHOT/itest-distribution-2.0-SNAPSHOT.pom>
[JENKINS] Archiving disabled - not archiving <https://builds.apache.org/job/Tuscany-2x/ws/sca-2x/testing/itest/distribution/pom.xml>
[JENKINS] Archiving disabled - not archiving <https://builds.apache.org/job/Tuscany-2x/ws/.repository/org/apache/tuscany/sca/itest-distribution/2.0-SNAPSHOT/itest-distribution-2.0-SNAPSHOT.pom>
[INFO] ------------------------------------------------------------------------
[INFO] Building Apache Tuscany SCA iTest Distribution Src Distro Unzip
[INFO] task-segment: [clean, install]
[INFO] ------------------------------------------------------------------------
[INFO] [clean:clean {execution: default-clean}]
[INFO] [enforcer:enforce {execution: enforce-plugin-versions}]
[INFO] [remote-resources:process {execution: default}]
[INFO] [resources:resources {execution: default-resources}]
[INFO] Using 'UTF-8' encoding to copy filtered resources.
[INFO] skip non existing resourceDirectory <https://builds.apache.org/job/Tuscany-2x/ws/sca-2x/testing/itest/distribution/src-distro-unzip/src/main/resources>
[INFO] Copying 0 resource
[INFO] Copying 3 resources
[INFO] [compiler:compile {execution: default-compile}]
[INFO] No sources to compile
[INFO] [resources:testResources {execution: default-testResources}]
[INFO] Using 'UTF-8' encoding to copy filtered resources.
[INFO] skip non existing resourceDirectory <https://builds.apache.org/job/Tuscany-2x/ws/sca-2x/testing/itest/distribution/src-distro-unzip/src/test/resources>
[INFO] Copying 3 resources
[INFO] [compiler:testCompile {execution: default-testCompile}]
[INFO] No sources to compile
[INFO] [surefire:test {execution: default-test}]
[INFO] Surefire report directory: <https://builds.apache.org/job/Tuscany-2x/ws/sca-2x/testing/itest/distribution/src-distro-unzip/target/surefire-reports>
-------------------------------------------------------
T E S T S
-------------------------------------------------------
There are no tests to run.
Results :
Tests run: 0, Failures: 0, Errors: 0, Skipped: 0
[JENKINS] Recording test results
[INFO] [jar:jar {execution: default-jar}]
[INFO] Building jar: <https://builds.apache.org/job/Tuscany-2x/ws/sca-2x/testing/itest/distribution/src-distro-unzip/target/itest-src-distro-unzip-2.0-SNAPSHOT.jar>
[INFO] [antrun:run {execution: run-samples}]
[INFO] Executing tasks
unzip:
[unzip] Expanding: <https://builds.apache.org/job/Tuscany-2x/ws/sca-2x/distribution/all/target/apache-tuscany-sca-all-2.0-SNAPSHOT-src.zip> into <https://builds.apache.org/job/Tuscany-2x/ws/sca-2x/distribution/all/target/apache-tuscany-sca-all-2.0-SNAPSHOT-src.dir>
[INFO] Executed tasks
[INFO] [install:install {execution: default-install}]
[INFO] Installing <https://builds.apache.org/job/Tuscany-2x/ws/sca-2x/testing/itest/distribution/src-distro-unzip/target/itest-src-distro-unzip-2.0-SNAPSHOT.jar> to <https://builds.apache.org/job/Tuscany-2x/ws/.repository/org/apache/tuscany/sca/itest-src-distro-unzip/2.0-SNAPSHOT/itest-src-distro-unzip-2.0-SNAPSHOT.jar>
[JENKINS] Archiving disabled - not archiving <https://builds.apache.org/job/Tuscany-2x/ws/sca-2x/testing/itest/distribution/src-distro-unzip/pom.xml>
[JENKINS] Archiving disabled - not archiving <https://builds.apache.org/job/Tuscany-2x/ws/sca-2x/testing/itest/distribution/src-distro-unzip/target/itest-src-distro-unzip-2.0-SNAPSHOT.jar>
[INFO] ------------------------------------------------------------------------
[INFO] Building Apache Tuscany SCA iTest Distribution Src Distro RAT
[INFO] task-segment: [clean, install]
[INFO] ------------------------------------------------------------------------
Downloading: http://repo1.maven.org/maven2/org/apache/rat/apache-rat-plugin/0.6/apache-rat-plugin-0.6.pom
Downloading: http://repo1.maven.org/maven2/org/apache/rat/apache-rat-project/0.6/apache-rat-project-0.6.pom
Downloading: http://repo1.maven.org/maven2/org/apache/rat/apache-rat-plugin/0.6/apache-rat-plugin-0.6.jar
[INFO] [clean:clean {execution: default-clean}]
[INFO] [enforcer:enforce {execution: enforce-plugin-versions}]
[INFO] [remote-resources:process {execution: default}]
[INFO] [resources:resources {execution: default-resources}]
[INFO] Using 'UTF-8' encoding to copy filtered resources.
[INFO] skip non existing resourceDirectory <https://builds.apache.org/job/Tuscany-2x/ws/sca-2x/testing/itest/distribution/src-distro-rat/src/main/resources>
[INFO] Copying 0 resource
[INFO] Copying 3 resources
[INFO] [compiler:compile {execution: default-compile}]
[INFO] No sources to compile
[INFO] [resources:testResources {execution: default-testResources}]
[INFO] Using 'UTF-8' encoding to copy filtered resources.
[INFO] skip non existing resourceDirectory <https://builds.apache.org/job/Tuscany-2x/ws/sca-2x/testing/itest/distribution/src-distro-rat/src/test/resources>
[INFO] Copying 3 resources
[INFO] [compiler:testCompile {execution: default-testCompile}]
[INFO] No sources to compile
[INFO] [surefire:test {execution: default-test}]
[INFO] Surefire report directory: <https://builds.apache.org/job/Tuscany-2x/ws/sca-2x/testing/itest/distribution/src-distro-rat/target/surefire-reports>
-------------------------------------------------------
T E S T S
-------------------------------------------------------
There are no tests to run.
Results :
Tests run: 0, Failures: 0, Errors: 0, Skipped: 0
[JENKINS] Recording test results
[INFO] [jar:jar {execution: default-jar}]
[INFO] Building jar: <https://builds.apache.org/job/Tuscany-2x/ws/sca-2x/testing/itest/distribution/src-distro-rat/target/itest-distribution-src-dsitro-rat-2.0-SNAPSHOT.jar>
Downloading: http://repo1.maven.org/maven2/org/apache/rat/apache-rat-core/0.6/apache-rat-core-0.6.pom
Downloading: http://repo1.maven.org/maven2/org/apache/maven/shared/maven-plugin-testing-harness/1.0-beta-1/maven-plugin-testing-harness-1.0-beta-1.pom
Downloading: http://repo1.maven.org/maven2/org/apache/maven/shared/maven-shared-components/1/maven-shared-components-1.pom
Downloading: http://svn.apache.org/repos/asf/tuscany/maven/junit/junit/3.8.2/junit-3.8.2.jar
Downloading: http://repo1.maven.org/maven2/org/apache/maven/shared/maven-plugin-testing-harness/1.0-beta-1/maven-plugin-testing-harness-1.0-beta-1.jar
Downloading: http://svn.apache.org/repos/asf/tuscany/maven/org/apache/maven/doxia/doxia-core/1.0-alpha-8/doxia-core-1.0-alpha-8.jar
Downloading: http://repo1.maven.org/maven2/org/apache/rat/apache-rat-core/0.6/apache-rat-core-0.6.jar
Downloading: http://repo1.maven.org/maven2/org/codehaus/plexus/plexus-utils/1.4/plexus-utils-1.4.jar
[INFO] Unable to find resource 'org.apache.maven.doxia:doxia-core:jar:1.0-alpha-8' in repository tuscany.repo (http://svn.apache.org/repos/asf/tuscany/maven)
[INFO] Unable to find resource 'junit:junit:jar:3.8.2' in repository tuscany.repo (http://svn.apache.org/repos/asf/tuscany/maven)
Downloading: http://repo1.maven.org/maven2/org/apache/maven/doxia/doxia-core/1.0-alpha-8/doxia-core-1.0-alpha-8.jar
Downloading: http://repo1.maven.org/maven2/junit/junit/3.8.2/junit-3.8.2.jar
[INFO] [apache-rat:check {execution: default}]
[INFO] Exclude: tuscany-sca-2.0-SNAPSHOT-src/CHANGES
[INFO] Exclude: **/*.MF
[INFO] Exclude: tuscany-sca-2.0-SNAPSHOT-src/testing/itest/spi/spi-safe.txt
[INFO] Exclude: tuscany-sca-2.0-SNAPSHOT-src/testing/compliance-tests/binding-ws/sca_variables.dtd
[INFO] Exclude: tuscany-sca-2.0-SNAPSHOT-src/testing/itest/implementation-spring/src/main/resources/implementation/policies/CalculatorJass.config
[INFO] Exclude: tuscany-sca-2.0-SNAPSHOT-src/modules/binding-ws-runtime-axis2/src/main/resources/org/apache/tuscany/sca/binding/ws/axis2/engine/repository/modules/modules.list
[INFO] Exclude: tuscany-sca-2.0-SNAPSHOT-src/modules/binding-ws-runtime-axis2/src/main/resources/org/apache/tuscany/sca/binding/ws/axis2/engine/repository/services/services.list
[INFO] Exclude: tuscany-sca-2.0-SNAPSHOT-src/modules/implementation-spring-tie/src/main/resources/META-INF/spring.handlers
[INFO] Exclude: tuscany-sca-2.0-SNAPSHOT-src/modules/implementation-spring-tie/src/main/resources/META-INF/spring.schemas
[INFO] Exclude: tuscany-sca-2.0-SNAPSHOT-src/modules/implementation-spring-runtime/src/main/resources/META-INF/spring.handlers
[INFO] Exclude: tuscany-sca-2.0-SNAPSHOT-src/modules/implementation-spring-runtime/src/main/resources/META-INF/spring.schemas
[INFO] Exclude: tuscany-sca-2.0-SNAPSHOT-src/maven/archetypes/binding/src/test/resources/projects/basic/goal.txt
[INFO] Exclude: tuscany-sca-2.0-SNAPSHOT-src/maven/archetypes/implementation/src/test/resources/projects/basic/goal.txt
[INFO] Exclude: tuscany-sca-2.0-SNAPSHOT-src/modules/implementation-python-runtime/src/main/resources/django/__init__.py
[INFO] Exclude: tuscany-sca-2.0-SNAPSHOT-src/modules/implementation-python-runtime/src/main/resources/django/utils/__init__.py
[INFO] Exclude: tuscany-sca-2.0-SNAPSHOT-src/modules/assembly-xsd/**/*.*
[INFO] Exclude: tuscany-sca-2.0-SNAPSHOT-src/modules/sca-api/**/*.*
[INFO] Exclude: tuscany-sca-2.0-SNAPSHOT-src/modules/implementation-web-runtime/src/main/resources/META-INF/sca.tld
[INFO] Exclude: tuscany-sca-2.0-SNAPSHOT-src/modules/assembly-xml/src/main/resources/META-INF/sca-policy-1.1-intents-definitions-cd04.xml
[INFO] Exclude: tuscany-sca-2.0-SNAPSHOT-src/modules/sca-client-impl/src/main/java/org/apache/tuscany/sca/client/impl/SCAClientFactoryFinderImpl.java
[INFO] Exclude: tuscany-sca-2.0-SNAPSHOT-src/modules/binding-comet-runtime/src/main/resources/jquery.guid.js
[INFO] Exclude: tuscany-sca-2.0-SNAPSHOT-src/modules/binding-comet-runtime/src/main/resources/jquery.json-2.2.min.js
[INFO] Exclude: tuscany-sca-2.0-SNAPSHOT-src/modules/implementation-python-runtime/src/main/resources/django/utils/simplejson/*
[INFO] Exclude: tuscany-sca-2.0-SNAPSHOT-src/testing/compliance-tests/binding-jms/src/test/resources/tuscany-oasis-sca-tests-errors.properties
[JENKINS] Archiving disabled - not archiving <https://builds.apache.org/job/Tuscany-2x/ws/sca-2x/testing/itest/distribution/src-distro-rat/pom.xml>
[JENKINS] Archiving disabled - not archiving <https://builds.apache.org/job/Tuscany-2x/ws/sca-2x/testing/itest/distribution/src-distro-rat/target/itest-distribution-src-dsitro-rat-2.0-SNAPSHOT.jar>
[INFO] ------------------------------------------------------------------------
[ERROR] BUILD FAILURE
[INFO] ------------------------------------------------------------------------
[INFO] Too many unapproved licenses: 7
[INFO] ------------------------------------------------------------------------
[INFO] For more information, run Maven with the -e switch
[INFO] ------------------------------------------------------------------------
[INFO] Total time: 32 minutes 32 seconds
[INFO] Finished at: Sun Jan 22 00:48:29 UTC 2012
[INFO] Final Memory: 157M/719M
[INFO] ------------------------------------------------------------------------
Waiting for Jenkins to finish collecting data
channel stopped
2012-01-22 00:48:32.814:INFO::Shutdown hook executing
2012-01-22 00:48:32.815:INFO::Shutdown hook complete
Build failed in Jenkins: Tuscany-2x #507
Posted by Apache Jenkins Server <je...@builds.apache.org>.
See <https://builds.apache.org/job/Tuscany-2x/507/>
------------------------------------------
[...truncated 39922 lines...]
400b downloaded (maven-monitor-2.0.pom)
Downloading: http://download.java.net/maven/2/org/apache/maven/wagon/wagon-ssh/1.0-alpha-5/wagon-ssh-1.0-alpha-5.pom
[INFO] Unable to find resource 'org.apache.maven.wagon:wagon-ssh:pom:1.0-alpha-5' in repository java.net2 (http://download.java.net/maven/2)
Downloading: http://www.intalio.org/public/maven2/org/apache/maven/wagon/wagon-ssh/1.0-alpha-5/wagon-ssh-1.0-alpha-5.pom
[INFO] Unable to find resource 'org.apache.maven.wagon:wagon-ssh:pom:1.0-alpha-5' in repository intalio.org (http://www.intalio.org/public/maven2)
Downloading: http://svn.apache.org/repos/asf/openejb/repo/org/apache/maven/wagon/wagon-ssh/1.0-alpha-5/wagon-ssh-1.0-alpha-5.pom
[INFO] Unable to find resource 'org.apache.maven.wagon:wagon-ssh:pom:1.0-alpha-5' in repository openejb-repository (http://svn.apache.org/repos/asf/openejb/repo)
Downloading: http://svn.apache.org/repos/asf/tuscany/maven/org/apache/maven/wagon/wagon-ssh/1.0-alpha-5/wagon-ssh-1.0-alpha-5.pom
[INFO] Unable to find resource 'org.apache.maven.wagon:wagon-ssh:pom:1.0-alpha-5' in repository tuscany.repo (http://svn.apache.org/repos/asf/tuscany/maven)
Downloading: http://repo1.maven.org/maven2/org/apache/maven/wagon/wagon-ssh/1.0-alpha-5/wagon-ssh-1.0-alpha-5.pom
Downloading: http://download.java.net/maven/2/com/jcraft/jsch/0.1.23/jsch-0.1.23.pom
[INFO] Unable to find resource 'com.jcraft:jsch:pom:0.1.23' in repository java.net2 (http://download.java.net/maven/2)
Downloading: http://www.intalio.org/public/maven2/com/jcraft/jsch/0.1.23/jsch-0.1.23.pom
[INFO] Unable to find resource 'com.jcraft:jsch:pom:0.1.23' in repository intalio.org (http://www.intalio.org/public/maven2)
Downloading: http://svn.apache.org/repos/asf/openejb/repo/com/jcraft/jsch/0.1.23/jsch-0.1.23.pom
[INFO] Unable to find resource 'com.jcraft:jsch:pom:0.1.23' in repository openejb-repository (http://svn.apache.org/repos/asf/openejb/repo)
Downloading: http://svn.apache.org/repos/asf/tuscany/maven/com/jcraft/jsch/0.1.23/jsch-0.1.23.pom
[INFO] Unable to find resource 'com.jcraft:jsch:pom:0.1.23' in repository tuscany.repo (http://svn.apache.org/repos/asf/tuscany/maven)
Downloading: http://repo1.maven.org/maven2/com/jcraft/jsch/0.1.23/jsch-0.1.23.pom
Downloading: http://repo1.maven.org/maven2/org/codehaus/plexus/plexus-interpolation/1.7/plexus-interpolation-1.7.pom
Downloading: http://repo1.maven.org/maven2/org/codehaus/plexus/plexus-archiver/1.0-alpha-12/plexus-archiver-1.0-alpha-12.pom
Downloading: http://download.java.net/maven/2/org/codehaus/plexus/plexus-io/1.0-alpha-4/plexus-io-1.0-alpha-4.pom
[INFO] Unable to find resource 'org.codehaus.plexus:plexus-io:pom:1.0-alpha-4' in repository java.net2 (http://download.java.net/maven/2)
Downloading: http://www.intalio.org/public/maven2/org/codehaus/plexus/plexus-io/1.0-alpha-4/plexus-io-1.0-alpha-4.pom
1K downloaded (plexus-io-1.0-alpha-4.pom)
Downloading: http://repo1.maven.org/maven2/org/codehaus/plexus/plexus-active-collections/1.0-beta-2/plexus-active-collections-1.0-beta-2.pom
Downloading: http://download.java.net/maven/2/org/codehaus/plexus/plexus-container-default/1.0-alpha-22/plexus-container-default-1.0-alpha-22.pom
[INFO] Unable to find resource 'org.codehaus.plexus:plexus-container-default:pom:1.0-alpha-22' in repository java.net2 (http://download.java.net/maven/2)
Downloading: http://www.intalio.org/public/maven2/org/codehaus/plexus/plexus-container-default/1.0-alpha-22/plexus-container-default-1.0-alpha-22.pom
[INFO] Unable to find resource 'org.codehaus.plexus:plexus-container-default:pom:1.0-alpha-22' in repository intalio.org (http://www.intalio.org/public/maven2)
Downloading: http://svn.apache.org/repos/asf/openejb/repo/org/codehaus/plexus/plexus-container-default/1.0-alpha-22/plexus-container-default-1.0-alpha-22.pom
[INFO] Unable to find resource 'org.codehaus.plexus:plexus-container-default:pom:1.0-alpha-22' in repository openejb-repository (http://svn.apache.org/repos/asf/openejb/repo)
Downloading: http://svn.apache.org/repos/asf/tuscany/maven/org/codehaus/plexus/plexus-container-default/1.0-alpha-22/plexus-container-default-1.0-alpha-22.pom
[INFO] Unable to find resource 'org.codehaus.plexus:plexus-container-default:pom:1.0-alpha-22' in repository tuscany.repo (http://svn.apache.org/repos/asf/tuscany/maven)
Downloading: http://repo1.maven.org/maven2/org/codehaus/plexus/plexus-container-default/1.0-alpha-22/plexus-container-default-1.0-alpha-22.pom
Downloading: http://download.java.net/maven/2/org/codehaus/plexus/plexus-containers/1.0-alpha-22/plexus-containers-1.0-alpha-22.pom
[INFO] Unable to find resource 'org.codehaus.plexus:plexus-containers:pom:1.0-alpha-22' in repository java.net2 (http://download.java.net/maven/2)
Downloading: http://www.intalio.org/public/maven2/org/codehaus/plexus/plexus-containers/1.0-alpha-22/plexus-containers-1.0-alpha-22.pom
[INFO] Unable to find resource 'org.codehaus.plexus:plexus-containers:pom:1.0-alpha-22' in repository intalio.org (http://www.intalio.org/public/maven2)
Downloading: http://svn.apache.org/repos/asf/openejb/repo/org/codehaus/plexus/plexus-containers/1.0-alpha-22/plexus-containers-1.0-alpha-22.pom
[INFO] Unable to find resource 'org.codehaus.plexus:plexus-containers:pom:1.0-alpha-22' in repository openejb-repository (http://svn.apache.org/repos/asf/openejb/repo)
Downloading: http://svn.apache.org/repos/asf/tuscany/maven/org/codehaus/plexus/plexus-containers/1.0-alpha-22/plexus-containers-1.0-alpha-22.pom
[INFO] Unable to find resource 'org.codehaus.plexus:plexus-containers:pom:1.0-alpha-22' in repository tuscany.repo (http://svn.apache.org/repos/asf/tuscany/maven)
Downloading: http://repo1.maven.org/maven2/org/codehaus/plexus/plexus-containers/1.0-alpha-22/plexus-containers-1.0-alpha-22.pom
Downloading: http://repo1.maven.org/maven2/org/codehaus/plexus/plexus-utils/2.0.1/plexus-utils-2.0.1.pom
Downloading: http://repo1.maven.org/maven2/org/codehaus/plexus/plexus-utils/2.0.1/plexus-utils-2.0.1.jar
Downloading: http://repo1.maven.org/maven2/org/apache/maven/shared/maven-common-artifact-filters/1.1/maven-common-artifact-filters-1.1.jar
Downloading: http://repo1.maven.org/maven2/org/codehaus/plexus/plexus-archiver/1.0-alpha-12/plexus-archiver-1.0-alpha-12.jar
Downloading: http://repo1.maven.org/maven2/org/codehaus/plexus/plexus-interpolation/1.7/plexus-interpolation-1.7.jar
Downloading: http://repo1.maven.org/maven2/org/codehaus/plexus/plexus-io/1.0-alpha-4/plexus-io-1.0-alpha-4.jar
Downloading: http://repo1.maven.org/maven2/org/codehaus/plexus/plexus-active-collections/1.0-beta-2/plexus-active-collections-1.0-beta-2.jar
[INFO] [assembly:single {execution: distribution-package}]
[INFO] Reading assembly descriptor: src/main/assembly/bin-distribution.xml
[INFO] Reading assembly descriptor: src/main/assembly/src.xml
[WARNING] Cannot include project artifact: org.apache.tuscany.sca:tuscany-distribution-all:pom:2.0-SNAPSHOT; it doesn't have an associated file or directory.
[WARNING] Cannot include project artifact: org.apache.tuscany.sca:tuscany-distribution-all:pom:2.0-SNAPSHOT; it doesn't have an associated file or directory.
[INFO] Building tar : <https://builds.apache.org/job/Tuscany-2x/ws/sca-2x/distribution/all/target/apache-tuscany-sca-all-2.0-SNAPSHOT.tar.gz>
[WARNING] Cannot include project artifact: org.apache.tuscany.sca:tuscany-distribution-all:pom:2.0-SNAPSHOT; it doesn't have an associated file or directory.
[WARNING] Cannot include project artifact: org.apache.tuscany.sca:tuscany-distribution-all:pom:2.0-SNAPSHOT; it doesn't have an associated file or directory.
[INFO] Building zip: <https://builds.apache.org/job/Tuscany-2x/ws/sca-2x/distribution/all/target/apache-tuscany-sca-all-2.0-SNAPSHOT.zip>
[INFO] Building tar : <https://builds.apache.org/job/Tuscany-2x/ws/sca-2x/distribution/all/target/apache-tuscany-sca-all-2.0-SNAPSHOT-src.tar.gz>
[INFO] Building zip: <https://builds.apache.org/job/Tuscany-2x/ws/sca-2x/distribution/all/target/apache-tuscany-sca-all-2.0-SNAPSHOT-src.zip>
[INFO] [install:install {execution: default-install}]
[INFO] Installing <https://builds.apache.org/job/Tuscany-2x/ws/sca-2x/distribution/all/pom.xml> to <https://builds.apache.org/job/Tuscany-2x/ws/.repository/org/apache/tuscany/sca/tuscany-distribution-all/2.0-SNAPSHOT/tuscany-distribution-all-2.0-SNAPSHOT.pom>
[INFO] Installing <https://builds.apache.org/job/Tuscany-2x/ws/sca-2x/distribution/all/target/apache-tuscany-sca-all-2.0-SNAPSHOT.tar.gz> to <https://builds.apache.org/job/Tuscany-2x/ws/.repository/org/apache/tuscany/sca/tuscany-distribution-all/2.0-SNAPSHOT/tuscany-distribution-all-2.0-SNAPSHOT.tar.gz>
[INFO] Installing <https://builds.apache.org/job/Tuscany-2x/ws/sca-2x/distribution/all/target/apache-tuscany-sca-all-2.0-SNAPSHOT.zip> to <https://builds.apache.org/job/Tuscany-2x/ws/.repository/org/apache/tuscany/sca/tuscany-distribution-all/2.0-SNAPSHOT/tuscany-distribution-all-2.0-SNAPSHOT.zip>
[INFO] Installing <https://builds.apache.org/job/Tuscany-2x/ws/sca-2x/distribution/all/target/apache-tuscany-sca-all-2.0-SNAPSHOT-src.tar.gz> to <https://builds.apache.org/job/Tuscany-2x/ws/.repository/org/apache/tuscany/sca/tuscany-distribution-all/2.0-SNAPSHOT/tuscany-distribution-all-2.0-SNAPSHOT-src.tar.gz>
[INFO] Installing <https://builds.apache.org/job/Tuscany-2x/ws/sca-2x/distribution/all/target/apache-tuscany-sca-all-2.0-SNAPSHOT-src.zip> to <https://builds.apache.org/job/Tuscany-2x/ws/.repository/org/apache/tuscany/sca/tuscany-distribution-all/2.0-SNAPSHOT/tuscany-distribution-all-2.0-SNAPSHOT-src.zip>
[JENKINS] Archiving disabled - not archiving <https://builds.apache.org/job/Tuscany-2x/ws/sca-2x/distribution/all/pom.xml>
[JENKINS] Archiving disabled - not archiving <https://builds.apache.org/job/Tuscany-2x/ws/.repository/org/apache/tuscany/sca/tuscany-distribution-all/2.0-SNAPSHOT/tuscany-distribution-all-2.0-SNAPSHOT.pom>
[JENKINS] Archiving disabled - not archiving <https://builds.apache.org/job/Tuscany-2x/ws/sca-2x/distribution/all/target/apache-tuscany-sca-all-2.0-SNAPSHOT.tar.gz>
[JENKINS] Archiving disabled - not archiving <https://builds.apache.org/job/Tuscany-2x/ws/sca-2x/distribution/all/target/apache-tuscany-sca-all-2.0-SNAPSHOT.zip>
[JENKINS] Archiving disabled - not archiving <https://builds.apache.org/job/Tuscany-2x/ws/sca-2x/distribution/all/target/apache-tuscany-sca-all-2.0-SNAPSHOT-src.tar.gz>
[JENKINS] Archiving disabled - not archiving <https://builds.apache.org/job/Tuscany-2x/ws/sca-2x/distribution/all/target/apache-tuscany-sca-all-2.0-SNAPSHOT-src.zip>
[INFO] ------------------------------------------------------------------------
[INFO] Building Apache Tuscany SCA iTest Distribution
[INFO] task-segment: [clean, install]
[INFO] ------------------------------------------------------------------------
[INFO] [clean:clean {execution: default-clean}]
[INFO] [enforcer:enforce {execution: enforce-plugin-versions}]
[INFO] [remote-resources:process {execution: default}]
[INFO] [site:attach-descriptor {execution: default-attach-descriptor}]
[INFO] [install:install {execution: default-install}]
[INFO] Installing <https://builds.apache.org/job/Tuscany-2x/ws/sca-2x/testing/itest/distribution/pom.xml> to <https://builds.apache.org/job/Tuscany-2x/ws/.repository/org/apache/tuscany/sca/itest-distribution/2.0-SNAPSHOT/itest-distribution-2.0-SNAPSHOT.pom>
[JENKINS] Archiving disabled - not archiving <https://builds.apache.org/job/Tuscany-2x/ws/sca-2x/testing/itest/distribution/pom.xml>
[JENKINS] Archiving disabled - not archiving <https://builds.apache.org/job/Tuscany-2x/ws/.repository/org/apache/tuscany/sca/itest-distribution/2.0-SNAPSHOT/itest-distribution-2.0-SNAPSHOT.pom>
[INFO] ------------------------------------------------------------------------
[INFO] Building Apache Tuscany SCA iTest Distribution Src Distro Unzip
[INFO] task-segment: [clean, install]
[INFO] ------------------------------------------------------------------------
[INFO] [clean:clean {execution: default-clean}]
[INFO] [enforcer:enforce {execution: enforce-plugin-versions}]
[INFO] [remote-resources:process {execution: default}]
[JENKINS] Recording test results[INFO] [resources:resources {execution: default-resources}]
[INFO] Using 'UTF-8' encoding to copy filtered resources.
[INFO] skip non existing resourceDirectory <https://builds.apache.org/job/Tuscany-2x/ws/sca-2x/testing/itest/distribution/src-distro-unzip/src/main/resources>
[INFO] Copying 0 resource
[INFO] Copying 3 resources
[INFO] [compiler:compile {execution: default-compile}]
[INFO] No sources to compile
[INFO] [resources:testResources {execution: default-testResources}]
[INFO] Using 'UTF-8' encoding to copy filtered resources.
[INFO] skip non existing resourceDirectory <https://builds.apache.org/job/Tuscany-2x/ws/sca-2x/testing/itest/distribution/src-distro-unzip/src/test/resources>
[INFO] Copying 3 resources
[INFO] [compiler:testCompile {execution: default-testCompile}]
[INFO] No sources to compile
[INFO] [surefire:test {execution: default-test}]
[INFO] Surefire report directory: <https://builds.apache.org/job/Tuscany-2x/ws/sca-2x/testing/itest/distribution/src-distro-unzip/target/surefire-reports>
-------------------------------------------------------
T E S T S
-------------------------------------------------------
There are no tests to run.
Results :
Tests run: 0, Failures: 0, Errors: 0, Skipped: 0
[INFO] [jar:jar {execution: default-jar}]
[INFO] Building jar: <https://builds.apache.org/job/Tuscany-2x/ws/sca-2x/testing/itest/distribution/src-distro-unzip/target/itest-src-distro-unzip-2.0-SNAPSHOT.jar>
[INFO] [antrun:run {execution: run-samples}]
[INFO] Executing tasks
unzip:
[unzip] Expanding: <https://builds.apache.org/job/Tuscany-2x/ws/sca-2x/distribution/all/target/apache-tuscany-sca-all-2.0-SNAPSHOT-src.zip> into <https://builds.apache.org/job/Tuscany-2x/ws/sca-2x/distribution/all/target/apache-tuscany-sca-all-2.0-SNAPSHOT-src.dir>
[INFO] Executed tasks
[INFO] [install:install {execution: default-install}]
[INFO] Installing <https://builds.apache.org/job/Tuscany-2x/ws/sca-2x/testing/itest/distribution/src-distro-unzip/target/itest-src-distro-unzip-2.0-SNAPSHOT.jar> to <https://builds.apache.org/job/Tuscany-2x/ws/.repository/org/apache/tuscany/sca/itest-src-distro-unzip/2.0-SNAPSHOT/itest-src-distro-unzip-2.0-SNAPSHOT.jar>
[JENKINS] Archiving disabled - not archiving <https://builds.apache.org/job/Tuscany-2x/ws/sca-2x/testing/itest/distribution/src-distro-unzip/pom.xml>
[JENKINS] Archiving disabled - not archiving <https://builds.apache.org/job/Tuscany-2x/ws/sca-2x/testing/itest/distribution/src-distro-unzip/target/itest-src-distro-unzip-2.0-SNAPSHOT.jar>
[INFO] ------------------------------------------------------------------------
[INFO] Building Apache Tuscany SCA iTest Distribution Src Distro RAT
[INFO] task-segment: [clean, install]
[INFO] ------------------------------------------------------------------------
Downloading: http://repo1.maven.org/maven2/org/apache/rat/apache-rat-plugin/0.6/apache-rat-plugin-0.6.pom
Downloading: http://repo1.maven.org/maven2/org/apache/rat/apache-rat-project/0.6/apache-rat-project-0.6.pom
Downloading: http://repo1.maven.org/maven2/org/apache/rat/apache-rat-plugin/0.6/apache-rat-plugin-0.6.jar
[INFO] [clean:clean {execution: default-clean}]
[INFO] [enforcer:enforce {execution: enforce-plugin-versions}]
[INFO] [remote-resources:process {execution: default}]
[INFO] [resources:resources {execution: default-resources}]
[INFO] Using 'UTF-8' encoding to copy filtered resources.
[INFO] skip non existing resourceDirectory <https://builds.apache.org/job/Tuscany-2x/ws/sca-2x/testing/itest/distribution/src-distro-rat/src/main/resources>
[INFO] Copying 0 resource
[INFO] Copying 3 resources
[INFO] [compiler:compile {execution: default-compile}]
[INFO] No sources to compile
[INFO] [resources:testResources {execution: default-testResources}]
[INFO] Using 'UTF-8' encoding to copy filtered resources.
[INFO] skip non existing resourceDirectory <https://builds.apache.org/job/Tuscany-2x/ws/sca-2x/testing/itest/distribution/src-distro-rat/src/test/resources>
[INFO] Copying 3 resources
[INFO] [compiler:testCompile {execution: default-testCompile}]
[INFO] No sources to compile
[INFO] [surefire:test {execution: default-test}]
[INFO] Surefire report directory: <https://builds.apache.org/job/Tuscany-2x/ws/sca-2x/testing/itest/distribution/src-distro-rat/target/surefire-reports>
-------------------------------------------------------
T E S T S
-------------------------------------------------------
There are no tests to run.
Results :
Tests run: 0, Failures: 0, Errors: 0, Skipped: 0
[JENKINS] Recording test results
[INFO] [jar:jar {execution: default-jar}]
[INFO] Building jar: <https://builds.apache.org/job/Tuscany-2x/ws/sca-2x/testing/itest/distribution/src-distro-rat/target/itest-distribution-src-dsitro-rat-2.0-SNAPSHOT.jar>
Downloading: http://repo1.maven.org/maven2/org/apache/rat/apache-rat-core/0.6/apache-rat-core-0.6.pom
Downloading: http://repo1.maven.org/maven2/org/apache/maven/shared/maven-plugin-testing-harness/1.0-beta-1/maven-plugin-testing-harness-1.0-beta-1.pom
Downloading: http://repo1.maven.org/maven2/org/apache/maven/shared/maven-shared-components/1/maven-shared-components-1.pom
Downloading: http://svn.apache.org/repos/asf/tuscany/maven/junit/junit/3.8.2/junit-3.8.2.jar
Downloading: http://repo1.maven.org/maven2/org/codehaus/plexus/plexus-utils/1.4/plexus-utils-1.4.jar
Downloading: http://repo1.maven.org/maven2/org/apache/maven/shared/maven-plugin-testing-harness/1.0-beta-1/maven-plugin-testing-harness-1.0-beta-1.jar
Downloading: http://svn.apache.org/repos/asf/tuscany/maven/org/apache/maven/doxia/doxia-core/1.0-alpha-8/doxia-core-1.0-alpha-8.jar
Downloading: http://repo1.maven.org/maven2/org/apache/rat/apache-rat-core/0.6/apache-rat-core-0.6.jar
[INFO] [INFO] Unable to find resource 'org.apache.maven.doxia:doxia-core:jar:1.0-alpha-8' in repository tuscany.repo (http://svn.apache.org/repos/asf/tuscany/maven)
Unable to find resource 'junit:junit:jar:3.8.2' in repository tuscany.repo (http://svn.apache.org/repos/asf/tuscany/maven)
Downloading: http://repo1.maven.org/maven2/junit/junit/3.8.2/junit-3.8.2.jar
Downloading: http://repo1.maven.org/maven2/org/apache/maven/doxia/doxia-core/1.0-alpha-8/doxia-core-1.0-alpha-8.jar
[WARNING] Component manager not found for returned component. Ignored. component=org.apache.maven.wagon.providers.http.LightweightHttpWagon@acdab4
[INFO] [apache-rat:check {execution: default}]
[INFO] Exclude: tuscany-sca-2.0-SNAPSHOT-src/CHANGES
[INFO] Exclude: **/*.MF
[INFO] Exclude: tuscany-sca-2.0-SNAPSHOT-src/testing/itest/spi/spi-safe.txt
[INFO] Exclude: tuscany-sca-2.0-SNAPSHOT-src/testing/compliance-tests/binding-ws/sca_variables.dtd
[INFO] Exclude: tuscany-sca-2.0-SNAPSHOT-src/testing/itest/implementation-spring/src/main/resources/implementation/policies/CalculatorJass.config
[INFO] Exclude: tuscany-sca-2.0-SNAPSHOT-src/modules/binding-ws-runtime-axis2/src/main/resources/org/apache/tuscany/sca/binding/ws/axis2/engine/repository/modules/modules.list
[INFO] Exclude: tuscany-sca-2.0-SNAPSHOT-src/modules/binding-ws-runtime-axis2/src/main/resources/org/apache/tuscany/sca/binding/ws/axis2/engine/repository/services/services.list
[INFO] Exclude: tuscany-sca-2.0-SNAPSHOT-src/modules/implementation-spring-tie/src/main/resources/META-INF/spring.handlers
[INFO] Exclude: tuscany-sca-2.0-SNAPSHOT-src/modules/implementation-spring-tie/src/main/resources/META-INF/spring.schemas
[INFO] Exclude: tuscany-sca-2.0-SNAPSHOT-src/modules/implementation-spring-runtime/src/main/resources/META-INF/spring.handlers
[INFO] Exclude: tuscany-sca-2.0-SNAPSHOT-src/modules/implementation-spring-runtime/src/main/resources/META-INF/spring.schemas
[INFO] Exclude: tuscany-sca-2.0-SNAPSHOT-src/maven/archetypes/binding/src/test/resources/projects/basic/goal.txt
[INFO] Exclude: tuscany-sca-2.0-SNAPSHOT-src/maven/archetypes/implementation/src/test/resources/projects/basic/goal.txt
[INFO] Exclude: tuscany-sca-2.0-SNAPSHOT-src/modules/implementation-python-runtime/src/main/resources/django/__init__.py
[INFO] Exclude: tuscany-sca-2.0-SNAPSHOT-src/modules/implementation-python-runtime/src/main/resources/django/utils/__init__.py
[INFO] Exclude: tuscany-sca-2.0-SNAPSHOT-src/modules/assembly-xsd/**/*.*
[INFO] Exclude: tuscany-sca-2.0-SNAPSHOT-src/modules/sca-api/**/*.*
[INFO] Exclude: tuscany-sca-2.0-SNAPSHOT-src/modules/implementation-web-runtime/src/main/resources/META-INF/sca.tld
[INFO] Exclude: tuscany-sca-2.0-SNAPSHOT-src/modules/assembly-xml/src/main/resources/META-INF/sca-policy-1.1-intents-definitions-cd04.xml
[INFO] Exclude: tuscany-sca-2.0-SNAPSHOT-src/modules/sca-client-impl/src/main/java/org/apache/tuscany/sca/client/impl/SCAClientFactoryFinderImpl.java
[INFO] Exclude: tuscany-sca-2.0-SNAPSHOT-src/modules/binding-comet-runtime/src/main/resources/jquery.guid.js
[INFO] Exclude: tuscany-sca-2.0-SNAPSHOT-src/modules/binding-comet-runtime/src/main/resources/jquery.json-2.2.min.js
[INFO] Exclude: tuscany-sca-2.0-SNAPSHOT-src/modules/implementation-python-runtime/src/main/resources/django/utils/simplejson/*
[INFO] Exclude: tuscany-sca-2.0-SNAPSHOT-src/testing/compliance-tests/binding-jms/src/test/resources/tuscany-oasis-sca-tests-errors.properties
[JENKINS] Archiving disabled - not archiving <https://builds.apache.org/job/Tuscany-2x/ws/sca-2x/testing/itest/distribution/src-distro-rat/pom.xml>
[JENKINS] Archiving disabled - not archiving <https://builds.apache.org/job/Tuscany-2x/ws/sca-2x/testing/itest/distribution/src-distro-rat/target/itest-distribution-src-dsitro-rat-2.0-SNAPSHOT.jar>
[INFO] ------------------------------------------------------------------------
[ERROR] BUILD FAILURE
[INFO] ------------------------------------------------------------------------
[INFO] Too many unapproved licenses: 7
[INFO] ------------------------------------------------------------------------
[INFO] For more information, run Maven with the -e switch
[INFO] ------------------------------------------------------------------------
[INFO] Total time: 43 minutes 40 seconds
[INFO] Finished at: Sat Jan 21 01:14:20 UTC 2012
[INFO] Final Memory: 157M/717M
[INFO] ------------------------------------------------------------------------
Waiting for Jenkins to finish collecting data
channel stopped
2012-01-21 01:14:28.525:INFO::Shutdown hook executing
2012-01-21 01:14:28.526:INFO::Shutdown hook complete