You are viewing a plain text version of this content. The canonical link for it is here.
Posted to builds@beam.apache.org by Apache Jenkins Server <je...@builds.apache.org> on 2021/07/15 19:40:59 UTC
Build failed in Jenkins: beam_PostCommit_Python36 #4114
See <https://ci-beam.apache.org/job/beam_PostCommit_Python36/4114/display/redirect>
Changes:
------------------------------------------
[...truncated 48.16 MB...]
Tests that the TestStream can independently control output watermarks. ... SKIP: The "TestDataflowRunner", does not support the TestStream transform. Supported runners: ['DirectRunner', 'SwitchingDirectRunner']
test_deidentification (apache_beam.ml.gcp.cloud_dlp_it_test.CloudDLPIT) ... ok
test_inspection (apache_beam.ml.gcp.cloud_dlp_it_test.CloudDLPIT) ... ok
test_text_detection_with_language_hint (apache_beam.ml.gcp.visionml_test_it.VisionMlTestIT) ... ok
test_job_python_from_python_it (apache_beam.transforms.external_it_test.ExternalTransformIT) ... ok
test_file_loads (apache_beam.io.gcp.bigquery_test.PubSubBigQueryIT) ... ok
test_streaming_inserts (apache_beam.io.gcp.bigquery_test.PubSubBigQueryIT) ... ok
test_metrics_fnapi_it (apache_beam.runners.dataflow.dataflow_exercise_metrics_pipeline_test.ExerciseMetricsPipelineTest) ... ok
test_metrics_it (apache_beam.runners.dataflow.dataflow_exercise_metrics_pipeline_test.ExerciseMetricsPipelineTest) ... ok
test_big_query_write (apache_beam.io.gcp.bigquery_write_it_test.BigQueryWriteIntegrationTests) ... ok
test_big_query_write_new_types (apache_beam.io.gcp.bigquery_write_it_test.BigQueryWriteIntegrationTests) ... ok
test_big_query_write_schema_autodetect (apache_beam.io.gcp.bigquery_write_it_test.BigQueryWriteIntegrationTests) ... SKIP: DataflowRunner does not support schema autodetection
Test that schema update options are respected when appending to an existing ... ok
test_big_query_write_without_schema (apache_beam.io.gcp.bigquery_write_it_test.BigQueryWriteIntegrationTests) ... ok
test_create_catalog_item (apache_beam.ml.gcp.recommendations_ai_test_it.RecommendationAIIT) ... ok
test_create_user_event (apache_beam.ml.gcp.recommendations_ai_test_it.RecommendationAIIT) ... ok
test_predict (apache_beam.ml.gcp.recommendations_ai_test_it.RecommendationAIIT) ... ok
======================================================================
ERROR: test_label_detection_with_video_context (apache_beam.ml.gcp.videointelligenceml_test_it.VideoIntelligenceMlTestIT)
----------------------------------------------------------------------
Traceback (most recent call last):
File "<https://ci-beam.apache.org/job/beam_PostCommit_Python36/ws/src/sdks/python/apache_beam/ml/gcp/videointelligenceml_test_it.py",> line 71, in test_label_detection_with_video_context
output, matches_all([hc.has_item(hc.contains_string('bicycle'))]))
File "<https://ci-beam.apache.org/job/beam_PostCommit_Python36/ws/src/sdks/python/apache_beam/pipeline.py",> line 585, in __exit__
self.result = self.run()
File "<https://ci-beam.apache.org/job/beam_PostCommit_Python36/ws/src/sdks/python/apache_beam/testing/test_pipeline.py",> line 114, in run
False if self.not_use_test_runner_api else test_runner_api))
File "<https://ci-beam.apache.org/job/beam_PostCommit_Python36/ws/src/sdks/python/apache_beam/pipeline.py",> line 540, in run
self._options).run(False)
File "<https://ci-beam.apache.org/job/beam_PostCommit_Python36/ws/src/sdks/python/apache_beam/pipeline.py",> line 564, in run
return self.runner.run_pipeline(self, self._options)
File "<https://ci-beam.apache.org/job/beam_PostCommit_Python36/ws/src/sdks/python/apache_beam/runners/dataflow/test_dataflow_runner.py",> line 54, in run_pipeline
self).run_pipeline(pipeline, options)
File "<https://ci-beam.apache.org/job/beam_PostCommit_Python36/ws/src/sdks/python/apache_beam/runners/dataflow/dataflow_runner.py",> line 588, in run_pipeline
self.dataflow_client.create_job(self.job), self)
File "<https://ci-beam.apache.org/job/beam_PostCommit_Python36/ws/src/sdks/python/apache_beam/utils/retry.py",> line 253, in wrapper
return fun(*args, **kwargs)
File "<https://ci-beam.apache.org/job/beam_PostCommit_Python36/ws/src/sdks/python/apache_beam/runners/dataflow/internal/apiclient.py",> line 657, in create_job
self.create_job_description(job)
File "<https://ci-beam.apache.org/job/beam_PostCommit_Python36/ws/src/sdks/python/apache_beam/runners/dataflow/internal/apiclient.py",> line 747, in create_job_description
resources = self._stage_resources(job.proto_pipeline, job.options)
File "<https://ci-beam.apache.org/job/beam_PostCommit_Python36/ws/src/sdks/python/apache_beam/runners/dataflow/internal/apiclient.py",> line 610, in _stage_resources
resources, staging_location=google_cloud_options.staging_location)
File "<https://ci-beam.apache.org/job/beam_PostCommit_Python36/ws/src/sdks/python/apache_beam/runners/portability/stager.py",> line 383, in stage_job_resources
file_path, FileSystems.join(staging_location, staged_path))
File "<https://ci-beam.apache.org/job/beam_PostCommit_Python36/ws/src/sdks/python/apache_beam/runners/dataflow/internal/apiclient.py",> line 1018, in stage_artifact
local_path_to_artifact, artifact_name)
File "<https://ci-beam.apache.org/job/beam_PostCommit_Python36/ws/src/sdks/python/apache_beam/utils/retry.py",> line 253, in wrapper
return fun(*args, **kwargs)
File "<https://ci-beam.apache.org/job/beam_PostCommit_Python36/ws/src/sdks/python/apache_beam/runners/dataflow/internal/apiclient.py",> line 559, in _gcs_file_copy
self.stage_file(to_folder, to_name, f, total_size=total_size)
File "<https://ci-beam.apache.org/job/beam_PostCommit_Python36/ws/src/sdks/python/apache_beam/runners/dataflow/internal/apiclient.py",> line 635, in stage_file
response = self._storage_client.objects.Insert(request, upload=upload)
File "<https://ci-beam.apache.org/job/beam_PostCommit_Python36/ws/src/sdks/python/apache_beam/io/gcp/internal/clients/storage/storage_v1_client.py",> line 1154, in Insert
upload=upload, upload_config=upload_config)
File "<https://ci-beam.apache.org/job/beam_PostCommit_Python36/ws/src/build/gradleenv/-1734967053/lib/python3.6/site-packages/apitools/base/py/base_api.py",> line 715, in _RunMethod
http_request, client=self.client)
File "<https://ci-beam.apache.org/job/beam_PostCommit_Python36/ws/src/build/gradleenv/-1734967053/lib/python3.6/site-packages/apitools/base/py/transfer.py",> line 908, in InitializeUpload
return self.StreamInChunks()
File "<https://ci-beam.apache.org/job/beam_PostCommit_Python36/ws/src/build/gradleenv/-1734967053/lib/python3.6/site-packages/apitools/base/py/transfer.py",> line 1020, in StreamInChunks
additional_headers=additional_headers)
File "<https://ci-beam.apache.org/job/beam_PostCommit_Python36/ws/src/build/gradleenv/-1734967053/lib/python3.6/site-packages/apitools/base/py/transfer.py",> line 957, in __StreamMedia
response = send_func(self.stream.tell())
File "<https://ci-beam.apache.org/job/beam_PostCommit_Python36/ws/src/build/gradleenv/-1734967053/lib/python3.6/site-packages/apitools/base/py/transfer.py",> line 943, in CallSendChunk
start, additional_headers=additional_headers)
File "<https://ci-beam.apache.org/job/beam_PostCommit_Python36/ws/src/build/gradleenv/-1734967053/lib/python3.6/site-packages/apitools/base/py/transfer.py",> line 1120, in __SendChunk
return self.__SendMediaRequest(request, end)
File "<https://ci-beam.apache.org/job/beam_PostCommit_Python36/ws/src/build/gradleenv/-1734967053/lib/python3.6/site-packages/apitools/base/py/transfer.py",> line 1033, in __SendMediaRequest
retries=self.num_retries, check_response_func=CheckResponse)
File "<https://ci-beam.apache.org/job/beam_PostCommit_Python36/ws/src/build/gradleenv/-1734967053/lib/python3.6/site-packages/apitools/base/py/http_wrapper.py",> line 350, in MakeRequest
check_response_func=check_response_func)
File "<https://ci-beam.apache.org/job/beam_PostCommit_Python36/ws/src/build/gradleenv/-1734967053/lib/python3.6/site-packages/apitools/base/py/http_wrapper.py",> line 400, in _MakeRequestNoRetry
redirections=redirections, connection_type=connection_type)
File "<https://ci-beam.apache.org/job/beam_PostCommit_Python36/ws/src/build/gradleenv/-1734967053/lib/python3.6/site-packages/oauth2client/transport.py",> line 175, in new_request
redirections, connection_type)
File "<https://ci-beam.apache.org/job/beam_PostCommit_Python36/ws/src/build/gradleenv/-1734967053/lib/python3.6/site-packages/oauth2client/transport.py",> line 282, in request
connection_type=connection_type)
File "<https://ci-beam.apache.org/job/beam_PostCommit_Python36/ws/src/build/gradleenv/-1734967053/lib/python3.6/site-packages/oauth2client/transport.py",> line 175, in new_request
redirections, connection_type)
File "<https://ci-beam.apache.org/job/beam_PostCommit_Python36/ws/src/build/gradleenv/-1734967053/lib/python3.6/site-packages/oauth2client/transport.py",> line 282, in request
connection_type=connection_type)
File "<https://ci-beam.apache.org/job/beam_PostCommit_Python36/ws/src/build/gradleenv/-1734967053/lib/python3.6/site-packages/httplib2/__init__.py",> line 1709, in request
conn, authority, uri, request_uri, method, body, headers, redirections, cachekey,
File "<https://ci-beam.apache.org/job/beam_PostCommit_Python36/ws/src/build/gradleenv/-1734967053/lib/python3.6/site-packages/httplib2/__init__.py",> line 1424, in _request
(response, content) = self._conn_request(conn, request_uri, method, body, headers)
File "<https://ci-beam.apache.org/job/beam_PostCommit_Python36/ws/src/build/gradleenv/-1734967053/lib/python3.6/site-packages/httplib2/__init__.py",> line 1376, in _conn_request
response = conn.getresponse()
File "/usr/lib/python3.6/http/client.py", line 1331, in getresponse
response.begin()
File "/usr/lib/python3.6/http/client.py", line 297, in begin
version, status, reason = self._read_status()
File "/usr/lib/python3.6/http/client.py", line 258, in _read_status
line = str(self.fp.readline(_MAXLINE + 1), "iso-8859-1")
File "/usr/lib/python3.6/socket.py", line 586, in readinto
return self._sock.recv_into(b)
File "/usr/lib/python3.6/ssl.py", line 1012, in recv_into
return self.read(nbytes, buffer)
File "/usr/lib/python3.6/ssl.py", line 874, in read
return self._sslobj.read(len, buffer)
File "/usr/lib/python3.6/ssl.py", line 631, in read
v = self._sslobj.read(len, buffer)
socket.timeout: The read operation timed out
-------------------- >> begin captured logging << --------------------
apache_beam.runners.portability.stager: INFO: Executing command: ['<https://ci-beam.apache.org/job/beam_PostCommit_Python36/ws/src/build/gradleenv/-1734967053/bin/python',> '-m', 'pip', 'download', '--dest', '/tmp/dataflow-requirements-cache', '-r', 'postcommit_requirements.txt', '--exists-action', 'i', '--no-binary', ':all:']
apache_beam.runners.portability.stager: INFO: Copying Beam SDK "<https://ci-beam.apache.org/job/beam_PostCommit_Python36/ws/src/sdks/python/build/apache-beam.tar.gz"> to staging location.
root: WARNING: Make sure that locally built Python SDK docker image has Python 3.6 interpreter.
root: INFO: Default Python SDK image for environment is apache/beam_python3.6_sdk:2.32.0.dev
root: INFO: Using provided Python SDK container image: gcr.io/cloud-dataflow/v1beta3/python36:beam-master-20210702
root: INFO: Python SDK container image set to "gcr.io/cloud-dataflow/v1beta3/python36:beam-master-20210702" for Docker environment
apache_beam.runners.portability.fn_api_runner.translations: INFO: ==================== <function pack_combiners at 0x7f28352d12f0> ====================
apache_beam.runners.portability.fn_api_runner.translations: DEBUG: 25 [1, 1, 1, 1, 1, 1, 1, 1, 1, 1, 1, 1, 1, 1, 1, 1, 1, 1, 1, 1, 1, 1, 1, 1, 1]
apache_beam.runners.portability.fn_api_runner.translations: DEBUG: Stages: ['ref_AppliedPTransform_Create-Impulse_3\n Create/Impulse:beam:transform:impulse:v1\n must follow: \n downstream_side_inputs: <unknown>', 'ref_AppliedPTransform_Create-FlatMap-lambda-at-core-py-2964-_4\n Create/FlatMap(<lambda at core.py:2964>):beam:transform:pardo:v1\n must follow: \n downstream_side_inputs: <unknown>', 'ref_AppliedPTransform_Create-Map-decode-_6\n Create/Map(decode):beam:transform:pardo:v1\n must follow: \n downstream_side_inputs: <unknown>', 'ref_AppliedPTransform_AnnotateVideoWithContext-ParDo-_VideoAnnotateFnWithContext-_8\n AnnotateVideoWithContext/ParDo(_VideoAnnotateFnWithContext):beam:transform:pardo:v1\n must follow: \n downstream_side_inputs: <unknown>', 'ref_AppliedPTransform_ParDo-CallableWrapperDoFn-_9\n ParDo(CallableWrapperDoFn):beam:transform:pardo:v1\n must follow: \n downstream_side_inputs: <unknown>', 'ref_AppliedPTransform_ToList-ToList-KeyWithVoid_12\n ToList/ToList/KeyWithVoid:beam:transform:pardo:v1\n must follow: \n downstream_side_inputs: <unknown>', 'ref_AppliedPTransform_ToList-ToList-CombinePerKey_13\n ToList/ToList/CombinePerKey:beam:transform:combine_per_key:v1\n must follow: \n downstream_side_inputs: <unknown>', 'ref_AppliedPTransform_ToList-ToList-UnKey_16\n ToList/ToList/UnKey:beam:transform:pardo:v1\n must follow: \n downstream_side_inputs: <unknown>', 'ref_AppliedPTransform_ToList-ToList-DoOnce-Impulse_18\n ToList/ToList/DoOnce/Impulse:beam:transform:impulse:v1\n must follow: \n downstream_side_inputs: <unknown>', 'ref_AppliedPTransform_ToList-ToList-DoOnce-FlatMap-lambda-at-core-py-2964-_19\n ToList/ToList/DoOnce/FlatMap(<lambda at core.py:2964>):beam:transform:pardo:v1\n must follow: \n downstream_side_inputs: <unknown>', 'ref_AppliedPTransform_ToList-ToList-DoOnce-Map-decode-_21\n ToList/ToList/DoOnce/Map(decode):beam:transform:pardo:v1\n must follow: \n downstream_side_inputs: <unknown>', 'ref_AppliedPTransform_ToList-ToList-InjectDefault_22\n ToList/ToList/InjectDefault:beam:transform:pardo:v1\n must follow: \n downstream_side_inputs: <unknown>', 'ref_AppliedPTransform_assert_that-Create-Impulse_25\n assert_that/Create/Impulse:beam:transform:impulse:v1\n must follow: \n downstream_side_inputs: <unknown>', 'ref_AppliedPTransform_assert_that-Create-FlatMap-lambda-at-core-py-2964-_26\n assert_that/Create/FlatMap(<lambda at core.py:2964>):beam:transform:pardo:v1\n must follow: \n downstream_side_inputs: <unknown>', 'ref_AppliedPTransform_assert_that-Create-Map-decode-_28\n assert_that/Create/Map(decode):beam:transform:pardo:v1\n must follow: \n downstream_side_inputs: <unknown>', 'ref_AppliedPTransform_assert_that-WindowInto-WindowIntoFn-_29\n assert_that/WindowInto(WindowIntoFn):beam:transform:window_into:v1\n must follow: \n downstream_side_inputs: <unknown>', 'ref_AppliedPTransform_assert_that-ToVoidKey_30\n assert_that/ToVoidKey:beam:transform:pardo:v1\n must follow: \n downstream_side_inputs: <unknown>', 'ref_AppliedPTransform_assert_that-Group-_CoGBKImpl-Tag-0-_33\n assert_that/Group/_CoGBKImpl/Tag[0]:beam:transform:pardo:v1\n must follow: \n downstream_side_inputs: <unknown>', 'ref_AppliedPTransform_assert_that-Group-_CoGBKImpl-Tag-1-_34\n assert_that/Group/_CoGBKImpl/Tag[1]:beam:transform:pardo:v1\n must follow: \n downstream_side_inputs: <unknown>', 'ref_AppliedPTransform_assert_that-Group-_CoGBKImpl-Flatten_35\n assert_that/Group/_CoGBKImpl/Flatten:beam:transform:flatten:v1\n must follow: \n downstream_side_inputs: <unknown>', 'ref_AppliedPTransform_assert_that-Group-_CoGBKImpl-GroupByKey_36\n assert_that/Group/_CoGBKImpl/GroupByKey:beam:transform:group_by_key:v1\n must follow: \n downstream_side_inputs: <unknown>', 'ref_AppliedPTransform_assert_that-Group-_CoGBKImpl-MapTuple-collect_values-_37\n assert_that/Group/_CoGBKImpl/MapTuple(collect_values):beam:transform:pardo:v1\n must follow: \n downstream_side_inputs: <unknown>', 'ref_AppliedPTransform_assert_that-Group-RestoreTags_38\n assert_that/Group/RestoreTags:beam:transform:pardo:v1\n must follow: \n downstream_side_inputs: <unknown>', 'ref_AppliedPTransform_assert_that-Unkey_39\n assert_that/Unkey:beam:transform:pardo:v1\n must follow: \n downstream_side_inputs: <unknown>', 'ref_AppliedPTransform_assert_that-Match_40\n assert_that/Match:beam:transform:pardo:v1\n must follow: \n downstream_side_inputs: <unknown>']
apache_beam.runners.portability.fn_api_runner.translations: INFO: ==================== <function sort_stages at 0x7f28352d1a60> ====================
apache_beam.runners.portability.fn_api_runner.translations: DEBUG: 25 [1, 1, 1, 1, 1, 1, 1, 1, 1, 1, 1, 1, 1, 1, 1, 1, 1, 1, 1, 1, 1, 1, 1, 1, 1]
apache_beam.runners.portability.fn_api_runner.translations: DEBUG: Stages: ['ref_AppliedPTransform_Create-Impulse_3\n Create/Impulse:beam:transform:impulse:v1\n must follow: \n downstream_side_inputs: <unknown>', 'ref_AppliedPTransform_Create-FlatMap-lambda-at-core-py-2964-_4\n Create/FlatMap(<lambda at core.py:2964>):beam:transform:pardo:v1\n must follow: \n downstream_side_inputs: <unknown>', 'ref_AppliedPTransform_Create-Map-decode-_6\n Create/Map(decode):beam:transform:pardo:v1\n must follow: \n downstream_side_inputs: <unknown>', 'ref_AppliedPTransform_AnnotateVideoWithContext-ParDo-_VideoAnnotateFnWithContext-_8\n AnnotateVideoWithContext/ParDo(_VideoAnnotateFnWithContext):beam:transform:pardo:v1\n must follow: \n downstream_side_inputs: <unknown>', 'ref_AppliedPTransform_ParDo-CallableWrapperDoFn-_9\n ParDo(CallableWrapperDoFn):beam:transform:pardo:v1\n must follow: \n downstream_side_inputs: <unknown>', 'ref_AppliedPTransform_ToList-ToList-KeyWithVoid_12\n ToList/ToList/KeyWithVoid:beam:transform:pardo:v1\n must follow: \n downstream_side_inputs: <unknown>', 'ref_AppliedPTransform_ToList-ToList-CombinePerKey_13\n ToList/ToList/CombinePerKey:beam:transform:combine_per_key:v1\n must follow: \n downstream_side_inputs: <unknown>', 'ref_AppliedPTransform_ToList-ToList-UnKey_16\n ToList/ToList/UnKey:beam:transform:pardo:v1\n must follow: \n downstream_side_inputs: <unknown>', 'ref_AppliedPTransform_ToList-ToList-DoOnce-Impulse_18\n ToList/ToList/DoOnce/Impulse:beam:transform:impulse:v1\n must follow: \n downstream_side_inputs: <unknown>', 'ref_AppliedPTransform_ToList-ToList-DoOnce-FlatMap-lambda-at-core-py-2964-_19\n ToList/ToList/DoOnce/FlatMap(<lambda at core.py:2964>):beam:transform:pardo:v1\n must follow: \n downstream_side_inputs: <unknown>', 'ref_AppliedPTransform_ToList-ToList-DoOnce-Map-decode-_21\n ToList/ToList/DoOnce/Map(decode):beam:transform:pardo:v1\n must follow: \n downstream_side_inputs: <unknown>', 'ref_AppliedPTransform_ToList-ToList-InjectDefault_22\n ToList/ToList/InjectDefault:beam:transform:pardo:v1\n must follow: \n downstream_side_inputs: <unknown>', 'ref_AppliedPTransform_assert_that-Create-Impulse_25\n assert_that/Create/Impulse:beam:transform:impulse:v1\n must follow: \n downstream_side_inputs: <unknown>', 'ref_AppliedPTransform_assert_that-Create-FlatMap-lambda-at-core-py-2964-_26\n assert_that/Create/FlatMap(<lambda at core.py:2964>):beam:transform:pardo:v1\n must follow: \n downstream_side_inputs: <unknown>', 'ref_AppliedPTransform_assert_that-Create-Map-decode-_28\n assert_that/Create/Map(decode):beam:transform:pardo:v1\n must follow: \n downstream_side_inputs: <unknown>', 'ref_AppliedPTransform_assert_that-WindowInto-WindowIntoFn-_29\n assert_that/WindowInto(WindowIntoFn):beam:transform:window_into:v1\n must follow: \n downstream_side_inputs: <unknown>', 'ref_AppliedPTransform_assert_that-ToVoidKey_30\n assert_that/ToVoidKey:beam:transform:pardo:v1\n must follow: \n downstream_side_inputs: <unknown>', 'ref_AppliedPTransform_assert_that-Group-_CoGBKImpl-Tag-0-_33\n assert_that/Group/_CoGBKImpl/Tag[0]:beam:transform:pardo:v1\n must follow: \n downstream_side_inputs: <unknown>', 'ref_AppliedPTransform_assert_that-Group-_CoGBKImpl-Tag-1-_34\n assert_that/Group/_CoGBKImpl/Tag[1]:beam:transform:pardo:v1\n must follow: \n downstream_side_inputs: <unknown>', 'ref_AppliedPTransform_assert_that-Group-_CoGBKImpl-Flatten_35\n assert_that/Group/_CoGBKImpl/Flatten:beam:transform:flatten:v1\n must follow: \n downstream_side_inputs: <unknown>', 'ref_AppliedPTransform_assert_that-Group-_CoGBKImpl-GroupByKey_36\n assert_that/Group/_CoGBKImpl/GroupByKey:beam:transform:group_by_key:v1\n must follow: \n downstream_side_inputs: <unknown>', 'ref_AppliedPTransform_assert_that-Group-_CoGBKImpl-MapTuple-collect_values-_37\n assert_that/Group/_CoGBKImpl/MapTuple(collect_values):beam:transform:pardo:v1\n must follow: \n downstream_side_inputs: <unknown>', 'ref_AppliedPTransform_assert_that-Group-RestoreTags_38\n assert_that/Group/RestoreTags:beam:transform:pardo:v1\n must follow: \n downstream_side_inputs: <unknown>', 'ref_AppliedPTransform_assert_that-Unkey_39\n assert_that/Unkey:beam:transform:pardo:v1\n must follow: \n downstream_side_inputs: <unknown>', 'ref_AppliedPTransform_assert_that-Match_40\n assert_that/Match:beam:transform:pardo:v1\n must follow: \n downstream_side_inputs: <unknown>']
apache_beam.runners.dataflow.dataflow_runner: WARNING: Typical end users should not use this worker jar feature. It can only be used when FnAPI is enabled.
apache_beam.runners.dataflow.internal.apiclient: INFO: Starting GCS upload to gs://temp-storage-for-end-to-end-tests/staging-it/beamapp-jenkins-0715191740-296789.1626376660.297258/requirements.txt...
apache_beam.runners.dataflow.internal.apiclient: INFO: Completed GCS upload to gs://temp-storage-for-end-to-end-tests/staging-it/beamapp-jenkins-0715191740-296789.1626376660.297258/requirements.txt in 0 seconds.
apache_beam.runners.dataflow.internal.apiclient: INFO: Starting GCS upload to gs://temp-storage-for-end-to-end-tests/staging-it/beamapp-jenkins-0715191740-296789.1626376660.297258/pbr-5.6.0.tar.gz...
apache_beam.runners.dataflow.internal.apiclient: INFO: Completed GCS upload to gs://temp-storage-for-end-to-end-tests/staging-it/beamapp-jenkins-0715191740-296789.1626376660.297258/pbr-5.6.0.tar.gz in 0 seconds.
apache_beam.runners.dataflow.internal.apiclient: INFO: Starting GCS upload to gs://temp-storage-for-end-to-end-tests/staging-it/beamapp-jenkins-0715191740-296789.1626376660.297258/mock-2.0.0.tar.gz...
apache_beam.runners.dataflow.internal.apiclient: INFO: Completed GCS upload to gs://temp-storage-for-end-to-end-tests/staging-it/beamapp-jenkins-0715191740-296789.1626376660.297258/mock-2.0.0.tar.gz in 0 seconds.
apache_beam.runners.dataflow.internal.apiclient: INFO: Starting GCS upload to gs://temp-storage-for-end-to-end-tests/staging-it/beamapp-jenkins-0715191740-296789.1626376660.297258/six-1.16.0.tar.gz...
apache_beam.runners.dataflow.internal.apiclient: INFO: Completed GCS upload to gs://temp-storage-for-end-to-end-tests/staging-it/beamapp-jenkins-0715191740-296789.1626376660.297258/six-1.16.0.tar.gz in 0 seconds.
apache_beam.runners.dataflow.internal.apiclient: INFO: Starting GCS upload to gs://temp-storage-for-end-to-end-tests/staging-it/beamapp-jenkins-0715191740-296789.1626376660.297258/soupsieve-2.2.1.tar.gz...
apache_beam.runners.dataflow.internal.apiclient: INFO: Completed GCS upload to gs://temp-storage-for-end-to-end-tests/staging-it/beamapp-jenkins-0715191740-296789.1626376660.297258/soupsieve-2.2.1.tar.gz in 0 seconds.
apache_beam.runners.dataflow.internal.apiclient: INFO: Starting GCS upload to gs://temp-storage-for-end-to-end-tests/staging-it/beamapp-jenkins-0715191740-296789.1626376660.297258/PyHamcrest-1.10.1.tar.gz...
apache_beam.runners.dataflow.internal.apiclient: INFO: Completed GCS upload to gs://temp-storage-for-end-to-end-tests/staging-it/beamapp-jenkins-0715191740-296789.1626376660.297258/PyHamcrest-1.10.1.tar.gz in 0 seconds.
apache_beam.runners.dataflow.internal.apiclient: INFO: Starting GCS upload to gs://temp-storage-for-end-to-end-tests/staging-it/beamapp-jenkins-0715191740-296789.1626376660.297258/parameterized-0.7.5.tar.gz...
apache_beam.runners.dataflow.internal.apiclient: INFO: Completed GCS upload to gs://temp-storage-for-end-to-end-tests/staging-it/beamapp-jenkins-0715191740-296789.1626376660.297258/parameterized-0.7.5.tar.gz in 0 seconds.
apache_beam.runners.dataflow.internal.apiclient: INFO: Starting GCS upload to gs://temp-storage-for-end-to-end-tests/staging-it/beamapp-jenkins-0715191740-296789.1626376660.297258/beautifulsoup4-4.9.3.tar.gz...
apache_beam.runners.dataflow.internal.apiclient: INFO: Completed GCS upload to gs://temp-storage-for-end-to-end-tests/staging-it/beamapp-jenkins-0715191740-296789.1626376660.297258/beautifulsoup4-4.9.3.tar.gz in 0 seconds.
apache_beam.runners.dataflow.internal.apiclient: INFO: Starting GCS upload to gs://temp-storage-for-end-to-end-tests/staging-it/beamapp-jenkins-0715191740-296789.1626376660.297258/dataflow_python_sdk.tar...
apache_beam.runners.dataflow.internal.apiclient: INFO: Completed GCS upload to gs://temp-storage-for-end-to-end-tests/staging-it/beamapp-jenkins-0715191740-296789.1626376660.297258/dataflow_python_sdk.tar in 0 seconds.
apache_beam.runners.dataflow.internal.apiclient: INFO: Starting GCS upload to gs://temp-storage-for-end-to-end-tests/staging-it/beamapp-jenkins-0715191740-296789.1626376660.297258/dataflow-worker.jar...
root: DEBUG: Caught socket error, retrying: The read operation timed out
root: DEBUG: Retrying request to url https://www.googleapis.com/resumable/upload/storage/v1/b/temp-storage-for-end-to-end-tests/o?alt=json&name=staging-it%2Fbeamapp-jenkins-0715191740-296789.1626376660.297258%2Fdataflow-worker.jar&uploadType=resumable&upload_id=ADPycdtySU2bYithEyZNnakTCEKsLIGc4_8nSmnSYdH2ntdardbI_lOZwA22DDSZD9cRHtepwk7-um8N7WZJeBnb7p4 after exception The read operation timed out
root: DEBUG: Caught socket error, retrying: The read operation timed out
root: DEBUG: Retrying request to url https://www.googleapis.com/resumable/upload/storage/v1/b/temp-storage-for-end-to-end-tests/o?alt=json&name=staging-it%2Fbeamapp-jenkins-0715191740-296789.1626376660.297258%2Fdataflow-worker.jar&uploadType=resumable&upload_id=ADPycdtySU2bYithEyZNnakTCEKsLIGc4_8nSmnSYdH2ntdardbI_lOZwA22DDSZD9cRHtepwk7-um8N7WZJeBnb7p4 after exception The read operation timed out
root: DEBUG: Caught socket error, retrying: The read operation timed out
root: DEBUG: Retrying request to url https://www.googleapis.com/resumable/upload/storage/v1/b/temp-storage-for-end-to-end-tests/o?alt=json&name=staging-it%2Fbeamapp-jenkins-0715191740-296789.1626376660.297258%2Fdataflow-worker.jar&uploadType=resumable&upload_id=ADPycdtySU2bYithEyZNnakTCEKsLIGc4_8nSmnSYdH2ntdardbI_lOZwA22DDSZD9cRHtepwk7-um8N7WZJeBnb7p4 after exception The read operation timed out
root: DEBUG: Caught socket error, retrying: The read operation timed out
root: DEBUG: Retrying request to url https://www.googleapis.com/resumable/upload/storage/v1/b/temp-storage-for-end-to-end-tests/o?alt=json&name=staging-it%2Fbeamapp-jenkins-0715191740-296789.1626376660.297258%2Fdataflow-worker.jar&uploadType=resumable&upload_id=ADPycdtySU2bYithEyZNnakTCEKsLIGc4_8nSmnSYdH2ntdardbI_lOZwA22DDSZD9cRHtepwk7-um8N7WZJeBnb7p4 after exception The read operation timed out
--------------------- >> end captured logging << ---------------------
Worker logs: https://console.cloud.google.com/dataflow/jobs/us-central1/2021-07-15_11_04_28-10487945926076612447?project=apache-beam-testing
Worker logs: https://console.cloud.google.com/dataflow/jobs/us-central1/2021-07-15_11_20_20-3297461583899413205?project=apache-beam-testing
Worker logs: https://console.cloud.google.com/dataflow/jobs/us-central1/2021-07-15_11_30_43-15334362288056041490?project=apache-beam-testing
Worker logs: https://console.cloud.google.com/dataflow/jobs/us-central1/2021-07-15_11_41_23-6431832925112615493?project=apache-beam-testing
Worker logs: https://console.cloud.google.com/dataflow/jobs/us-central1/2021-07-15_11_50_44-11299297431163704483?project=apache-beam-testing
Worker logs: https://console.cloud.google.com/dataflow/jobs/us-central1/2021-07-15_12_00_37-2773232483333201179?project=apache-beam-testing
Worker logs: https://console.cloud.google.com/dataflow/jobs/us-central1/2021-07-15_12_08_11-842314122493231924?project=apache-beam-testing
Worker logs: https://console.cloud.google.com/dataflow/jobs/us-central1/2021-07-15_12_23_29-15543489416373167683?project=apache-beam-testing
Worker logs: https://console.cloud.google.com/dataflow/jobs/us-central1/2021-07-15_11_04_27-11916858504646143647?project=apache-beam-testing
Worker logs: https://console.cloud.google.com/dataflow/jobs/us-central1/2021-07-15_11_26_23-4786694056212038234?project=apache-beam-testing
Worker logs: https://console.cloud.google.com/dataflow/jobs/us-central1/2021-07-15_11_34_51-10751677783304480628?project=apache-beam-testing
Worker logs: https://console.cloud.google.com/dataflow/jobs/us-central1/2021-07-15_11_43_44-14461442907629019441?project=apache-beam-testing
Worker logs: https://console.cloud.google.com/dataflow/jobs/us-central1/2021-07-15_11_55_56-14327555425393132578?project=apache-beam-testing
Worker logs: https://console.cloud.google.com/dataflow/jobs/us-central1/2021-07-15_12_05_41-4688993994221314832?project=apache-beam-testing
Worker logs: https://console.cloud.google.com/dataflow/jobs/us-central1/2021-07-15_12_15_15-2562340262644377646?project=apache-beam-testing
Worker logs: https://console.cloud.google.com/dataflow/jobs/us-central1/2021-07-15_12_23_58-16933218118129249011?project=apache-beam-testing
Worker logs: https://console.cloud.google.com/dataflow/jobs/us-central1/2021-07-15_12_32_25-2483731889795312117?project=apache-beam-testing
Worker logs: https://console.cloud.google.com/dataflow/jobs/us-central1/2021-07-15_11_04_25-11007760511048055041?project=apache-beam-testing
Worker logs: https://console.cloud.google.com/dataflow/jobs/us-central1/2021-07-15_11_17_34-5755485574182848701?project=apache-beam-testing
Worker logs: https://console.cloud.google.com/dataflow/jobs/us-central1/2021-07-15_11_26_36-16987184284521149363?project=apache-beam-testing
Worker logs: https://console.cloud.google.com/dataflow/jobs/us-central1/2021-07-15_11_36_13-12199801945362073367?project=apache-beam-testing
Worker logs: https://console.cloud.google.com/dataflow/jobs/us-central1/2021-07-15_11_46_49-16471195143033999098?project=apache-beam-testing
Worker logs: https://console.cloud.google.com/dataflow/jobs/us-central1/2021-07-15_11_56_34-1940353389952527585?project=apache-beam-testing
Worker logs: https://console.cloud.google.com/dataflow/jobs/us-central1/2021-07-15_12_05_47-8728769582951537722?project=apache-beam-testing
Worker logs: https://console.cloud.google.com/dataflow/jobs/us-central1/2021-07-15_12_15_32-12273346363998888319?project=apache-beam-testing
Worker logs: https://console.cloud.google.com/dataflow/jobs/us-central1/2021-07-15_11_04_19-521655943923424222?project=apache-beam-testing
Worker logs: https://console.cloud.google.com/dataflow/jobs/us-central1/2021-07-15_11_25_47-14701861360107626079?project=apache-beam-testing
Worker logs: https://console.cloud.google.com/dataflow/jobs/us-central1/2021-07-15_11_33_40-7172859066650164872?project=apache-beam-testing
Worker logs: https://console.cloud.google.com/dataflow/jobs/us-central1/2021-07-15_11_41_31-13225209241138783075?project=apache-beam-testing
Worker logs: https://console.cloud.google.com/dataflow/jobs/us-central1/2021-07-15_11_50_35-17899304629808488770?project=apache-beam-testing
Worker logs: https://console.cloud.google.com/dataflow/jobs/us-central1/2021-07-15_11_59_44-8957883814643445213?project=apache-beam-testing
Worker logs: https://console.cloud.google.com/dataflow/jobs/us-central1/2021-07-15_12_16_49-17004601371504916112?project=apache-beam-testing
Worker logs: https://console.cloud.google.com/dataflow/jobs/us-central1/2021-07-15_11_11_20-9741758641149691838?project=apache-beam-testing
Worker logs: https://console.cloud.google.com/dataflow/jobs/us-central1/2021-07-15_11_21_33-10886010832433799644?project=apache-beam-testing
Worker logs: https://console.cloud.google.com/dataflow/jobs/us-central1/2021-07-15_11_30_59-12046145358718175570?project=apache-beam-testing
Worker logs: https://console.cloud.google.com/dataflow/jobs/us-central1/2021-07-15_11_40_50-12153059522314463717?project=apache-beam-testing
Worker logs: https://console.cloud.google.com/dataflow/jobs/us-central1/2021-07-15_11_49_45-94591555618130204?project=apache-beam-testing
Worker logs: https://console.cloud.google.com/dataflow/jobs/us-central1/2021-07-15_11_59_44-13748353742658831500?project=apache-beam-testing
Worker logs: https://console.cloud.google.com/dataflow/jobs/us-central1/2021-07-15_12_08_48-13960018573613646020?project=apache-beam-testing
Worker logs: https://console.cloud.google.com/dataflow/jobs/us-central1/2021-07-15_12_18_03-16844903636017012728?project=apache-beam-testing
Worker logs: https://console.cloud.google.com/dataflow/jobs/us-central1/2021-07-15_12_28_33-9306188362002156273?project=apache-beam-testing
Worker logs: https://console.cloud.google.com/dataflow/jobs/us-central1/2021-07-15_11_04_23-16003418655749911946?project=apache-beam-testing
Worker logs: https://console.cloud.google.com/dataflow/jobs/us-central1/2021-07-15_11_14_28-17141479644691716980?project=apache-beam-testing
Worker logs: https://console.cloud.google.com/dataflow/jobs/us-central1/2021-07-15_11_31_37-1152887419541246712?project=apache-beam-testing
Worker logs: https://console.cloud.google.com/dataflow/jobs/us-central1/2021-07-15_12_00_21-15579647912512863536?project=apache-beam-testing
Worker logs: https://console.cloud.google.com/dataflow/jobs/us-central1/2021-07-15_12_10_17-11569858728547520439?project=apache-beam-testing
Worker logs: https://console.cloud.google.com/dataflow/jobs/us-central1/2021-07-15_12_19_07-5030623274186918373?project=apache-beam-testing
Worker logs: https://console.cloud.google.com/dataflow/jobs/us-central1/2021-07-15_11_04_24-16292506266159887741?project=apache-beam-testing
Worker logs: https://console.cloud.google.com/dataflow/jobs/us-central1/2021-07-15_11_13_57-13065526705238741095?project=apache-beam-testing
Worker logs: https://console.cloud.google.com/dataflow/jobs/us-central1/2021-07-15_11_22_38-4447973096457317501?project=apache-beam-testing
Worker logs: https://console.cloud.google.com/dataflow/jobs/us-central1/2021-07-15_11_30_53-9534956135303769067?project=apache-beam-testing
Worker logs: https://console.cloud.google.com/dataflow/jobs/us-central1/2021-07-15_11_39_31-11235422984297566819?project=apache-beam-testing
Worker logs: https://console.cloud.google.com/dataflow/jobs/us-central1/2021-07-15_11_51_04-11554203190555416087?project=apache-beam-testing
Worker logs: https://console.cloud.google.com/dataflow/jobs/us-central1/2021-07-15_12_00_38-11735735550965263417?project=apache-beam-testing
Worker logs: https://console.cloud.google.com/dataflow/jobs/us-central1/2021-07-15_12_09_22-4858749372953312923?project=apache-beam-testing
Worker logs: https://console.cloud.google.com/dataflow/jobs/us-central1/2021-07-15_12_17_42-8740733205639390811?project=apache-beam-testing
Worker logs: https://console.cloud.google.com/dataflow/jobs/us-central1/2021-07-15_11_04_22-7237740487216651424?project=apache-beam-testing
Worker logs: https://console.cloud.google.com/dataflow/jobs/us-central1/2021-07-15_11_15_42-12597459461775722289?project=apache-beam-testing
Worker logs: https://console.cloud.google.com/dataflow/jobs/us-central1/2021-07-15_11_25_47-85103762957127545?project=apache-beam-testing
Worker logs: https://console.cloud.google.com/dataflow/jobs/us-central1/2021-07-15_11_36_27-13587145312180966122?project=apache-beam-testing
Worker logs: https://console.cloud.google.com/dataflow/jobs/us-central1/2021-07-15_11_45_53-1546329151937938040?project=apache-beam-testing
Worker logs: https://console.cloud.google.com/dataflow/jobs/us-central1/2021-07-15_11_54_16-16276905821702361654?project=apache-beam-testing
Worker logs: https://console.cloud.google.com/dataflow/jobs/us-central1/2021-07-15_12_03_10-2683884823753616928?project=apache-beam-testing
Worker logs: https://console.cloud.google.com/dataflow/jobs/us-central1/2021-07-15_12_11_59-1065743286261109487?project=apache-beam-testing
Worker logs: https://console.cloud.google.com/dataflow/jobs/us-central1/2021-07-15_12_20_42-7354799678989409892?project=apache-beam-testing
Worker logs: https://console.cloud.google.com/dataflow/jobs/us-central1/2021-07-15_12_28_49-10900094356222555292?project=apache-beam-testing
----------------------------------------------------------------------
XML: nosetests-postCommitIT-df-py36.xml
----------------------------------------------------------------------
XML: <https://ci-beam.apache.org/job/beam_PostCommit_Python36/ws/src/sdks/python/nosetests.xml>
----------------------------------------------------------------------
Ran 74 tests in 5822.712s
FAILED (SKIP=8, errors=1)
> Task :sdks:python:test-suites:dataflow:py36:postCommitIT FAILED
FAILURE: Build failed with an exception.
* Where:
Script '<https://ci-beam.apache.org/job/beam_PostCommit_Python36/ws/src/sdks/python/test-suites/dataflow/common.gradle'> line: 126
* What went wrong:
Execution failed for task ':sdks:python:test-suites:dataflow:py36:postCommitIT'.
> Process 'command 'sh'' finished with non-zero exit value 1
* Try:
Run with --stacktrace option to get the stack trace. Run with --info or --debug option to get more log output. Run with --scan to get full insights.
* Get more help at https://help.gradle.org
Deprecated Gradle features were used in this build, making it incompatible with Gradle 7.0.
Use '--warning-mode all' to show the individual deprecation warnings.
See https://docs.gradle.org/6.8.3/userguide/command_line_interface.html#sec:command_line_warnings
BUILD FAILED in 1h 40m 29s
216 actionable tasks: 153 executed, 59 from cache, 4 up-to-date
Publishing build scan...
https://gradle.com/s/tfvagy4nhbohq
Build step 'Invoke Gradle script' changed build result to FAILURE
Build step 'Invoke Gradle script' marked build as failure
---------------------------------------------------------------------
To unsubscribe, e-mail: builds-unsubscribe@beam.apache.org
For additional commands, e-mail: builds-help@beam.apache.org
Jenkins build is back to normal : beam_PostCommit_Python36 #4115
Posted by Apache Jenkins Server <je...@builds.apache.org>.
See <https://ci-beam.apache.org/job/beam_PostCommit_Python36/4115/display/redirect?page=changes>
---------------------------------------------------------------------
To unsubscribe, e-mail: builds-unsubscribe@beam.apache.org
For additional commands, e-mail: builds-help@beam.apache.org