You are viewing a plain text version of this content. The canonical link for it is here.
Posted to dev@lucene.apache.org by Policeman Jenkins Server <je...@thetaphi.de> on 2016/02/28 02:26:56 UTC

[JENKINS] Lucene-Solr-5.5-Windows (32bit/jdk1.8.0_72) - Build # 35 - Failure!

Build: http://jenkins.thetaphi.de/job/Lucene-Solr-5.5-Windows/35/
Java: 32bit/jdk1.8.0_72 -server -XX:+UseConcMarkSweepGC

3 tests failed.
FAILED:  org.apache.solr.cloud.TestAuthenticationFramework.testBasics

Error Message:
Should've returned a 401 error

Stack Trace:
java.lang.AssertionError: Should've returned a 401 error
	at __randomizedtesting.SeedInfo.seed([E47929A367D31986:D9A1878F5F3D47F6]:0)
	at org.junit.Assert.fail(Assert.java:93)
	at org.apache.solr.cloud.TestAuthenticationFramework.testBasics(TestAuthenticationFramework.java:103)
	at sun.reflect.NativeMethodAccessorImpl.invoke0(Native Method)
	at sun.reflect.NativeMethodAccessorImpl.invoke(NativeMethodAccessorImpl.java:62)
	at sun.reflect.DelegatingMethodAccessorImpl.invoke(DelegatingMethodAccessorImpl.java:43)
	at java.lang.reflect.Method.invoke(Method.java:498)
	at com.carrotsearch.randomizedtesting.RandomizedRunner.invoke(RandomizedRunner.java:1764)
	at com.carrotsearch.randomizedtesting.RandomizedRunner$8.evaluate(RandomizedRunner.java:871)
	at com.carrotsearch.randomizedtesting.RandomizedRunner$9.evaluate(RandomizedRunner.java:907)
	at com.carrotsearch.randomizedtesting.RandomizedRunner$10.evaluate(RandomizedRunner.java:921)
	at com.carrotsearch.randomizedtesting.rules.SystemPropertiesRestoreRule$1.evaluate(SystemPropertiesRestoreRule.java:57)
	at org.apache.lucene.util.TestRuleSetupTeardownChained$1.evaluate(TestRuleSetupTeardownChained.java:49)
	at org.apache.lucene.util.AbstractBeforeAfterRule$1.evaluate(AbstractBeforeAfterRule.java:45)
	at org.apache.lucene.util.TestRuleThreadAndTestName$1.evaluate(TestRuleThreadAndTestName.java:48)
	at org.apache.lucene.util.TestRuleIgnoreAfterMaxFailures$1.evaluate(TestRuleIgnoreAfterMaxFailures.java:64)
	at org.apache.lucene.util.TestRuleMarkFailure$1.evaluate(TestRuleMarkFailure.java:47)
	at com.carrotsearch.randomizedtesting.rules.StatementAdapter.evaluate(StatementAdapter.java:36)
	at com.carrotsearch.randomizedtesting.ThreadLeakControl$StatementRunner.run(ThreadLeakControl.java:367)
	at com.carrotsearch.randomizedtesting.ThreadLeakControl.forkTimeoutingTask(ThreadLeakControl.java:809)
	at com.carrotsearch.randomizedtesting.ThreadLeakControl$3.evaluate(ThreadLeakControl.java:460)
	at com.carrotsearch.randomizedtesting.RandomizedRunner.runSingleTest(RandomizedRunner.java:880)
	at com.carrotsearch.randomizedtesting.RandomizedRunner$5.evaluate(RandomizedRunner.java:781)
	at com.carrotsearch.randomizedtesting.RandomizedRunner$6.evaluate(RandomizedRunner.java:816)
	at com.carrotsearch.randomizedtesting.RandomizedRunner$7.evaluate(RandomizedRunner.java:827)
	at com.carrotsearch.randomizedtesting.rules.StatementAdapter.evaluate(StatementAdapter.java:36)
	at com.carrotsearch.randomizedtesting.rules.SystemPropertiesRestoreRule$1.evaluate(SystemPropertiesRestoreRule.java:57)
	at org.apache.lucene.util.AbstractBeforeAfterRule$1.evaluate(AbstractBeforeAfterRule.java:45)
	at com.carrotsearch.randomizedtesting.rules.StatementAdapter.evaluate(StatementAdapter.java:36)
	at org.apache.lucene.util.TestRuleStoreClassName$1.evaluate(TestRuleStoreClassName.java:41)
	at com.carrotsearch.randomizedtesting.rules.NoShadowingOrOverridesOnMethodsRule$1.evaluate(NoShadowingOrOverridesOnMethodsRule.java:40)
	at com.carrotsearch.randomizedtesting.rules.NoShadowingOrOverridesOnMethodsRule$1.evaluate(NoShadowingOrOverridesOnMethodsRule.java:40)
	at com.carrotsearch.randomizedtesting.rules.StatementAdapter.evaluate(StatementAdapter.java:36)
	at com.carrotsearch.randomizedtesting.rules.StatementAdapter.evaluate(StatementAdapter.java:36)
	at com.carrotsearch.randomizedtesting.rules.StatementAdapter.evaluate(StatementAdapter.java:36)
	at org.apache.lucene.util.TestRuleAssertionsRequired$1.evaluate(TestRuleAssertionsRequired.java:53)
	at org.apache.lucene.util.TestRuleMarkFailure$1.evaluate(TestRuleMarkFailure.java:47)
	at org.apache.lucene.util.TestRuleIgnoreAfterMaxFailures$1.evaluate(TestRuleIgnoreAfterMaxFailures.java:64)
	at org.apache.lucene.util.TestRuleIgnoreTestSuites$1.evaluate(TestRuleIgnoreTestSuites.java:54)
	at com.carrotsearch.randomizedtesting.rules.StatementAdapter.evaluate(StatementAdapter.java:36)
	at com.carrotsearch.randomizedtesting.ThreadLeakControl$StatementRunner.run(ThreadLeakControl.java:367)
	at java.lang.Thread.run(Thread.java:745)


FAILED:  junit.framework.TestSuite.org.apache.solr.cloud.TestAuthenticationFramework

Error Message:
5 threads leaked from SUITE scope at org.apache.solr.cloud.TestAuthenticationFramework:     1) Thread[id=5052, name=SyncThread:0, state=WAITING, group=TGRP-TestAuthenticationFramework]         at sun.misc.Unsafe.park(Native Method)         at java.util.concurrent.locks.LockSupport.park(LockSupport.java:175)         at java.util.concurrent.locks.AbstractQueuedSynchronizer$ConditionObject.await(AbstractQueuedSynchronizer.java:2039)         at java.util.concurrent.LinkedBlockingQueue.take(LinkedBlockingQueue.java:442)         at org.apache.zookeeper.server.SyncRequestProcessor.run(SyncRequestProcessor.java:127)    2) Thread[id=5051, name=SessionTracker, state=TIMED_WAITING, group=TGRP-TestAuthenticationFramework]         at java.lang.Object.wait(Native Method)         at org.apache.zookeeper.server.SessionTrackerImpl.run(SessionTrackerImpl.java:146)    3) Thread[id=5049, name=Thread-1598, state=WAITING, group=TGRP-TestAuthenticationFramework]         at java.lang.Object.wait(Native Method)         at java.lang.Thread.join(Thread.java:1245)         at java.lang.Thread.join(Thread.java:1319)         at org.apache.zookeeper.server.NIOServerCnxnFactory.join(NIOServerCnxnFactory.java:302)         at org.apache.solr.cloud.ZkTestServer$ZKServerMain.runFromConfig(ZkTestServer.java:310)         at org.apache.solr.cloud.ZkTestServer$2.run(ZkTestServer.java:491)    4) Thread[id=5050, name=NIOServerCxn.Factory:0.0.0.0/0.0.0.0:0, state=RUNNABLE, group=TGRP-TestAuthenticationFramework]         at sun.nio.ch.WindowsSelectorImpl$SubSelector.poll0(Native Method)         at sun.nio.ch.WindowsSelectorImpl$SubSelector.poll(WindowsSelectorImpl.java:296)         at sun.nio.ch.WindowsSelectorImpl$SubSelector.access$400(WindowsSelectorImpl.java:278)         at sun.nio.ch.WindowsSelectorImpl.doSelect(WindowsSelectorImpl.java:159)         at sun.nio.ch.SelectorImpl.lockAndDoSelect(SelectorImpl.java:86)         at sun.nio.ch.SelectorImpl.select(SelectorImpl.java:97)         at org.apache.zookeeper.server.NIOServerCnxnFactory.run(NIOServerCnxnFactory.java:178)         at java.lang.Thread.run(Thread.java:745)    5) Thread[id=5053, name=ProcessThread(sid:0 cport:-1):, state=WAITING, group=TGRP-TestAuthenticationFramework]         at sun.misc.Unsafe.park(Native Method)         at java.util.concurrent.locks.LockSupport.park(LockSupport.java:175)         at java.util.concurrent.locks.AbstractQueuedSynchronizer$ConditionObject.await(AbstractQueuedSynchronizer.java:2039)         at java.util.concurrent.LinkedBlockingQueue.take(LinkedBlockingQueue.java:442)         at org.apache.zookeeper.server.PrepRequestProcessor.run(PrepRequestProcessor.java:120)

Stack Trace:
com.carrotsearch.randomizedtesting.ThreadLeakError: 5 threads leaked from SUITE scope at org.apache.solr.cloud.TestAuthenticationFramework: 
   1) Thread[id=5052, name=SyncThread:0, state=WAITING, group=TGRP-TestAuthenticationFramework]
        at sun.misc.Unsafe.park(Native Method)
        at java.util.concurrent.locks.LockSupport.park(LockSupport.java:175)
        at java.util.concurrent.locks.AbstractQueuedSynchronizer$ConditionObject.await(AbstractQueuedSynchronizer.java:2039)
        at java.util.concurrent.LinkedBlockingQueue.take(LinkedBlockingQueue.java:442)
        at org.apache.zookeeper.server.SyncRequestProcessor.run(SyncRequestProcessor.java:127)
   2) Thread[id=5051, name=SessionTracker, state=TIMED_WAITING, group=TGRP-TestAuthenticationFramework]
        at java.lang.Object.wait(Native Method)
        at org.apache.zookeeper.server.SessionTrackerImpl.run(SessionTrackerImpl.java:146)
   3) Thread[id=5049, name=Thread-1598, state=WAITING, group=TGRP-TestAuthenticationFramework]
        at java.lang.Object.wait(Native Method)
        at java.lang.Thread.join(Thread.java:1245)
        at java.lang.Thread.join(Thread.java:1319)
        at org.apache.zookeeper.server.NIOServerCnxnFactory.join(NIOServerCnxnFactory.java:302)
        at org.apache.solr.cloud.ZkTestServer$ZKServerMain.runFromConfig(ZkTestServer.java:310)
        at org.apache.solr.cloud.ZkTestServer$2.run(ZkTestServer.java:491)
   4) Thread[id=5050, name=NIOServerCxn.Factory:0.0.0.0/0.0.0.0:0, state=RUNNABLE, group=TGRP-TestAuthenticationFramework]
        at sun.nio.ch.WindowsSelectorImpl$SubSelector.poll0(Native Method)
        at sun.nio.ch.WindowsSelectorImpl$SubSelector.poll(WindowsSelectorImpl.java:296)
        at sun.nio.ch.WindowsSelectorImpl$SubSelector.access$400(WindowsSelectorImpl.java:278)
        at sun.nio.ch.WindowsSelectorImpl.doSelect(WindowsSelectorImpl.java:159)
        at sun.nio.ch.SelectorImpl.lockAndDoSelect(SelectorImpl.java:86)
        at sun.nio.ch.SelectorImpl.select(SelectorImpl.java:97)
        at org.apache.zookeeper.server.NIOServerCnxnFactory.run(NIOServerCnxnFactory.java:178)
        at java.lang.Thread.run(Thread.java:745)
   5) Thread[id=5053, name=ProcessThread(sid:0 cport:-1):, state=WAITING, group=TGRP-TestAuthenticationFramework]
        at sun.misc.Unsafe.park(Native Method)
        at java.util.concurrent.locks.LockSupport.park(LockSupport.java:175)
        at java.util.concurrent.locks.AbstractQueuedSynchronizer$ConditionObject.await(AbstractQueuedSynchronizer.java:2039)
        at java.util.concurrent.LinkedBlockingQueue.take(LinkedBlockingQueue.java:442)
        at org.apache.zookeeper.server.PrepRequestProcessor.run(PrepRequestProcessor.java:120)
	at __randomizedtesting.SeedInfo.seed([E47929A367D31986]:0)


FAILED:  junit.framework.TestSuite.org.apache.solr.cloud.TestAuthenticationFramework

Error Message:
There are still zombie threads that couldn't be terminated:    1) Thread[id=5050, name=NIOServerCxn.Factory:0.0.0.0/0.0.0.0:0, state=RUNNABLE, group=TGRP-TestAuthenticationFramework]         at sun.nio.ch.WindowsSelectorImpl.setWakeupSocket0(Native Method)         at sun.nio.ch.WindowsSelectorImpl.setWakeupSocket(WindowsSelectorImpl.java:464)         at sun.nio.ch.WindowsSelectorImpl.wakeup(WindowsSelectorImpl.java:606)         at java.nio.channels.spi.AbstractSelector$1.interrupt(AbstractSelector.java:213)         at java.nio.channels.spi.AbstractSelector.begin(AbstractSelector.java:219)         at sun.nio.ch.WindowsSelectorImpl.doSelect(WindowsSelectorImpl.java:157)         at sun.nio.ch.SelectorImpl.lockAndDoSelect(SelectorImpl.java:86)         at sun.nio.ch.SelectorImpl.select(SelectorImpl.java:97)         at org.apache.zookeeper.server.NIOServerCnxnFactory.run(NIOServerCnxnFactory.java:178)         at java.lang.Thread.run(Thread.java:745)

Stack Trace:
com.carrotsearch.randomizedtesting.ThreadLeakError: There are still zombie threads that couldn't be terminated:
   1) Thread[id=5050, name=NIOServerCxn.Factory:0.0.0.0/0.0.0.0:0, state=RUNNABLE, group=TGRP-TestAuthenticationFramework]
        at sun.nio.ch.WindowsSelectorImpl.setWakeupSocket0(Native Method)
        at sun.nio.ch.WindowsSelectorImpl.setWakeupSocket(WindowsSelectorImpl.java:464)
        at sun.nio.ch.WindowsSelectorImpl.wakeup(WindowsSelectorImpl.java:606)
        at java.nio.channels.spi.AbstractSelector$1.interrupt(AbstractSelector.java:213)
        at java.nio.channels.spi.AbstractSelector.begin(AbstractSelector.java:219)
        at sun.nio.ch.WindowsSelectorImpl.doSelect(WindowsSelectorImpl.java:157)
        at sun.nio.ch.SelectorImpl.lockAndDoSelect(SelectorImpl.java:86)
        at sun.nio.ch.SelectorImpl.select(SelectorImpl.java:97)
        at org.apache.zookeeper.server.NIOServerCnxnFactory.run(NIOServerCnxnFactory.java:178)
        at java.lang.Thread.run(Thread.java:745)
	at __randomizedtesting.SeedInfo.seed([E47929A367D31986]:0)




Build Log:
[...truncated 1578 lines...]
   [junit4] JVM J1: stdout was not empty, see: C:\Users\JenkinsSlave\workspace\Lucene-Solr-5.5-Windows\lucene\build\core\test\temp\junit4-J1-20160228_004018_801.sysout
   [junit4] >>> JVM J1 emitted unexpected output (verbatim) ----
   [junit4] Default case invoked for: 
   [junit4]    opcode  = 0, "Node"
   [junit4] Default case invoked for: 
   [junit4]    opcode  = 0, "Node"
   [junit4] Default case invoked for: 
   [junit4]    opcode  = 200, "Phi"
   [junit4] <<< JVM J1: EOF ----

[...truncated 9273 lines...]
   [junit4] Suite: org.apache.solr.cloud.TestAuthenticationFramework
   [junit4]   2> 483448 INFO  (TEST-TestAuthenticationFramework.testErrorsInStartup-seed#[E47929A367D31986]) [    ] o.a.s.c.ZkTestServer STARTING ZK TEST SERVER
   [junit4]   2> 483448 INFO  (Thread-1179) [    ] o.a.s.c.ZkTestServer client port:0.0.0.0/0.0.0.0:0
   [junit4]   2> 483448 INFO  (Thread-1179) [    ] o.a.s.c.ZkTestServer Starting server
   [junit4]   2> 483548 INFO  (TEST-TestAuthenticationFramework.testErrorsInStartup-seed#[E47929A367D31986]) [    ] o.a.s.c.ZkTestServer start zk server on port:54531
   [junit4]   2> 483548 INFO  (TEST-TestAuthenticationFramework.testErrorsInStartup-seed#[E47929A367D31986]) [    ] o.a.s.c.c.SolrZkClient Using default ZkCredentialsProvider
   [junit4]   2> 483555 INFO  (TEST-TestAuthenticationFramework.testErrorsInStartup-seed#[E47929A367D31986]) [    ] o.a.s.c.c.ConnectionManager Waiting for client to connect to ZooKeeper
   [junit4]   2> 483617 INFO  (zkCallback-851-thread-1) [    ] o.a.s.c.c.ConnectionManager Watcher org.apache.solr.common.cloud.ConnectionManager@1f4dbc4 name:ZooKeeperConnection Watcher:127.0.0.1:54531 got event WatchedEvent state:SyncConnected type:None path:null path:null type:None
   [junit4]   2> 483618 INFO  (TEST-TestAuthenticationFramework.testErrorsInStartup-seed#[E47929A367D31986]) [    ] o.a.s.c.c.ConnectionManager Client is connected to ZooKeeper
   [junit4]   2> 483618 INFO  (TEST-TestAuthenticationFramework.testErrorsInStartup-seed#[E47929A367D31986]) [    ] o.a.s.c.c.SolrZkClient Using default ZkACLProvider
   [junit4]   2> 483618 INFO  (TEST-TestAuthenticationFramework.testErrorsInStartup-seed#[E47929A367D31986]) [    ] o.a.s.c.c.SolrZkClient makePath: /solr/solr.xml
   [junit4]   2> 483718 INFO  (jetty-launcher-850-thread-1) [    ] o.e.j.s.Server jetty-9.2.13.v20150730
   [junit4]   2> 483730 INFO  (jetty-launcher-850-thread-1) [    ] o.e.j.s.h.ContextHandler Started o.e.j.s.ServletContextHandler@10e562b{/solr,null,AVAILABLE}
   [junit4]   2> 483730 INFO  (jetty-launcher-850-thread-1) [    ] o.e.j.s.ServerConnector Started ServerConnector@12d344d{HTTP/1.1}{127.0.0.1:54535}
   [junit4]   2> 483730 INFO  (jetty-launcher-850-thread-1) [    ] o.e.j.s.Server Started @489111ms
   [junit4]   2> 483730 INFO  (jetty-launcher-850-thread-1) [    ] o.a.s.c.s.e.JettySolrRunner Jetty properties: {hostContext=/solr, hostPort=54535}
   [junit4]   2> 483730 INFO  (jetty-launcher-850-thread-1) [    ] o.a.s.s.SolrDispatchFilter SolrDispatchFilter.init(): sun.misc.Launcher$AppClassLoader@1d16e93
   [junit4]   2> 483730 INFO  (jetty-launcher-850-thread-1) [    ] o.a.s.c.SolrResourceLoader new SolrResourceLoader for directory: 'C:\Users\JenkinsSlave\workspace\Lucene-Solr-5.5-Windows\solr\build\solr-core\test\J0\temp\solr.cloud.TestAuthenticationFramework_E47929A367D31986-001\tempDir-001\node1'
   [junit4]   2> 483730 INFO  (jetty-launcher-850-thread-1) [    ] o.a.s.c.SolrResourceLoader JNDI not configured for solr (NoInitialContextEx)
   [junit4]   2> 483730 INFO  (jetty-launcher-850-thread-1) [    ] o.a.s.c.SolrResourceLoader solr home defaulted to 'solr/' (could not find system property or JNDI)
   [junit4]   2> 483730 INFO  (jetty-launcher-850-thread-1) [    ] o.a.s.c.c.SolrZkClient Using default ZkCredentialsProvider
   [junit4]   2> 483730 INFO  (jetty-launcher-850-thread-1) [    ] o.a.s.c.c.ConnectionManager Waiting for client to connect to ZooKeeper
   [junit4]   2> 483736 INFO  (jetty-launcher-850-thread-3) [    ] o.e.j.s.Server jetty-9.2.13.v20150730
   [junit4]   2> 483743 INFO  (jetty-launcher-850-thread-3) [    ] o.e.j.s.h.ContextHandler Started o.e.j.s.ServletContextHandler@f0ddb0{/solr,null,AVAILABLE}
   [junit4]   2> 483745 INFO  (jetty-launcher-850-thread-3) [    ] o.e.j.s.ServerConnector Started ServerConnector@10494e4{HTTP/1.1}{127.0.0.1:54541}
   [junit4]   2> 483745 INFO  (jetty-launcher-850-thread-3) [    ] o.e.j.s.Server Started @489132ms
   [junit4]   2> 483745 INFO  (jetty-launcher-850-thread-3) [    ] o.a.s.c.s.e.JettySolrRunner Jetty properties: {hostContext=/solr, hostPort=54541}
   [junit4]   2> 483746 INFO  (jetty-launcher-850-thread-3) [    ] o.a.s.s.SolrDispatchFilter SolrDispatchFilter.init(): sun.misc.Launcher$AppClassLoader@1d16e93
   [junit4]   2> 483746 INFO  (jetty-launcher-850-thread-3) [    ] o.a.s.c.SolrResourceLoader new SolrResourceLoader for directory: 'C:\Users\JenkinsSlave\workspace\Lucene-Solr-5.5-Windows\solr\build\solr-core\test\J0\temp\solr.cloud.TestAuthenticationFramework_E47929A367D31986-001\tempDir-001\node3'
   [junit4]   2> 483746 INFO  (jetty-launcher-850-thread-3) [    ] o.a.s.c.SolrResourceLoader JNDI not configured for solr (NoInitialContextEx)
   [junit4]   2> 483746 INFO  (jetty-launcher-850-thread-3) [    ] o.a.s.c.SolrResourceLoader solr home defaulted to 'solr/' (could not find system property or JNDI)
   [junit4]   2> 483747 INFO  (jetty-launcher-850-thread-3) [    ] o.a.s.c.c.SolrZkClient Using default ZkCredentialsProvider
   [junit4]   2> 483752 INFO  (jetty-launcher-850-thread-3) [    ] o.a.s.c.c.ConnectionManager Waiting for client to connect to ZooKeeper
   [junit4]   2> 483779 INFO  (zkCallback-852-thread-1) [    ] o.a.s.c.c.ConnectionManager Watcher org.apache.solr.common.cloud.ConnectionManager@14f1220 name:ZooKeeperConnection Watcher:127.0.0.1:54531/solr got event WatchedEvent state:SyncConnected type:None path:null path:null type:None
   [junit4]   2> 483779 INFO  (jetty-launcher-850-thread-1) [    ] o.a.s.c.c.ConnectionManager Client is connected to ZooKeeper
   [junit4]   2> 483779 INFO  (jetty-launcher-850-thread-1) [    ] o.a.s.c.c.SolrZkClient Using default ZkACLProvider
   [junit4]   2> 483826 INFO  (jetty-launcher-850-thread-1) [    ] o.a.s.s.SolrDispatchFilter solr.xml found in ZooKeeper. Loading...
   [junit4]   2> 483829 INFO  (zkCallback-853-thread-1) [    ] o.a.s.c.c.ConnectionManager Watcher org.apache.solr.common.cloud.ConnectionManager@467d57 name:ZooKeeperConnection Watcher:127.0.0.1:54531/solr got event WatchedEvent state:SyncConnected type:None path:null path:null type:None
   [junit4]   2> 483829 INFO  (jetty-launcher-850-thread-3) [    ] o.a.s.c.c.ConnectionManager Client is connected to ZooKeeper
   [junit4]   2> 483829 INFO  (jetty-launcher-850-thread-3) [    ] o.a.s.c.c.SolrZkClient Using default ZkACLProvider
   [junit4]   2> 483831 INFO  (jetty-launcher-850-thread-3) [    ] o.a.s.s.SolrDispatchFilter solr.xml found in ZooKeeper. Loading...
   [junit4]   2> 483893 INFO  (jetty-launcher-850-thread-1) [    ] o.a.s.c.CorePropertiesLocator Config-defined core root directory: C:\Users\JenkinsSlave\workspace\Lucene-Solr-5.5-Windows\solr\build\solr-core\test\J0\temp\solr.cloud.TestAuthenticationFramework_E47929A367D31986-001\tempDir-001\node1\.
   [junit4]   2> 483893 INFO  (jetty-launcher-850-thread-1) [    ] o.a.s.c.CoreContainer New CoreContainer 32096436
   [junit4]   2> 483893 INFO  (jetty-launcher-850-thread-1) [    ] o.a.s.c.CoreContainer Loading cores into CoreContainer [instanceDir=C:\Users\JenkinsSlave\workspace\Lucene-Solr-5.5-Windows\solr\build\solr-core\test\J0\temp\solr.cloud.TestAuthenticationFramework_E47929A367D31986-001\tempDir-001\node1]
   [junit4]   2> 483893 WARN  (jetty-launcher-850-thread-1) [    ] o.a.s.c.CoreContainer Couldn't add files from C:\Users\JenkinsSlave\workspace\Lucene-Solr-5.5-Windows\solr\build\solr-core\test\J0\temp\solr.cloud.TestAuthenticationFramework_E47929A367D31986-001\tempDir-001\node1\lib to classpath: C:\Users\JenkinsSlave\workspace\Lucene-Solr-5.5-Windows\solr\build\solr-core\test\J0\temp\solr.cloud.TestAuthenticationFramework_E47929A367D31986-001\tempDir-001\node1\lib
   [junit4]   2> 483895 INFO  (jetty-launcher-850-thread-1) [    ] o.a.s.h.c.HttpShardHandlerFactory created with socketTimeout : 90000,urlScheme : ,connTimeout : 15000,maxConnectionsPerHost : 20,maxConnections : 10000,corePoolSize : 0,maximumPoolSize : 2147483647,maxThreadIdleTime : 5,sizeOfQueue : -1,fairnessPolicy : false,useRetries : false,
   [junit4]   2> 483895 INFO  (jetty-launcher-850-thread-1) [    ] o.a.s.u.UpdateShardHandler Creating UpdateShardHandler HTTP client with params: socketTimeout=340000&connTimeout=45000&retry=true
   [junit4]   2> 483895 INFO  (jetty-launcher-850-thread-1) [    ] o.a.s.l.LogWatcher SLF4J impl is org.slf4j.impl.Log4jLoggerFactory
   [junit4]   2> 483895 INFO  (jetty-launcher-850-thread-1) [    ] o.a.s.l.LogWatcher Registering Log Listener [Log4j (org.slf4j.impl.Log4jLoggerFactory)]
   [junit4]   2> 483895 INFO  (jetty-launcher-850-thread-1) [    ] o.a.s.c.ZkContainer Zookeeper client=127.0.0.1:54531/solr
   [junit4]   2> 483895 INFO  (jetty-launcher-850-thread-1) [    ] o.a.s.c.ZkController zkHost includes chroot
   [junit4]   2> 483895 INFO  (jetty-launcher-850-thread-1) [    ] o.a.s.c.c.SolrZkClient Using default ZkCredentialsProvider
   [junit4]   2> 483895 WARN  (NIOServerCxn.Factory:0.0.0.0/0.0.0.0:0) [    ] o.a.z.s.NIOServerCnxn caught end of stream exception
   [junit4]   2> EndOfStreamException: Unable to read additional data from client sessionid 0x153256cde910001, likely client has closed socket
   [junit4]   2> 	at org.apache.zookeeper.server.NIOServerCnxn.doIO(NIOServerCnxn.java:228)
   [junit4]   2> 	at org.apache.zookeeper.server.NIOServerCnxnFactory.run(NIOServerCnxnFactory.java:208)
   [junit4]   2> 	at java.lang.Thread.run(Thread.java:745)
   [junit4]   2> 483908 INFO  (jetty-launcher-850-thread-1) [    ] o.a.s.c.c.ConnectionManager Waiting for client to connect to ZooKeeper
   [junit4]   2> 483910 INFO  (jetty-launcher-850-thread-3) [    ] o.a.s.c.CorePropertiesLocator Config-defined core root directory: C:\Users\JenkinsSlave\workspace\Lucene-Solr-5.5-Windows\solr\build\solr-core\test\J0\temp\solr.cloud.TestAuthenticationFramework_E47929A367D31986-001\tempDir-001\node3\.
   [junit4]   2> 483910 INFO  (jetty-launcher-850-thread-3) [    ] o.a.s.c.CoreContainer New CoreContainer 12735826
   [junit4]   2> 483910 INFO  (jetty-launcher-850-thread-3) [    ] o.a.s.c.CoreContainer Loading cores into CoreContainer [instanceDir=C:\Users\JenkinsSlave\workspace\Lucene-Solr-5.5-Windows\solr\build\solr-core\test\J0\temp\solr.cloud.TestAuthenticationFramework_E47929A367D31986-001\tempDir-001\node3]
   [junit4]   2> 483910 WARN  (jetty-launcher-850-thread-3) [    ] o.a.s.c.CoreContainer Couldn't add files from C:\Users\JenkinsSlave\workspace\Lucene-Solr-5.5-Windows\solr\build\solr-core\test\J0\temp\solr.cloud.TestAuthenticationFramework_E47929A367D31986-001\tempDir-001\node3\lib to classpath: C:\Users\JenkinsSlave\workspace\Lucene-Solr-5.5-Windows\solr\build\solr-core\test\J0\temp\solr.cloud.TestAuthenticationFramework_E47929A367D31986-001\tempDir-001\node3\lib
   [junit4]   2> 483913 INFO  (jetty-launcher-850-thread-3) [    ] o.a.s.h.c.HttpShardHandlerFactory created with socketTimeout : 90000,urlScheme : ,connTimeout : 15000,maxConnectionsPerHost : 20,maxConnections : 10000,corePoolSize : 0,maximumPoolSize : 2147483647,maxThreadIdleTime : 5,sizeOfQueue : -1,fairnessPolicy : false,useRetries : false,
   [junit4]   2> 483913 INFO  (jetty-launcher-850-thread-3) [    ] o.a.s.u.UpdateShardHandler Creating UpdateShardHandler HTTP client with params: socketTimeout=340000&connTimeout=45000&retry=true
   [junit4]   2> 483913 INFO  (jetty-launcher-850-thread-3) [    ] o.a.s.l.LogWatcher SLF4J impl is org.slf4j.impl.Log4jLoggerFactory
   [junit4]   2> 483913 INFO  (jetty-launcher-850-thread-3) [    ] o.a.s.l.LogWatcher Registering Log Listener [Log4j (org.slf4j.impl.Log4jLoggerFactory)]
   [junit4]   2> 483913 INFO  (jetty-launcher-850-thread-3) [    ] o.a.s.c.ZkContainer Zookeeper client=127.0.0.1:54531/solr
   [junit4]   2> 483913 INFO  (jetty-launcher-850-thread-3) [    ] o.a.s.c.ZkController zkHost includes chroot
   [junit4]   2> 483913 INFO  (jetty-launcher-850-thread-3) [    ] o.a.s.c.c.SolrZkClient Using default ZkCredentialsProvider
   [junit4]   2> 483922 INFO  (jetty-launcher-850-thread-3) [    ] o.a.s.c.c.ConnectionManager Waiting for client to connect to ZooKeeper
   [junit4]   2> 483936 INFO  (zkCallback-856-thread-1) [    ] o.a.s.c.c.ConnectionManager Watcher org.apache.solr.common.cloud.ConnectionManager@e2122a name:ZooKeeperConnection Watcher:127.0.0.1:54531 got event WatchedEvent state:SyncConnected type:None path:null path:null type:None
   [junit4]   2> 483938 INFO  (jetty-launcher-850-thread-1) [    ] o.a.s.c.c.ConnectionManager Client is connected to ZooKeeper
   [junit4]   2> 483938 INFO  (jetty-launcher-850-thread-1) [    ] o.a.s.c.c.SolrZkClient Using default ZkACLProvider
   [junit4]   2> 483967 INFO  (zkCallback-859-thread-1) [    ] o.a.s.c.c.ConnectionManager Watcher org.apache.solr.common.cloud.ConnectionManager@22976a name:ZooKeeperConnection Watcher:127.0.0.1:54531 got event WatchedEvent state:SyncConnected type:None path:null path:null type:None
   [junit4]   2> 483967 INFO  (jetty-launcher-850-thread-3) [    ] o.a.s.c.c.ConnectionManager Client is connected to ZooKeeper
   [junit4]   2> 483967 INFO  (jetty-launcher-850-thread-3) [    ] o.a.s.c.c.SolrZkClient Using default ZkACLProvider
   [junit4]   2> 483977 INFO  (jetty-launcher-850-thread-1) [n:127.0.0.1:54535_solr    ] o.a.s.c.c.ConnectionManager Waiting for client to connect to ZooKeeper
   [junit4]   2> 483982 INFO  (jetty-launcher-850-thread-3) [n:127.0.0.1:54541_solr    ] o.a.s.c.c.ConnectionManager Waiting for client to connect to ZooKeeper
   [junit4]   2> 484005 INFO  (zkCallback-860-thread-1-processing-n:127.0.0.1:54535_solr) [n:127.0.0.1:54535_solr    ] o.a.s.c.c.ConnectionManager Watcher org.apache.solr.common.cloud.ConnectionManager@60e0d8 name:ZooKeeperConnection Watcher:127.0.0.1:54531/solr got event WatchedEvent state:SyncConnected type:None path:null path:null type:None
   [junit4]   2> 484005 INFO  (jetty-launcher-850-thread-1) [n:127.0.0.1:54535_solr    ] o.a.s.c.c.ConnectionManager Client is connected to ZooKeeper
   [junit4]   2> 484012 INFO  (zkCallback-861-thread-1-processing-n:127.0.0.1:54541_solr) [n:127.0.0.1:54541_solr    ] o.a.s.c.c.ConnectionManager Watcher org.apache.solr.common.cloud.ConnectionManager@1115c26 name:ZooKeeperConnection Watcher:127.0.0.1:54531/solr got event WatchedEvent state:SyncConnected type:None path:null path:null type:None
   [junit4]   2> 484012 INFO  (jetty-launcher-850-thread-3) [n:127.0.0.1:54541_solr    ] o.a.s.c.c.ConnectionManager Client is connected to ZooKeeper
   [junit4]   2> 484026 INFO  (jetty-launcher-850-thread-1) [n:127.0.0.1:54535_solr    ] o.a.s.c.c.SolrZkClient makePath: /overseer/queue
   [junit4]   2> 484026 INFO  (jetty-launcher-850-thread-3) [n:127.0.0.1:54541_solr    ] o.a.s.c.c.SolrZkClient makePath: /overseer/queue
   [junit4]   2> 484123 INFO  (jetty-launcher-850-thread-3) [n:127.0.0.1:54541_solr    ] o.a.s.c.c.SolrZkClient makePath: /overseer/collection-queue-work
   [junit4]   2> 484123 INFO  (jetty-launcher-850-thread-1) [n:127.0.0.1:54535_solr    ] o.a.s.c.c.SolrZkClient makePath: /overseer/collection-queue-work
   [junit4]   2> 484299 INFO  (jetty-launcher-850-thread-1) [n:127.0.0.1:54535_solr    ] o.a.s.c.c.SolrZkClient makePath: /overseer/collection-map-running
   [junit4]   2> 484322 INFO  (jetty-launcher-850-thread-3) [n:127.0.0.1:54541_solr    ] o.a.s.c.c.SolrZkClient makePath: /overseer/collection-map-running
   [junit4]   2> 484470 INFO  (jetty-launcher-850-thread-1) [n:127.0.0.1:54535_solr    ] o.a.s.c.c.SolrZkClient makePath: /overseer/collection-map-completed
   [junit4]   2> 484472 INFO  (jetty-launcher-850-thread-3) [n:127.0.0.1:54541_solr    ] o.a.s.c.c.SolrZkClient makePath: /overseer/collection-map-completed
   [junit4]   2> 484573 INFO  (jetty-launcher-850-thread-1) [n:127.0.0.1:54535_solr    ] o.a.s.c.c.SolrZkClient makePath: /overseer/collection-map-failure
   [junit4]   2> 484573 INFO  (jetty-launcher-850-thread-3) [n:127.0.0.1:54541_solr    ] o.a.s.c.c.SolrZkClient makePath: /overseer/collection-map-failure
   [junit4]   2> 484648 INFO  (jetty-launcher-850-thread-3) [n:127.0.0.1:54541_solr    ] o.a.s.c.c.SolrZkClient makePath: /live_nodes
   [junit4]   2> 484648 INFO  (jetty-launcher-850-thread-1) [n:127.0.0.1:54535_solr    ] o.a.s.c.c.SolrZkClient makePath: /live_nodes
   [junit4]   2> 484684 INFO  (jetty-launcher-850-thread-1) [n:127.0.0.1:54535_solr    ] o.a.s.c.c.SolrZkClient makePath: /collections
   [junit4]   2> 484710 INFO  (jetty-launcher-850-thread-3) [n:127.0.0.1:54541_solr    ] o.a.s.c.c.SolrZkClient makePath: /aliases.json
   [junit4]   2> 484712 INFO  (jetty-launcher-850-thread-1) [n:127.0.0.1:54535_solr    ] o.a.s.c.c.SolrZkClient makePath: /aliases.json
   [junit4]   2> 484725 INFO  (jetty-launcher-850-thread-1) [n:127.0.0.1:54535_solr    ] o.a.s.c.c.SolrZkClient makePath: /clusterstate.json
   [junit4]   2> 484753 INFO  (jetty-launcher-850-thread-3) [n:127.0.0.1:54541_solr    ] o.a.s.c.c.SolrZkClient makePath: /security.json
   [junit4]   2> 484753 INFO  (jetty-launcher-850-thread-1) [n:127.0.0.1:54535_solr    ] o.a.s.c.c.SolrZkClient makePath: /security.json
   [junit4]   2> 484778 INFO  (jetty-launcher-850-thread-3) [n:127.0.0.1:54541_solr    ] o.a.s.c.ZkController Register node as live in ZooKeeper:/live_nodes/127.0.0.1:54541_solr
   [junit4]   2> 484790 INFO  (jetty-launcher-850-thread-1) [n:127.0.0.1:54535_solr    ] o.a.s.c.ZkController Register node as live in ZooKeeper:/live_nodes/127.0.0.1:54535_solr
   [junit4]   2> 484808 INFO  (jetty-launcher-850-thread-3) [n:127.0.0.1:54541_solr    ] o.a.s.c.c.SolrZkClient makePath: /live_nodes/127.0.0.1:54541_solr
   [junit4]   2> 484825 INFO  (jetty-launcher-850-thread-1) [n:127.0.0.1:54535_solr    ] o.a.s.c.c.SolrZkClient makePath: /live_nodes/127.0.0.1:54535_solr
   [junit4]   2> 484857 INFO  (jetty-launcher-850-thread-3) [n:127.0.0.1:54541_solr    ] o.a.s.c.c.SolrZkClient makePath: /overseer_elect
   [junit4]   2> 484903 INFO  (jetty-launcher-850-thread-1) [n:127.0.0.1:54535_solr    ] o.a.s.c.c.SolrZkClient makePath: /overseer_elect/election
   [junit4]   2> 484921 INFO  (jetty-launcher-850-thread-1) [n:127.0.0.1:54535_solr    ] o.a.s.c.Overseer Overseer (id=null) closing
   [junit4]   2> 484922 INFO  (jetty-launcher-850-thread-3) [n:127.0.0.1:54541_solr    ] o.a.s.c.Overseer Overseer (id=null) closing
   [junit4]   2> 484936 INFO  (jetty-launcher-850-thread-3) [n:127.0.0.1:54541_solr    ] o.a.s.c.LeaderElector Joined leadership election with path: /overseer_elect/election/95461166625652742-127.0.0.1:54541_solr-n_0000000000
   [junit4]   2> 484944 INFO  (jetty-launcher-850-thread-3) [n:127.0.0.1:54541_solr    ] o.a.s.c.OverseerElectionContext I am going to be the leader 127.0.0.1:54541_solr
   [junit4]   2> 484944 INFO  (jetty-launcher-850-thread-3) [n:127.0.0.1:54541_solr    ] o.a.s.c.c.SolrZkClient makePath: /overseer_elect/leader
   [junit4]   2> 484946 INFO  (jetty-launcher-850-thread-1) [n:127.0.0.1:54535_solr    ] o.a.s.c.LeaderElector Joined leadership election with path: /overseer_elect/election/95461166625652741-127.0.0.1:54535_solr-n_0000000001
   [junit4]   2> 484962 INFO  (jetty-launcher-850-thread-3) [n:127.0.0.1:54541_solr    ] o.a.s.c.Overseer Overseer (id=95461166625652742-127.0.0.1:54541_solr-n_0000000000) starting
   [junit4]   2> 484962 INFO  (jetty-launcher-850-thread-1) [n:127.0.0.1:54535_solr    ] o.a.s.c.LeaderElector Watching path /overseer_elect/election/95461166625652742-127.0.0.1:54541_solr-n_0000000000 to know if I could be the leader
   [junit4]   2> 484962 INFO  (jetty-launcher-850-thread-1) [n:127.0.0.1:54535_solr    ] o.a.s.c.c.ZkStateReader Updating cluster state from ZooKeeper... 
   [junit4]   2> 485006 INFO  (jetty-launcher-850-thread-1) [n:127.0.0.1:54535_solr    ] o.a.s.c.CoreContainer Security conf doesn't exist. Skipping setup for authorization module.
   [junit4]   2> 485006 INFO  (jetty-launcher-850-thread-1) [n:127.0.0.1:54535_solr    ] o.a.s.c.CoreContainer Authentication plugin class obtained from system property 'authenticationPlugin': org.apache.solr.cloud.TestAuthenticationFramework$MockAuthenticationPlugin
   [junit4]   2> 485007 INFO  (jetty-launcher-850-thread-1) [n:127.0.0.1:54535_solr    ] o.a.s.c.CoreContainer Reconfiguring the shard handler factory and update shard handler.
   [junit4]   2> 485007 INFO  (jetty-launcher-850-thread-1) [n:127.0.0.1:54535_solr    ] o.a.s.h.c.HttpShardHandlerFactory Reconfiguring the default client with: org.apache.solr.cloud.TestAuthenticationFramework$MockAuthenticationPlugin$MockClientConfigurer@165593d
   [junit4]   2> 485007 INFO  (jetty-launcher-850-thread-1) [n:127.0.0.1:54535_solr    ] o.a.s.u.UpdateShardHandler Reconfiguring the default client with: org.apache.solr.cloud.TestAuthenticationFramework$MockAuthenticationPlugin$MockClientConfigurer@165593d
   [junit4]   2> 485010 INFO  (jetty-launcher-850-thread-1) [n:127.0.0.1:54535_solr    ] o.a.s.c.CorePropertiesLocator Looking for core definitions underneath C:\Users\JenkinsSlave\workspace\Lucene-Solr-5.5-Windows\solr\build\solr-core\test\J0\temp\solr.cloud.TestAuthenticationFramework_E47929A367D31986-001\tempDir-001\node1\.
   [junit4]   2> 485010 INFO  (jetty-launcher-850-thread-1) [n:127.0.0.1:54535_solr    ] o.a.s.c.CorePropertiesLocator Found 0 core definitions
   [junit4]   2> 485016 INFO  (jetty-launcher-850-thread-1) [n:127.0.0.1:54535_solr    ] o.a.s.s.SolrDispatchFilter user.dir=C:\Users\JenkinsSlave\workspace\Lucene-Solr-5.5-Windows\solr\build\solr-core\test\J0
   [junit4]   2> 485016 INFO  (jetty-launcher-850-thread-1) [n:127.0.0.1:54535_solr    ] o.a.s.s.SolrDispatchFilter SolrDispatchFilter.init() done
   [junit4]   2> 485017 INFO  (jetty-launcher-850-thread-3) [n:127.0.0.1:54541_solr    ] o.a.s.c.c.SolrZkClient makePath: /overseer/queue-work
   [junit4]   2> 485623 INFO  (jetty-launcher-850-thread-3) [n:127.0.0.1:54541_solr    ] o.a.s.c.OverseerAutoReplicaFailoverThread Starting OverseerAutoReplicaFailoverThread autoReplicaFailoverWorkLoopDelay=10000 autoReplicaFailoverWaitAfterExpiration=30000 autoReplicaFailoverBadNodeExpiration=60000
   [junit4]   2> 485623 INFO  (jetty-launcher-850-thread-3) [n:127.0.0.1:54541_solr    ] o.a.s.c.c.ZkStateReader Updating cluster state from ZooKeeper... 
   [junit4]   2> 485624 INFO  (OverseerCollectionConfigSetProcessor-95461166625652742-127.0.0.1:54541_solr-n_0000000000) [n:127.0.0.1:54541_solr    ] o.a.s.c.OverseerTaskProcessor Process current queue of overseer operations
   [junit4]   2> 485624 INFO  (OverseerStateUpdate-95461166625652742-127.0.0.1:54541_solr-n_0000000000) [n:127.0.0.1:54541_solr    ] o.a.s.c.Overseer Starting to work on the main queue
   [junit4]   2> 485658 INFO  (jetty-launcher-850-thread-3) [n:127.0.0.1:54541_solr    ] o.a.s.c.CoreContainer Security conf doesn't exist. Skipping setup for authorization module.
   [junit4]   2> 485658 INFO  (jetty-launcher-850-thread-3) [n:127.0.0.1:54541_solr    ] o.a.s.c.CoreContainer Authentication plugin class obtained from system property 'authenticationPlugin': org.apache.solr.cloud.TestAuthenticationFramework$MockAuthenticationPlugin
   [junit4]   2> 485658 INFO  (jetty-launcher-850-thread-3) [n:127.0.0.1:54541_solr    ] o.a.s.c.CoreContainer Reconfiguring the shard handler factory and update shard handler.
   [junit4]   2> 485658 INFO  (jetty-launcher-850-thread-3) [n:127.0.0.1:54541_solr    ] o.a.s.h.c.HttpShardHandlerFactory Reconfiguring the default client with: org.apache.solr.cloud.TestAuthenticationFramework$MockAuthenticationPlugin$MockClientConfigurer@1292c4b
   [junit4]   2> 485658 INFO  (jetty-launcher-850-thread-3) [n:127.0.0.1:54541_solr    ] o.a.s.u.UpdateShardHandler Reconfiguring the default client with: org.apache.solr.cloud.TestAuthenticationFramework$MockAuthenticationPlugin$MockClientConfigurer@1292c4b
   [junit4]   2> 485659 INFO  (jetty-launcher-850-thread-3) [n:127.0.0.1:54541_solr    ] o.a.s.c.CorePropertiesLocator Looking for core definitions underneath C:\Users\JenkinsSlave\workspace\Lucene-Solr-5.5-Windows\solr\build\solr-core\test\J0\temp\solr.cloud.TestAuthenticationFramework_E47929A367D31986-001\tempDir-001\node3\.
   [junit4]   2> 485661 INFO  (jetty-launcher-850-thread-3) [n:127.0.0.1:54541_solr    ] o.a.s.c.CorePropertiesLocator Found 0 core definitions
   [junit4]   2> 485663 INFO  (jetty-launcher-850-thread-3) [n:127.0.0.1:54541_solr    ] o.a.s.s.SolrDispatchFilter user.dir=C:\Users\JenkinsSlave\workspace\Lucene-Solr-5.5-Windows\solr\build\solr-core\test\J0
   [junit4]   2> 485663 INFO  (jetty-launcher-850-thread-3) [n:127.0.0.1:54541_solr    ] o.a.s.s.SolrDispatchFilter SolrDispatchFilter.init() done
   [junit4]   2> 485665 INFO  (jetty-launcher-850-thread-3) [    ] o.e.j.s.ServerConnector Stopped ServerConnector@12d344d{HTTP/1.1}{127.0.0.1:0}
   [junit4]   2> 485665 INFO  (jetty-launcher-850-thread-1) [    ] o.e.j.s.ServerConnector Stopped ServerConnector@10494e4{HTTP/1.1}{127.0.0.1:0}
   [junit4]   2> 485666 INFO  (jetty-launcher-850-thread-3) [    ] o.a.s.c.CoreContainer Shutting down CoreContainer instance=32096436
   [junit4]   2> 485667 INFO  (jetty-launcher-850-thread-1) [    ] o.a.s.c.CoreContainer Shutting down CoreContainer instance=12735826
   [junit4]   2> 485667 INFO  (jetty-launcher-850-thread-3) [    ] o.a.s.c.ZkController Publish node=127.0.0.1:54535_solr as DOWN
   [junit4]   2> 485667 INFO  (jetty-launcher-850-thread-1) [    ] o.a.s.c.ZkController Publish node=127.0.0.1:54541_solr as DOWN
   [junit4]   2> 485716 INFO  (jetty-launcher-850-thread-1) [    ] o.a.s.c.Overseer Overseer (id=95461166625652742-127.0.0.1:54541_solr-n_0000000000) closing
   [junit4]   2> 485717 INFO  (OverseerStateUpdate-95461166625652742-127.0.0.1:54541_solr-n_0000000000) [n:127.0.0.1:54541_solr    ] o.a.s.c.Overseer Overseer Loop exiting : 127.0.0.1:54541_solr
   [junit4]   2> 485753 INFO  (zkCallback-861-thread-1-processing-n:127.0.0.1:54541_solr) [n:127.0.0.1:54541_solr    ] o.a.s.c.c.ZkStateReader A live node change: [WatchedEvent state:SyncConnected type:NodeChildrenChanged path:/live_nodes], has occurred - updating... (live nodes size: [2])
   [junit4]   2> 485753 WARN  (zkCallback-861-thread-1-processing-n:127.0.0.1:54541_solr) [n:127.0.0.1:54541_solr    ] o.a.s.c.c.ZkStateReader ZooKeeper watch triggered, but Solr cannot talk to ZK: [KeeperErrorCode = Session expired for /live_nodes]
   [junit4]   2> 485755 INFO  (zkCallback-860-thread-2-processing-n:127.0.0.1:54535_solr) [n:127.0.0.1:54535_solr    ] o.a.s.c.c.ZkStateReader A live node change: [WatchedEvent state:SyncConnected type:NodeChildrenChanged path:/live_nodes], has occurred - updating... (live nodes size: [2])
   [junit4]   2> 485755 INFO  (jetty-launcher-850-thread-1) [    ] o.e.j.s.h.ContextHandler Stopped o.e.j.s.ServletContextHandler@f0ddb0{/solr,null,UNAVAILABLE}
   [junit4]   2> 485755 WARN  (zkCallback-860-thread-2-processing-n:127.0.0.1:54535_solr) [n:127.0.0.1:54535_solr    ] o.a.s.c.c.ZkStateReader ZooKeeper watch triggered, but Solr cannot talk to ZK: [KeeperErrorCode = Session expired for /live_nodes]
   [junit4]   2> 487385 WARN  (zkCallback-860-thread-1-processing-n:127.0.0.1:54535_solr) [n:127.0.0.1:54535_solr    ] o.a.s.c.LeaderElector 
   [junit4]   2> org.apache.zookeeper.KeeperException$SessionExpiredException: KeeperErrorCode = Session expired for /overseer_elect/election
   [junit4]   2> 	at org.apache.zookeeper.KeeperException.create(KeeperException.java:127)
   [junit4]   2> 	at org.apache.zookeeper.KeeperException.create(KeeperException.java:51)
   [junit4]   2> 	at org.apache.zookeeper.ZooKeeper.getChildren(ZooKeeper.java:1472)
   [junit4]   2> 	at org.apache.solr.common.cloud.SolrZkClient$6.execute(SolrZkClient.java:328)
   [junit4]   2> 	at org.apache.solr.common.cloud.SolrZkClient$6.execute(SolrZkClient.java:325)
   [junit4]   2> 	at org.apache.solr.common.cloud.ZkCmdExecutor.retryOperation(ZkCmdExecutor.java:60)
   [junit4]   2> 	at org.apache.solr.common.cloud.SolrZkClient.getChildren(SolrZkClient.java:325)
   [junit4]   2> 	at org.apache.solr.cloud.LeaderElector.checkIfIamLeader(LeaderElector.java:107)
   [junit4]   2> 	at org.apache.solr.cloud.LeaderElector.access$200(LeaderElector.java:58)
   [junit4]   2> 	at org.apache.solr.cloud.LeaderElector$ElectionWatcher.process(LeaderElector.java:388)
   [junit4]   2> 	at org.apache.solr.common.cloud.SolrZkClient$3$1.run(SolrZkClient.java:264)
   [junit4]   2> 	at java.util.concurrent.Executors$RunnableAdapter.call(Executors.java:511)
   [junit4]   2> 	at java.util.concurrent.FutureTask.run(FutureTask.java:266)
   [junit4]   2> 	at org.apache.solr.common.util.ExecutorUtil$MDCAwareThreadPoolExecutor$1.run(ExecutorUtil.java:231)
   [junit4]   2> 	at java.util.concurrent.ThreadPoolExecutor.runWorker(ThreadPoolExecutor.java:1142)
   [junit4]   2> 	at java.util.concurrent.ThreadPoolExecutor$Worker.run(ThreadPoolExecutor.java:617)
   [junit4]   2> 	at java.lang.Thread.run(Thread.java:745)
   [junit4]   2> 487386 INFO  (jetty-launcher-850-thread-3) [    ] o.e.j.s.h.ContextHandler Stopped o.e.j.s.ServletContextHandler@10e562b{/solr,null,UNAVAILABLE}
   [junit4]   2> 487391 INFO  (TEST-TestAuthenticationFramework.testErrorsInStartup-seed#[E47929A367D31986]) [    ] o.a.s.c.ZkTestServer connecting to 127.0.0.1:54531 54531
   [junit4]   2> 489843 INFO  (Thread-1179) [    ] o.a.s.c.ZkTestServer connecting to 127.0.0.1:54531 54531
   [junit4]   2> 489845 WARN  (Thread-1179) [    ] o.a.s.c.ZkTestServer Watch limit violations: 
   [junit4]   2> Maximum concurrent create/delete watches above limit:
   [junit4]   2> 
   [junit4]   2> 	2	/solr/aliases.json
   [junit4]   2> 	2	/solr/security.json
   [junit4]   2> 
   [junit4]   2> Maximum concurrent data watches above limit:
   [junit4]   2> 
   [junit4]   2> 	2	/solr/clusterstate.json
   [junit4]   2> 
   [junit4]   2> Maximum concurrent children watches above limit:
   [junit4]   2> 
   [junit4]   2> 	2	/solr/live_nodes
   [junit4]   2> 	2	/solr/collections
   [junit4]   2> 
   [junit4]   2> 489849 INFO  (TEST-TestAuthenticationFramework.testErrorsInShutdown-seed#[E47929A367D31986]) [    ] o.a.s.c.ZkTestServer STARTING ZK TEST SERVER
   [junit4]   2> 489850 INFO  (Thread-1204) [    ] o.a.s.c.ZkTestServer client port:0.0.0.0/0.0.0.0:0
   [junit4]   2> 489850 INFO  (Thread-1204) [    ] o.a.s.c.ZkTestServer Starting server
   [junit4]   2> 489959 INFO  (TEST-TestAuthenticationFramework.testErrorsInShutdown-seed#[E47929A367D31986]) [    ] o.a.s.c.ZkTestServer start zk server on port:54576
   [junit4]   2> 489959 INFO  (TEST-TestAuthenticationFramework.testErrorsInShutdown-seed#[E47929A367D31986]) [    ] o.a.s.c.c.SolrZkClient Using default ZkCredentialsProvider
   [junit4]   2> 489960 INFO  (TEST-TestAuthenticationFramework.testErrorsInShutdown-seed#[E47929A367D31986]) [    ] o.a.s.c.c.ConnectionManager Waiting for client to connect to ZooKeeper
   [junit4]   2> 490191 INFO  (zkCallback-863-thread-1) [    ] o.a.s.c.c.ConnectionManager Watcher org.apache.solr.common.cloud.ConnectionManager@1d84434 name:ZooKeeperConnection Watcher:127.0.0.1:54576 got event WatchedEvent state:SyncConnected type:None path:null path:null type:None
   [junit4]   2> 490191 INFO  (TEST-TestAuthenticationFramework.testErrorsInShutdown-seed#[E47929A367D31986]) [    ] o.a.s.c.c.ConnectionManager Client is connected to ZooKeeper
   [junit4]   2> 490191 INFO  (TEST-TestAuthenticationFramework.testErrorsInShutdown-seed#[E47929A367D31986]) [    ] o.a.s.c.c.SolrZkClient Using default ZkACLProvider
   [junit4]   2> 490191 INFO  (TEST-TestAuthenticationFramework.testErrorsInShutdown-seed#[E47929A367D31986]) [    ] o.a.s.c.c.SolrZkClient makePath: /solr/solr.xml
   [junit4]   2> 490259 INFO  (jetty-launcher-862-thread-1) [    ] o.e.j.s.Server jetty-9.2.13.v20150730
   [junit4]   2> 490260 INFO  (jetty-launcher-862-thread-3) [    ] o.e.j.s.Server jetty-9.2.13.v20150730
   [junit4]   2> 490260 INFO  (jetty-launcher-862-thread-2) [    ] o.e.j.s.Server jetty-9.2.13.v20150730
   [junit4]   2> 490267 INFO  (jetty-launcher-862-thread-3) [    ] o.e.j.s.h.ContextHandler Started o.e.j.s.ServletContextHandler@5f6bff{/solr,null,AVAILABLE}
   [junit4]   2> 490267 INFO  (jetty-launcher-862-thread-1) [    ] o.e.j.s.h.ContextHandler Started o.e.j.s.ServletContextHandler@1245fe2{/solr,null,AVAILABLE}
   [junit4]   2> 490268 INFO  (jetty-launcher-862-thread-1) [    ] o.e.j.s.ServerConnector Started ServerConnector@1001158{HTTP/1.1}{127.0.0.1:54584}
   [junit4]   2> 490268 INFO  (jetty-launcher-862-thread-1) [    ] o.e.j.s.Server Started @495895ms
   [junit4]   2> 490268 INFO  (jetty-launcher-862-thread-1) [    ] o.a.s.c.s.e.JettySolrRunner Jetty properties: {hostContext=/solr, hostPort=54584}
   [junit4]   2> 490268 INFO  (jetty-launcher-862-thread-2) [    ] o.e.j.s.h.ContextHandler Started o.e.j.s.ServletContextHandler@1261164{/solr,null,AVAILABLE}
   [junit4]   2> 490269 INFO  (jetty-launcher-862-thread-1) [    ] o.a.s.s.SolrDispatchFilter SolrDispatchFilter.init(): sun.misc.Launcher$AppClassLoader@1d16e93
   [junit4]   2> 490269 INFO  (jetty-launcher-862-thread-1) [    ] o.a.s.c.SolrResourceLoader new SolrResourceLoader for directory: 'C:\Users\JenkinsSlave\workspace\Lucene-Solr-5.5-Windows\solr\build\solr-core\test\J0\temp\solr.cloud.TestAuthenticationFramework_E47929A367D31986-001\tempDir-002\node1'
   [junit4]   2> 490269 INFO  (jetty-launcher-862-thread-3) [    ] o.e.j.s.ServerConnector Started ServerConnector@107c08a{HTTP/1.1}{127.0.0.1:54583}
   [junit4]   2> 490269 INFO  (jetty-launcher-862-thread-3) [    ] o.e.j.s.Server Started @495896ms
   [junit4]   2> 490269 INFO  (jetty-launcher-862-thread-1) [    ] o.a.s.c.SolrResourceLoader JNDI not configured for solr (NoInitialContextEx)
   [junit4]   2> 490269 INFO  (jetty-launcher-862-thread-3) [    ] o.a.s.c.s.e.JettySolrRunner Jetty properties: {hostContext=/solr, hostPort=54583}
   [junit4]   2> 490269 INFO  (jetty-launcher-862-thread-1) [    ] o.a.s.c.SolrResourceLoader solr home defaulted to 'solr/' (could not find system property or JNDI)
   [junit4]   2> 490269 INFO  (jetty-launcher-862-thread-3) [    ] o.a.s.s.SolrDispatchFilter SolrDispatchFilter.init(): sun.misc.Launcher$AppClassLoader@1d16e93
   [junit4]   2> 490269 INFO  (jetty-launcher-862-thread-3) [    ] o.a.s.c.SolrResourceLoader new SolrResourceLoader for directory: 'C:\Users\JenkinsSlave\workspace\Lucene-Solr-5.5-Windows\solr\build\solr-core\test\J0\temp\solr.cloud.TestAuthenticationFramework_E47929A367D31986-001\tempDir-002\node3'
   [junit4]   2> 490269 INFO  (jetty-launcher-862-thread-2) [    ] o.e.j.s.ServerConnector Started ServerConnector@22462a{HTTP/1.1}{127.0.0.1:54589}
   [junit4]   2> 490270 INFO  (jetty-launcher-862-thread-2) [    ] o.e.j.s.Server Started @495896ms
   [junit4]   2> 490270 INFO  (jetty-launcher-862-thread-3) [    ] o.a.s.c.SolrResourceLoader JNDI not configured for solr (NoInitialContextEx)
   [junit4]   2> 490270 INFO  (jetty-launcher-862-thread-2) [    ] o.a.s.c.s.e.JettySolrRunner Jetty properties: {hostContext=/solr, hostPort=54589}
   [junit4]   2> 490270 INFO  (jetty-launcher-862-thread-3) [    ] o.a.s.c.SolrResourceLoader solr home defaulted to 'solr/' (could not find system property or JNDI)
   [junit4]   2> 490270 INFO  (jetty-launcher-862-thread-2) [    ] o.a.s.s.SolrDispatchFilter SolrDispatchFilter.init(): sun.misc.Launcher$AppClassLoader@1d16e93
   [junit4]   2> 490270 INFO  (jetty-launcher-862-thread-2) [    ] o.a.s.c.SolrResourceLoader new SolrResourceLoader for directory: 'C:\Users\JenkinsSlave\workspace\Lucene-Solr-5.5-Windows\solr\build\solr-core\test\J0\temp\solr.cloud.TestAuthenticationFramework_E47929A367D31986-001\tempDir-002\node2'
   [junit4]   2> 490270 INFO  (jetty-launcher-862-thread-2) [    ] o.a.s.c.SolrResourceLoader JNDI not configured for solr (NoInitialContextEx)
   [junit4]   2> 490270 INFO  (jetty-launcher-862-thread-2) [    ] o.a.s.c.SolrResourceLoader solr home defaulted to 'solr/' (could not find system property or JNDI)
   [junit4]   2> 490270 INFO  (jetty-launcher-862-thread-1) [    ] o.a.s.c.c.SolrZkClient Using default ZkCredentialsProvider
   [junit4]   2> 490271 INFO  (jetty-launcher-862-thread-3) [    ] o.a.s.c.c.SolrZkClient Using default ZkCredentialsProvider
   [junit4]   2> 490271 INFO  (jetty-launcher-862-thread-2) [    ] o.a.s.c.c.SolrZkClient Using default ZkCredentialsProvider
   [junit4]   2> 490271 INFO  (jetty-launcher-862-thread-1) [    ] o.a.s.c.c.ConnectionManager Waiting for client to connect to ZooKeeper
   [junit4]   2> 490271 INFO  (jetty-launcher-862-thread-3) [    ] o.a.s.c.c.ConnectionManager Waiting for client to connect to ZooKeeper
   [junit4]   2> 490272 INFO  (jetty-launcher-862-thread-2) [    ] o.a.s.c.c.ConnectionManager Waiting for client to connect to ZooKeeper
   [junit4]   2> 490301 INFO  (zkCallback-864-thread-1) [    ] o.a.s.c.c.ConnectionManager Watcher org.apache.solr.common.cloud.ConnectionManager@143a617 name:ZooKeeperConnection Watcher:127.0.0.1:54576/solr got event WatchedEvent state:SyncConnected type:None path:null path:null type:None
   [junit4]   2> 490302 INFO  (jetty-launcher-862-thread-1) [    ] o.a.s.c.c.ConnectionManager Client is connected to ZooKeeper
   [junit4]   2> 490302 INFO  (zkCallback-865-thread-1) [    ] o.a.s.c.c.ConnectionManager Watcher org.apache.solr.common.cloud.ConnectionManager@15b5869 name:ZooKeeperConnection Watcher:127.0.0.1:54576/solr got event WatchedEvent state:SyncConnected type:None path:null path:null type:None
   [junit4]   2> 490302 INFO  (jetty-launcher-862-thread-3) [    ] o.a.s.c.c.ConnectionManager Client is connected to ZooKeeper
   [junit4]   2> 490302 INFO  (jetty-launcher-862-thread-1) [    ] o.a.s.c.c.SolrZkClient Using default ZkACLProvider
   [junit4]   2> 490302 INFO  (jetty-launcher-862-thread-3) [    ] o.a.s.c.c.SolrZkClient Using default ZkACLProvider
   [junit4]   2> 490314 INFO  (jetty-launcher-862-thread-1) [    ] o.a.s.s.SolrDispatchFilter solr.xml found in ZooKeeper. Loading...
   [junit4]   2> 490314 INFO  (jetty-launcher-862-thread-3) [    ] o.a.s.s.SolrDispatchFilter solr.xml found in ZooKeeper. Loading...
   [junit4]   2> 490315 INFO  (zkCallback-866-thread-1) [    ] o.a.s.c.c.ConnectionManager Watcher org.apache.solr.common.cloud.ConnectionManager@13fe72b name:ZooKeeperConnection Watcher:127.0.0.1:54576/solr got event WatchedEvent state:SyncConnected type:None path:null path:null type:None
   [junit4]   2> 490315 INFO  (jetty-launcher-862-thread-2) [    ] o.a.s.c.c.ConnectionManager Client is connected to ZooKeeper
   [junit4]   2> 490315 INFO  (jetty-launcher-862-thread-2) [    ] o.a.s.c.c.SolrZkClient Using default ZkACLProvider
   [junit4]   2> 490316 INFO  (jetty-launcher-862-thread-2) [    ] o.a.s.s.SolrDispatchFilter solr.xml found in ZooKeeper. Loading...
   [junit4]   2> 490362 INFO  (jetty-launcher-862-thread-1) [    ] o.a.s.c.CorePropertiesLocator Config-defined core root directory: C:\Users\JenkinsSlave\workspace\Lucene-Solr-5.5-Windows\solr\build\solr-core\test\J0\temp\solr.cloud.TestAuthenticationFramework_E47929A367D31986-001\tempDir-002\node1\.
   [junit4]   2> 490362 INFO  (jetty-launcher-862-thread-2) [    ] o.a.s.c.CorePropertiesLocator Config-defined core root directory: C:\Users\JenkinsSlave\workspace\Lucene-Solr-5.5-Windows\solr\build\solr-core\test\J0\temp\solr.cloud.TestAuthenticationFramework_E47929A367D31986-001\tempDir-002\node2\.
   [junit4]   2> 490362 INFO  (jetty-launcher-862-thread-1) [    ] o.a.s.c.CoreContainer New CoreContainer 19087219
   [junit4]   2> 490362 INFO  (jetty-launcher-862-thread-2) [    ] o.a.s.c.CoreContainer New CoreContainer 27986932
   [junit4]   2> 490362 INFO  (jetty-launcher-862-thread-2) [    ] o.a.s.c.CoreContainer Loading cores into CoreContainer [instanceDir=C:\Users\JenkinsSlave\workspace\Lucene-Solr-5.5-Windows\solr\build\solr-core\test\J0\temp\solr.cloud.TestAuthenticationFramework_E47929A367D31986-001\tempDir-002\node2]
   [junit4]   2> 490362 INFO  (jetty-launcher-862-thread-1) [    ] o.a.s.c.CoreContainer Loading cores into CoreContainer [instanceDir=C:\Users\JenkinsSlave\workspace\Lucene-Solr-5.5-Windows\solr\build\solr-core\test\J0\temp\solr.cloud.TestAuthenticationFramework_E47929A367D31986-001\tempDir-002\node1]
   [junit4]   2> 490362 WARN  (jetty-launcher-862-thread-2) [    ] o.a.s.c.CoreContainer Couldn't add files from C:\Users\JenkinsSlave\workspace\Lucene-Solr-5.5-Windows\solr\build\solr-core\test\J0\temp\solr.cloud.TestAuthenticationFramework_E47929A367D31986-001\tempDir-002\node2\lib to classpath: C:\Users\JenkinsSlave\workspace\Lucene-Solr-5.5-Windows\solr\build\solr-core\test\J0\temp\solr.cloud.TestAuthenticationFramework_E47929A367D31986-001\tempDir-002\node2\lib
   [junit4]   2> 490362 INFO  (jetty-launcher-862-thread-3) [    ] o.a.s.c.CorePropertiesLocator Config-defined core root directory: C:\Users\JenkinsSlave\workspace\Lucene-Solr-5.5-Windows\solr\build\solr-core\test\J0\temp\solr.cloud.TestAuthenticationFramework_E47929A367D31986-001\tempDir-002\node3\.
   [junit4]   2> 490362 INFO  (jetty-launcher-862-thread-2) [    ] o.a.s.h.c.HttpShardHandlerFactory created with socketTimeout : 90000,urlScheme : ,connTimeout : 15000,maxConnectionsPerHost : 20,maxConnections : 10000,corePoolSize : 0,maximumPoolSize : 2147483647,maxThreadIdleTime : 5,sizeOfQueue : -1,fairnessPolicy : false,useRetries : false,
   [junit4]   2> 490362 WARN  (jetty-launcher-862-thread-1) [    ] o.a.s.c.CoreContainer Couldn't add files from C:\Users\JenkinsSlave\workspace\Lucene-Solr-5.5-Windows\solr\build\solr-core\test\J0\temp\solr.cloud.TestAuthenticationFramework_E47929A367D31986-001\tempDir-002\node1\lib to classpath: C:\Users\JenkinsSlave\workspace\Lucene-Solr-5.5-Windows\solr\build\solr-core\test\J0\temp\solr.cloud.TestAuthenticationFramework_E47929A367D31986-001\tempDir-002\node1\lib
   [junit4]   2> 490362 INFO  (jetty-launcher-862-thread-3) [    ] o.a.s.c.CoreContainer New CoreContainer 32621138
   [junit4]   2> 490363 INFO  (jetty-launcher-862-thread-3) [    ] o.a.s.c.CoreContainer Loading cores into CoreContainer [instanceDir=C:\Users\JenkinsSlave\workspace\Lucene-Solr-5.5-Windows\solr\build\solr-core\test\J0\temp\solr.cloud.TestAuthenticationFramework_E47929A367D31986-001\tempDir-002\node3]
   [junit4]   2> 490363 INFO  (jetty-launcher-862-thread-1) [    ] o.a.s.h.c.HttpShardHandlerFactory created with socketTimeout : 90000,urlScheme : ,connTimeout : 15000,maxConnectionsPerHost : 20,maxConnections : 10000,corePoolSize : 0,maximumPoolSize : 2147483647,maxThreadIdleTime : 5,sizeOfQueue : -1,fairnessPolicy : false,useRetries : false,
   [junit4]   2> 490363 WARN  (jetty-launcher-862-thread-3) [    ] o.a.s.c.CoreContainer Couldn't add files from C:\Users\JenkinsSlave\workspace\Lucene-Solr-5.5-Windows\solr\build\solr-core\test\J0\temp\solr.cloud.TestAuthenticationFramework_E47929A367D31986-001\tempDir-002\node3\lib to classpath: C:\Users\JenkinsSlave\workspace\Lucene-Solr-5.5-Windows\solr\build\solr-core\test\J0\temp\solr.cloud.TestAuthenticationFramework_E47929A367D31986-001\tempDir-002\node3\lib
   [junit4]   2> 490363 INFO  (jetty-launcher-862-thread-3) [    ] o.a.s.h.c.HttpShardHandlerFactory created with socketTimeout : 90000,urlScheme : ,connTimeout : 15000,maxConnectionsPerHost : 20,maxConnections : 10000,corePoolSize : 0,maximumPoolSize : 2147483647,maxThreadIdleTime : 5,sizeOfQueue : -1,fairnessPolicy : false,useRetries : false,
   [junit4]   2> 490364 INFO  (jetty-launcher-862-thread-2) [    ] o.a.s.u.UpdateShardHandler Creating UpdateShardHandler HTTP client with params: socketTimeout=340000&connTimeout=45000&retry=true
   [junit4]   2> 490364 INFO  (jetty-launcher-862-thread-1) [    ] o.a.s.u.UpdateShardHandler Creating UpdateShardHandler HTTP client with params: socketTimeout=340000&connTimeout=45000&retry=true
   [junit4]   2> 490364 INFO  (jetty-launcher-862-thread-3) [    ] o.a.s.u.UpdateShardHandler Creating UpdateShardHandler HTTP client with params: socketTimeout=340000&connTimeout=45000&retry=true
   [junit4]   2> 490365 INFO  (jetty-launcher-862-thread-3) [    ] o.a.s.l.LogWatcher SLF4J impl is org.slf4j.impl.Log4jLoggerFactory
   [junit4]   2> 490365 INFO  (jetty-launcher-862-thread-3) [    ] o.a.s.l.LogWatcher Registering Log Listener [Log4j (org.slf4j.impl.Log4jLoggerFactory)]
   [junit4]   2> 490365 INFO  (jetty-launcher-862-thread-3) [    ] o.a.s.c.ZkContainer Zookeeper client=127.0.0.1:54576/solr
   [junit4]   2> 490365 INFO  (jetty-launcher-862-thread-3) [    ] o.a.s.c.ZkController zkHost includes chroot
   [junit4]   2> 490365 INFO  (jetty-launcher-862-thread-3) [    ] o.a.s.c.c.SolrZkClient Using default ZkCredentialsProvider
   [junit4]   2> 490367 INFO  (jetty-launcher-862-thread-1) [    ] o.a.s.l.LogWatcher SLF4J impl is org.slf4j.impl.Log4jLoggerFactory
   [junit4]   2> 490369 INFO  (jetty-launcher-862-thread-1) [    ] o.a.s.l.LogWatcher Registering Log Listener [Log4j (org.slf4j.impl.Log4jLoggerFactory)]
   [junit4]   2> 490369 INFO  (jetty-launcher-862-thread-1) [    ] o.a.s.c.ZkContainer Zookeeper client=127.0.0.1:54576/solr
   [junit4]   2> 490369 INFO  (jetty-launcher-862-thread-1) [    ] o.a.s.c.ZkController zkHost includes chroot
   [junit4]   2> 490369 INFO  (jetty-launcher-862-thread-1) [    ] o.a.s.c.c.SolrZkClient Using default ZkCredentialsProvider
   [junit4]   2> 490370 INFO  (jetty-launcher-862-thread-3) [    ] o.a.s.c.c.ConnectionManager Waiting for client to connect to ZooKeeper
   [junit4]   2> 490371 INFO  (jetty-launcher-862-thread-2) [    ] o.a.s.l.LogWatcher SLF4J impl is org.slf4j.impl.Log4jLoggerFactory
   [junit4]   2> 490371 INFO  (jetty-launcher-862-thread-2) [    ] o.a.s.l.LogWatcher Registering Log Listener [Log4j (org.slf4j.impl.Log4jLoggerFactory)]
   [junit4]   2> 490371 INFO  (jetty-launcher-862-thread-2) [    ] o.a.s.c.ZkContainer Zookeeper client=127.0.0.1:54576/solr
   [junit4]   2> 490371 INFO  (jetty-launcher-862-thread-1) [    ] o.a.s.c.c.ConnectionManager Waiting for client to connect to ZooKeeper
   [junit4]   2> 490371 INFO  (jetty-launcher-862-thread-2) [    ] o.a.s.c.ZkController zkHost includes chroot
   [junit4]   2> 490377 INFO  (jetty-launcher-862-thread-2) [    ] o.a.s.c.c.SolrZkClient Using default ZkCredentialsProvider
   [junit4]   2> 490379 INFO  (jetty-launcher-862-thread-2) [    ] o.a.s.c.c.ConnectionManager Waiting for client to connect to ZooKeeper
   [junit4]   2> 490404 INFO  (zkCallback-873-thread-1) [    ] o.a.s.c.c.ConnectionManager Watcher org.apache.solr.common.cloud.ConnectionManager@1e3f146 name:ZooKeeperConnection Watcher:127.0.0.1:54576 got event WatchedEvent state:SyncConnected type:None path:null path:null type:None
   [junit4]   2> 490404 INFO  (jetty-launcher-862-thread-3) [    ] o.a.s.c.c.ConnectionManager Client is connected to ZooKeeper
   [junit4]   2> 490404 INFO  (jetty-launcher-862-thread-3) [    ] o.a.s.c.c.SolrZkClient Using default ZkACLProvider
   [junit4]   2> 490421 INFO  (zkCallback-874-thread-1) [    ] o.a.s.c.c.ConnectionManager Watcher org.apache.solr.common.cloud.ConnectionManager@3e1916 name:ZooKeeperConnection Watcher:127.0.0.1:54576 got event WatchedEvent state:SyncConnected type:None path:null path:null type:None
   [junit4]   2> 490421 INFO  (jetty-launcher-862-thread-1) [    ] o.a.s.c.c.ConnectionManager Client is connected to ZooKeeper
   [junit4]   2> 490422 INFO  (jetty-launcher-862-thread-1) [    ] o.a.s.c.c.SolrZkClient Using default ZkACLProvider
   [junit4]   2> 490422 INFO  (zkCallback-875-thread-1) [    ] o.a.s.c.c.ConnectionManager Watcher org.apache.solr.common.cloud.ConnectionManager@170f778 name:ZooKeeperConnection Watcher:127.0.0.1:54576 got event WatchedEvent state:SyncConnected type:None path:null path:null type:None
   [junit4]   2> 490422 INFO  (jetty-launcher-862-thread-2) [    ] o.a.s.c.c.ConnectionManager Client is connected to ZooKeeper
   [junit4]   2> 490422 INFO  (jetty-launcher-862-thread-2) [    ] o.a.s.c.c.SolrZkClient Using default ZkACLProvider
   [junit4]   2> 490448 INFO  (jetty-launcher-862-thread-1) [n:127.0.0.1:54584_solr    ] o.a.s.c.c.ConnectionManager Waiting for client to connect to ZooKeeper
   [junit4]   2> 490469 INFO  (jetty-launcher-862-thread-3) [n:127.0.0.1:54583_solr    ] o.a.s.c.c.ConnectionManager Waiting for client to connect to ZooKeeper
   [junit4]   2> 490471 INFO  (jetty-launcher-862-thread-2) [n:127.0.0.1:54589_solr    ] o.a.s.c.c.ConnectionManager Waiting for client to connect to ZooKeeper
   [junit4]   2> 490487 INFO  (zkCallback-876-thread-1-processing-n:127.0.0.1:54584_solr) [n:127.0.0.1:54584_solr    ] o.a.s.c.c.ConnectionManager Watcher org.apache.solr.common.cloud.ConnectionManager@110a5d8 name:ZooKeeperConnection Watcher:127.0.0.1:54576/solr got event WatchedEvent state:SyncConnected type:None path:null path:null type:None
   [junit4]   2> 490487 INFO  (jetty-launcher-862-thread-1) [n:127.0.0.1:54584_solr    ] o.a.s.c.c.ConnectionManager Client is connected to ZooKeeper
   [junit4]   2> 490498 INFO  (zkCallback-877-thread-1-processing-n:127.0.0.1:54583_solr) [n:127.0.0.1:54583_solr    ] o.a.s.c.c.ConnectionManager Watcher org.apache.solr.common.cloud.ConnectionManager@e29811 name:ZooKeeperConnection Watcher:127.0.0.1:54576/solr got event WatchedEvent state:SyncConnected type:None path:null path:null type:None
   [junit4]   2> 490498 INFO  (jetty-launcher-862-thread-3) [n:127.0.0.1:54583_solr    ] o.a.s.c.c.ConnectionManager Client is connected to ZooKeeper
   [junit4]   2> 490502 INFO  (zkCallback-878-thread-1-processing-n:127.0.0.1:54589_solr) [n:127.0.0.1:54589_solr    ] o.a.s.c.c.ConnectionManager Watcher org.apache.solr.common.cloud.ConnectionManager@e082f3 name:ZooKeeperConnection Watcher:127.0.0.1:54576/solr got event WatchedEvent state:SyncConnected type:None path:null path:null type:None
   [junit4]   2> 490502 INFO  (jetty-launcher-862-thread-2) [n:127.0.0.1:54589_solr    ] o.a.s.c.c.ConnectionManager Client is connected to ZooKeeper
   [junit4]   2> 490538 INFO  (jetty-launcher-862-thread-1) [n:127.0.0.1:54584_solr    ] o.a.s.c.c.SolrZkClient makePath: /overseer/queue
   [junit4]   2> 490539 INFO  (jetty-launcher-862-thread-2) [n:127.0.0.1:54589_solr    ] o.a.s.c.c.SolrZkClient makePath: /overseer/queue
   [junit4]   2> 490539 INFO  (jetty-launcher-862-thread-3) [n:127.0.0.1:54583_solr    ] o.a.s.c.c.SolrZkClient makePath: /overseer/queue
   [junit4]   2> 490758 INFO  (jetty-launcher-862-thread-2) [n:127.0.0.1:54589_solr    ] o.a.s.c.c.SolrZkClient makePath: /overseer/collection-queue-work
   [junit4]   2> 490760 INFO  (jetty-launcher-862-thread-3) [n:127.0.0.1:54583_solr    ] o.a.s.c.c.SolrZkClient makePath: /overseer/collection-queue-work
   [junit4]   2> 490760 INFO  (jetty-launcher-862-thread-1) [n:127.0.0.1:54584_solr    ] o.a.s.c.c.SolrZkClient makePath: /overseer/collection-queue-work
   [junit4]   2> 491040 INFO  (jetty-launcher-862-thread-2) [n:127.0.0.1:54589_solr    ] o.a.s.c.c.SolrZkClient makePath: /overseer/collection-map-running
   [junit4]   2> 491074 INFO  (jetty-launcher-862-thread-3) [n:127.0.0.1:54583_solr    ] o.a.s.c.c.SolrZkClient makePath: /overseer/collection-map-running
   [junit4]   2> 491074 INFO  (jetty-launcher-862-thread-1) [n:127.0.0.1:54584_solr    ] o.a.s.c.c.SolrZkClient makePath: /overseer/collection-map-running
   [junit4]   2> 491247 INFO  (jetty-launcher-862-thread-3) [n:127.0.0.1:54583_solr    ] o.a.s.c.c.SolrZkClient makePath: /overseer/collection-map-completed
   [junit4]   2> 491283 INFO  (jetty-launcher-862-thread-2) [n:127.0.0.1:54589_solr    ] o.a.s.c.c.SolrZkClient makePath: /overseer/collection-map-completed
   [junit4]   2> 491283 INFO  (jetty-launcher-862-thread-1) [n:127.0.0.1:54584_solr    ] o.a.s.c.c.SolrZkClient makePath: /overseer/collection-map-completed
   [junit4]   2> 491420 INFO  (jetty-launcher-862-thread-2) [n:127.0.0.1:54589_solr    ] o.a.s.c.c.SolrZkClient makePath: /overseer/collection-map-failure
   [junit4]   2> 491420 INFO  (jetty-launcher-862-thread-3) [n:127.0.0.1:54583_solr    ] o.a.s.c.c.SolrZkClient makePath: /overseer/collection-map-failure
   [junit4]   2> 491420 INFO  (jetty-launcher-862-thread-1) [n:127.0.0.1:54584_solr    ] o.a.s.c.c.SolrZkClient makePath: /overseer/collection-map-failure
   [junit4]   2> 491502 INFO  (jetty-launcher-862-thread-3) [n:127.0.0.1:54583_solr    ] o.a.s.c.c.SolrZkClient makePath: /live_nodes
   [junit4]   2> 491502 INFO  (jetty-launcher-862-thread-2) [n:127.0.0.1:54589_solr    ] o.a.s.c.c.SolrZkClient makePath: /live_nodes
   [junit4]   2> 491503 INFO  (jetty-launcher-862-thread-1) [n:127.0.0.1:54584_solr    ] o.a.s.c.c.SolrZkClient makePath: /live_nodes
   [junit4]   2> 491565 INFO  (jetty-launcher-862-thread-3) [n:127.0.0.1:54583_solr    ] o.a.s.c.c.SolrZkClient makePath: /collections
   [junit4]   2> 491565 INFO  (jetty-launcher-862-thread-2) [n:127.0.0.1:54589_solr    ] o.a.s.c.c.SolrZkClient makePath: /collections
   [junit4]   2> 491566 INFO  (jetty-launcher-862-thread-1) [n:127.0.0.1:54584_solr    ] o.a.s.c.c.SolrZkClient makePath: /collections
   [junit4]   2> 491607 INFO  (jetty-launcher-862-thread-2) [n:127.0.0.1:54589_solr    ] o.a.s.c.c.SolrZkClient makePath: /aliases.json
   [junit4]   2> 491608 INFO  (jetty-launcher-862-thread-1) [n:127.0.0.1:54584_solr    ] o.a.s.c.c.SolrZkClient makePath: /aliases.json
   [junit4]   2> 491608 INFO  (jetty-launcher-862-thread-3) [n:127.0.0.1:54583_solr    ] o.a.s.c.c.SolrZkClient makePath: /aliases.json
   [junit4]   2> 491659 INFO  (jetty-launcher-862-thread-3) [n:127.0.0.1:54583_solr    ] o.a.s.c.c.SolrZkClient makePath: /clusterstate.json
   [junit4]   2> 491659 INFO  (jetty-launcher-862-thread-2) [n:127.0.0.1:54589_solr    ] o.a.s.c.c.SolrZkClient makePath: /clusterstate.json
   [junit4]   2> 491659 INFO  (jetty-launcher-862-thread-1) [n:127.0.0.1:54584_solr    ] o.a.s.c.c.SolrZkClient makePath: /clusterstate.json
   [junit4]   2> 491724 INFO  (jetty-launcher-862-thread-3) [n:127.0.0.1:54583_solr    ] o.a.s.c.c.SolrZkClient makePath: /security.json
   [junit4]   2> 491724 INFO  (jetty-launcher-862-thread-2) [n:127.0.0.1:54589_solr    ] o.a.s.c.c.SolrZkClient makePath: /security.json
   [junit4]   2> 491724 INFO  (jetty-launcher-862-thread-1) [n:127.0.0.1:54584_solr    ] o.a.s.c.c.SolrZkClient makePath: /security.json
   [junit4]   2> 491778 INFO  (jetty-launcher-862-thread-2) [n:127.0.0.1:54589_solr    ] o.a.s.c.ZkController Register node as live in ZooKeeper:/live_nodes/127.0.0.1:54589_solr
   [junit4]   2> 491802 INFO  (jetty-launcher-862-thread-3) [n:127.0.0.1:54583_solr    ] o.a.s.c.ZkController Register node as live in ZooKeeper:/live_nodes/127.0.0.1:54583_solr
   [junit4]   2> 491802 INFO  (jetty-launcher-862-thread-1) [n:127.0.0.1:54584_solr    ] o.a.s.c.ZkController Register node as live in ZooKeeper:/live_nodes/127.0.0.1:54584_solr
   [junit4]   2> 491834 INFO  (jetty-launcher-862-thread-2) [n:127.0.0.1:54589_solr    ] o.a.s.c.c.SolrZkClient makePath: /live_nodes/127.0.0.1:54589_solr
   [junit4]   2> 491854 INFO  (jetty-launcher-862-thread-1) [n:127.0.0.1:54584_solr    ] o.a.s.c.c.SolrZkClient makePath: /live_nodes/127.0.0.1:54584_solr
   [junit4]   2> 491854 INFO  (jetty-launcher-862-thread-3) [n:127.0.0.1:54583_solr    ] o.a.s.c.c.SolrZkClient makePath: /live_nodes/127.0.0.1:54583_solr
   [junit4]   2> 491937 INFO  (jetty-launcher-862-thread-2) [n:127.0.0.1:54589_solr    ] o.a.s.c.c.SolrZkClient makePath: /overseer_elect
   [junit4]   2> 491938 INFO  (jetty-launcher-862-thread-3) [n:127.0.0.1:54583_solr    ] o.a.s.c.c.SolrZkClient makePath: /overseer_elect
   [junit4]   2> 491938 INFO  (jetty-launcher-862-thread-1) [n:127.0.0.1:54584_solr    ] o.a.s.c.c.SolrZkClient makePath: /overseer_elect
   [junit4]   2> 491990 INFO  (jetty-launcher-862-thread-2) [n:127.0.0.1:54589_solr    ] o.a.s.c.c.SolrZkClient makePath: /overseer_elect/election
   [junit4]   2> 492019 INFO  (jetty-launcher-862-thread-1) [n:127.0.0.1:54584_solr    ] o.a.s.c.c.SolrZkClient makePath: /overseer_elect/election
   [junit4]   2> 492019 INFO  (jetty-launcher-862-thread-3) [n:127.0.0.1:54583_solr    ] o.a.s.c.c.SolrZkClient makePath: /overseer_elect/election
   [junit4]   2> 492075 INFO  (jetty-launcher-862-thread-1) [n:127.0.0.1:54584_solr    ] o.a.s.c.Overseer Overseer (id=null) closing
   [junit4]   2> 492075 INFO  (jetty-launcher-862-thread-3) [n:127.0.0.1:54583_solr    ] o.a.s.c.Overseer Overseer (id=null) closing
   [junit4]   2> 492076 INFO  (jetty-launcher-862-thread-2) [n:127.0.0.1:54589_solr    ] o.a.s.c.Overseer Overseer (id=null) closing
   [junit4]   2> 492103 INFO  (jetty-launcher-862-thread-1) [n:127.0.0.1:54584_solr    ] o.a.s.c.LeaderElector Joined leadership election with path: /overseer_elect/election/95461167045148679-127.0.0.1:54584_solr-n_0000000000
   [junit4]   2> 492103 INFO  (jetty-launcher-862-thread-3) [n:127.0.0.1:54583_solr    ] o.a.s.c.LeaderElector Joined leadership election with path: /overseer_elect/election/95461167045148680-127.0.0.1:54583_solr-n_0000000001
   [junit4]   2> 492103 INFO  (jetty-launcher-862-thread-2) [n:127.0.0.1:54589_solr    ] o.a.s.c.LeaderElector Joined leadership election with path: /overseer_elect/election/95461167045148681-127.0.0.1:54589_solr-n_0000000002
   [junit4]   2> 492104 INFO  (jetty-launcher-862-thread-1) [n:127.0.0.1:54584_solr    ] o.a.s.c.OverseerElectionContext I am going to be the leader 127.0.0.1:54584_solr
   [junit4]   2> 492104 INFO  (jetty-launcher-862-thread-1) [n:127.0.0.1:54584_solr    ] o.a.s.c.c.SolrZkClient makePath: /overseer_elect/leader
   [junit4]   2> 492105 INFO  (jetty-launcher-862-thread-3) [n:127.0.0.1:54583_solr    ] o.a.s.c.LeaderElector Watching path /overseer_elect/election/95461167045148679-127.0.0.1:54584_solr-n_0000000000 to know if I could be the leader
   [junit4]   2> 492105 INFO  (jetty-launcher-862-thread-3) [n:127.0.0.1:54583_solr    ] o.a.s.c.c.ZkStateReader Updating cluster state from ZooKeeper... 
   [junit4]   2> 492114 INFO  (jetty-launcher-862-thread-2) [n:127.0.0.1:54589_solr    ] o.a.s.c.LeaderElector Watching path /overseer_elect/election/95461167045148680-127.0.0.1:54583_solr-n_0000000001 to know if I could be the leader
   [junit4]   2> 492114 INFO  (jetty-launcher-862-thread-2) [n:127.0.0.1:54589_solr    ] o.a.s.c.c.ZkStateReader Updating cluster state from ZooKeeper... 
   [junit4]   2> 492141 INFO  (jetty-launcher-862-thread-1) [n:127.0.0.1:54584_solr    ] o.a.s.c.Overseer Overseer (id=95461167045148679-127.0.0.1:54584_solr-n_0000000000) starting
   [junit4]   2> 492247 INFO  (jetty-launcher-862-thread-1) [n:127.0.0.1:54584_solr    ] o.a.s.c.c.SolrZkClient makePath: /overseer/queue-work
   [junit4]   2> 492293 INFO  (jetty-launcher-862-thread-3) [n:127.0.0.1:54583_solr    ] o.a.s.c.CoreContainer Security conf doesn't exist. Skipping setup for authorization module.
   [junit4]   2> 492293 INFO  (jetty-launcher-862-thread-3) [n:127.0.0.1:54583_solr    ] o.a.s.c.CoreContainer Authentication plugin class obtained from system property 'authenticationPlugin': org.apache.solr.cloud.TestAuthenticationFramework$MockAuthenticationPlugin
   [junit4]   2> 492294 INFO  (jetty-launcher-862-thread-3) [n:127.0.0.1:54583_solr    ] o.a.s.c.CoreContainer Reconfiguring the shard handler factory and update shard handler.
   [junit4]   2> 492294 INFO  (jetty-launcher-862-thread-3) [n:127.0.0.1:54583_solr    ] o.a.s.h.c.HttpShardHandlerFactory Reconfiguring the default client with: org.apache.solr.cloud.TestAuthenticationFramework$MockAuthenticationPlugin$MockClientConfigurer@d23bb7
   [junit4]   2> 492294 INFO  (jetty-launcher-862-thread-3) [n:127.0.0.1:54583_solr    ] o.a.s.u.UpdateShardHandler Reconfiguring the default client with: org.apache.solr.cloud.TestAuthenticationFramework$MockAuthenticationPlugin$MockClientConfigurer@d23bb7
   [junit4]   2> 492296 INFO  (jetty-launcher-862-thread-2) [n:127.0.0.1:54589_solr    ] o.a.s.c.CoreContainer Security conf doesn't exist. Skipping setup for authorization module.
   [junit4]   2> 492296 INFO  (jetty-launcher-862-thread-2) [n:127.0.0.1:54589_solr    ] o.a.s.c.CoreContainer Authentication plugin class obtained from system property 'authenticationPlugin': org.apache.solr.cloud.TestAuthenticationFramework$MockAuthenticationPlugin
   [junit4]   2> 492296 INFO  (jetty-launcher-862-thread-2) [n:127.0.0.1:54589_solr    ] o.a.s.c.CoreContainer Reconfiguring the shard handler factory and update shard handler.
   [junit4]   2> 492296 INFO  (jetty-launcher-862-thread-2) [n:127.0.0.1:54589_solr    ] o.a.s.h.c.HttpShardHandlerFactory Reconfiguring the default client with: org.apache.solr.cloud.TestAuthenticationFramework$MockAuthenticationPlugin$MockClientConfigurer@36ea00
   [junit4]   2> 492296 INFO  (jetty-launcher-862-thread-2) [n:127.0.0.1:54589_solr    ] o.a.s.u.UpdateShardHandler Reconfiguring the default client with: org.apache.solr.cloud.TestAuthenticationFramework$MockAuthenticationPlugin$MockClientConfigurer@36ea00
   [junit4]   2> 492302 INFO  (jetty-launcher-862-thread-2) [n:127.0.0.1:54589_solr    ] o.a.s.c.CorePropertiesLocator Looking for core definitions underneath C:\Users\JenkinsSlave\workspace\Lucene-Solr-5.5-Windows\solr\build\solr-core\test\J0\temp\solr.cloud.TestAuthenticationFramework_E47929A367D31986-001\tempDir-002\node2\.
   [junit4]   2> 492303 INFO  (jetty-launcher-862-thread-2) [n:127.0.0.1:54589_solr    ] o.a.s.c.CorePropertiesLocator Found 0 core definitions
   [junit4]   2> 492304 INFO  (jetty-launcher-862-thread-3) [n:127.0.0.1:54583_solr    ] o.a.s.c.CorePropertiesLocator Looking for core definitions underneath C:\Users\JenkinsSlave\workspace\Lucene-Solr-5.5-Windows\solr\build\solr-core\test\J0\temp\solr.cloud.TestAuthenticationFramework_E47929A367D31986-001\tempDir-002\node3\.
   [junit4]   2> 492305 INFO  (jetty-launcher-862-thread-3) [n:127.0.0.1:54583_solr    ] o.a.s.c.CorePropertiesLocator Found 0 core definitions
   [junit4]   2> 492319 INFO  (jetty-launcher-862-thread-2) [n:127.0.0.1:54589_solr    ] o.a.s.s.SolrDispatchFilter user.dir=C:\Users\JenkinsSlave\workspace\Lucene-Solr-5.5-Windows\solr\build\solr-core\test\J0
   [junit4]   2> 492319 INFO  (jetty-launcher-862-thread-2) [n:127.0.0.1:54589_solr    ] o.a.s.s.SolrDispatchFilter SolrDispatchFilter.init() done
   [junit4]   2> 492320 INFO  (jetty-launcher-862-thread-3) [n:127.0.0.1:54583_solr    ] o.a.s.s.SolrDispatchFilter user.dir=C:\Users\JenkinsSlave\workspace\Lucene-Solr-5.5-Windows\solr\build\solr-core\test\J0
   [junit4]   2> 492320 INFO  (jetty-launcher-862-thread-3) [n:127.0.0.1:54583_solr    ] o.a.s.s.SolrDispatchFilter SolrDispatchFilter.init() done
   [junit4]   2> 492498 INFO  (jetty-launcher-862-thread-1) [n:127.0.0.1:54584_solr    ] o.a.s.c.OverseerAutoReplicaFailoverThread Starting OverseerAutoReplicaFailoverThread autoReplicaFailoverWorkLoopDelay=10000 autoReplicaFailoverWaitAfterExpiration=30000 autoReplicaFailoverBadNodeExpiration=60000
   [junit4]   2> 492499 INFO  (jetty-launcher-862-thread-1) [n:127.0.0.1:54584_solr    ] o.a.s.c.c.ZkStateReader Updating cluster state from ZooKeeper... 
   [junit4]   2> 492499 INFO  (OverseerCollectionConfigSetProcessor-95461167045148679-127.0.0.1:54584_solr-n_0000000000) [n:127.0.0.1:54584_solr    ] o.a.s.c.OverseerTaskProcessor Process current queue of overseer operations
   [junit4]   2> 492500 INFO  (OverseerStateUpdate-95461167045148679-127.0.0.1:54584_solr-n_0000000000) [n:127.0.0.1:54584_solr    ] o.a.s.c.Overseer Starting to work on the main queue
   [junit4]   2> 492539 INFO  (jetty-launcher-862-thread-1) [n:127.0.0.1:54584_solr    ] o.a.s.c.CoreContainer Security conf doesn't exist. Skipping setup for authorization module.
   [junit4]   2> 492539 INFO  (jetty-launcher-862-thread-1) [n:127.0.0.1:54584_solr    ] o.a.s.c.CoreContainer Authentication plugin class obtained from system property 'authenticationPlugin': org.apache.solr.cloud.TestAuthenticationFramework$MockAuthenticationPlugin
   [junit4]   2> 492540 INFO  (jetty-launcher-862-thread-1) [n:127.0.0.1:54584_solr    ] o.a.s.c.CoreContainer Reconfiguring the shard handler factory and update shard handler.
   [junit4]   2> 492540 INFO  (jetty-launcher-862-thread-1) [n:127.0.0.1:54584_solr    ] o.a.s.h.c.HttpShardHandlerFactory Reconfiguring the default client with: org.apache.solr.cloud.TestAuthenticationFramework$MockAuthenticationPlugin$MockClientConfigurer@9d664e
   [junit4]   2> 492540 INFO  (jetty-launcher-862-thread-1) [n:127.0.0.1:54584_solr    ] o.a.s.u.UpdateShardHandler Reconfiguring the default client with: org.apache.solr.cloud.TestAuthenticationFramework$MockAuthenticationPlugin$MockClientConfigurer@9d664e
   [junit4]   2> 492541 INFO  (jetty-launcher-862-thread-1) [n:127.0.0.1:54584_solr    ] o.a.s.c.CorePropertiesLocator Looking for core definitions underneath C:\Users\JenkinsSlave\workspace\Lucene-Solr-5.5-Windows\solr\build\solr-core\test\J0\temp\solr.cloud.TestAuthenticationFramework_E47929A367D31986-001\tempDir-002\node1\.
   [junit4]   2> 492541 INFO  (jetty-launcher-862-thread-1) [n:127.0.0.1:54584_solr    ] o.a.s.c.CorePropertiesLocator Found 0 core definitions
   [junit4]   2> 492543 INFO  (jetty-launcher-862-thread-1) [n:127.0.0.1:54584_solr    ] o.a.s.s.SolrDispatchFilter user.dir=C:\Users\JenkinsSlave\workspace\Lucene-Solr-5.5-Windows\solr\build\solr-core\test\J0
   [junit4]   2> 492543 INFO  (jetty-launcher-862-thread-1) [n:127.0.0.1:54584_solr    ] o.a.s.s.SolrDispatchFilter SolrDispatchFilter.init() done
   [junit4]   2> 492543 INFO  (TEST-TestAuthenticationFramework.testErrorsInShutdown-seed#[E47929A367D31986]) [    ] o.a.s.c.c.SolrZkClient Using default ZkCredentialsProvider
   [junit4]   2> 492545 INFO  (TEST-TestAuthenticationFramework.testErrorsInShutdown-seed#[E47929A367D31986]) [    ] o.a.s.c.c.ConnectionManager Waiting for client to connect to ZooKeeper
   [junit4]   2> 492577 INFO  (zkCallback-879-thread-1) [    ] o.a.s.c.c.ConnectionManager Watcher org.apache.solr.common.cloud.ConnectionManager@1f6137f name:ZooKeeperConnection Watcher:127.0.0.1:54576 got event WatchedEvent state:SyncConnected type:None path:null path:null type:None
   [junit4]   2> 492577 INFO  (TEST-TestAuthenticationFramework.testErrorsInShutdown-seed#[E47929A367D31986]) [    ] o.a.s.c.c.ConnectionManager Client is connected to ZooKeeper
   [junit4]   2> 492577 INFO  (TEST-TestAuthenticationFramework.testErrorsInShutdown-seed#[E47929A367D31986]) [    ] o.a.s.c.c.SolrZkClient Using default ZkACLProvider
   [junit4]   2> 492829 INFO  (jetty-launcher-862-thread-1) [    ] o.e.j.s.ServerConnector Stopped ServerConnector@22462a{HTTP/1.1}{127.0.0.1:0}
   [junit4]   2> 492832 INFO  (jetty-launcher-862-thread-1) [    ] o.a.s.c.CoreContainer Shutting down CoreContainer instance=27986932
   [junit4]   2> 492832 INFO  (jetty-launcher-862-thread-2) [    ] o.e.j.s.ServerConnector Stopped ServerConnector@1001158{HTTP/1.1}{127.0.0.1:0}
   [junit4]   2> 492832 INFO  (jetty-launcher-862-thread-1) [    ] o.a.s.c.ZkController Publish node=127.0.0.1:54589_solr as DOWN
   [junit4]   2> 492833 INFO  (jetty-launcher-862-thread-2) [    ] o.a.s.c.CoreContainer Shutting down CoreContainer instance=19087219
   [junit4]   2> 492833 INFO  (jetty-launcher-862-thread-2) [    ] o.a.s.c.ZkController Publish node=127.0.0.1:54584_solr as DOWN
   [junit4]   2> 492835 INFO  (jetty-launcher-862-thread-3) [    ] o.e.j.s.ServerConnector Stopped ServerConnector@107c08a{HTTP/1.1}{127.0.0.1:0}
   [junit4]   2> 492835 INFO  (jetty-launcher-862-thread-3) [    ] o.a.s.c.CoreContainer Shutting down CoreContainer instance=32621138
   [junit4]   2> 492837 INFO  (jetty-launcher-862-thread-3) [    ] o.a.s.c.ZkController Publish node=127.0.0.1:54583_solr as DOWN
   [junit4]   2> 492966 WARN  (NIOServerCxn.Factory:0.0.0.0/0.0.0.0:0) [    ] o.a.z.s.NIOServerCnxn caught end of stream exception
   [junit4]   2> EndOfStreamException: Unable to read additional data from client sessionid 0x153256cf7920009, likely client has closed socket
   [junit4]   2> 	at org.apache.zookeeper.server.NIOServerCnxn.doIO(NIOServerCnxn.java:228)
   [junit4]   2> 	at org.apache.zookeeper.server.NIOServerCnxnFactory.run(NIOServerCnxnFactory.java:208)
   [junit4]   2> 	at java.lang.Thread.run(Thread.java:745)
   [junit4]   2> 492966 ERROR (jetty-launcher-862-thread-2-EventThread) [n:127.0.0.1:54589_solr    ] o.a.z.ClientCnxn Error while calling watcher 
   [junit4]   2> java.util.concurrent.RejectedExecutionException: Task org.apache.solr.common.util.ExecutorUtil$MDCAwareThreadPoolExecutor$1@1e5cc47 rejected from org.apache.solr.common.util.ExecutorUtil$MDCAwareThreadPoolExecutor@1da4ee3[Shutting down, pool size = 1, active threads = 0, queued tasks = 0, completed tasks = 1]
   [junit4]   2> 	at java.util.concurrent.ThreadPoolExecutor$AbortPolicy.rejectedExecution(ThreadPoolExecutor.java:2047)
   [junit4]   2> 	at java.util.concurrent.ThreadPoolExecutor.reject(ThreadPoolExecutor.java:823)
   [junit4]   2> 	at java.util.concurrent.ThreadPoolExecutor.execute(ThreadPoolExecutor.java:1369)
   [junit4]   2> 	at org.apache.solr.common.util.ExecutorUtil$MDCAwareThreadPoolExecutor.execute(ExecutorUtil.java:214)
   [junit4]   2> 	at java.util.concurrent.AbstractExecutorService.submit(AbstractExecutorService.java:112)
   [junit4]   2> 	at org.apache.solr.common.cloud.SolrZkClient$3.process(SolrZkClient.java:261)
   [junit4]   2> 	at org.apache.zookeeper.ClientCnxn$EventThread.processEvent(ClientCnxn.java:522)
   [junit4]   2> 	at org.apache.zookeeper.ClientCnxn$EventThread.run(ClientCnxn.java:498)
   [junit4]   2> 492972 INFO  (zkCallback-877-thread-1-processing-n:127.0.0.1:54583_solr) [n:127.0.0.1:54583_solr    ] o.a.s.c.c.ZkStateReader A live node change: [WatchedEvent state:SyncConnected type:NodeChildrenChanged path:/live_nodes], has occurred - updating... (live nodes size: [3])
   [junit4]   2> 492974 INFO  (jetty-launcher-862-thread-1) [    ] o.e.j.s.h.ContextHandler Stopped o.e.j.s.ServletContextHandler@1261164{/solr,null,UNAVAILABLE}
   [junit4]   2> 492969 INFO  (zkCallback-876-thread-1-processing-n:127.0.0.1:54584_solr) [n:127.0.0.1:54584_solr    ] o.a.s.c.c.ZkStateReader A live node change: [WatchedEvent state:SyncConnected type:NodeChildrenChanged path:/live_nodes], has occurred - updating... (live nodes size: [3])
   [junit4]   2> 492976 INFO  (jetty-launcher-862-thread-2) [    ] o.a.s.c.Overseer Overseer (id=95461167045148679-127.0.0.1:54584_solr-n_0000000000) closing
   [junit4]   2> 492977 INFO  (OverseerStateUpdate-95461167045148679-127.0.0.1:54584_solr-n_0000000000) [n:127.0.0.1:54584_solr    ] o.a.s.c.Overseer Overseer Loop exiting : 127.0.0.1:54584_solr
   [junit4]   2> 493044 INFO  (zkCallback-876-thread-1-processing-n:127.0.0.1:54584_solr) [n:127.0.0.1:54584_solr    ] o.a.s.c.c.ZkStateReader A live node change: [WatchedEvent state:SyncConnected type:NodeChildrenChanged path:/live_nodes], has occurred - updating... (live nodes size: [1])
   [junit4]   2> 493044 WARN  (zkCallback-876-thread-1-processing-n:127.0.0.1:54584_solr) [n:127.0.0.1:54584_solr    ] o.a.s.c.c.ZkStateReader ZooKeeper watch triggered, but Solr cannot talk to ZK: [KeeperErrorCode = Session expired for /live_nodes]
   [junit4]   2> 493046 INFO  (jetty-launcher-862-thread-2) [    ] o.e.j.s.h.ContextHandler Stopped o.e.j.s.ServletContextHandler@1245fe2{/solr,null,UNAVAILABLE}
   [junit4]   2> 494607 WARN  (zkCallback-877-thread-1-processing-n:127.0.0.1:54583_solr) [n:127.0.0.1:54583_solr    ] o.a.s.c.c.ZkStateReader ZooKeeper watch triggered, but Solr cannot talk to ZK: [KeeperErrorCode = Session expired for /live_nodes]
   [junit4]   2> 494607 INFO  (jetty-launcher-862-thread-3) [    ] o.e.j.s.h.ContextHandler Stopped o.e.j.s.ServletContextHandler@5f6bff{/solr,null,UNAVAILABLE}
   [junit4]   2> 494609 INFO  (TEST-TestAuthenticationFramework.testErrorsInShutdown-seed#[E47929A367D31986]) [    ] o.a.s.c.ZkTestServer connecting to 127.0.0.1:54576 54576
   [junit4]   2> 497215 INFO  (Thread-1204) [    ] o.a.s.c.ZkTestServer connecting to 127.0.0.1:54576 54576
   [junit4]   2> 497216 WARN  (Thread-1204) [    ] o.a.s.c.ZkTestServer Watch limit violations: 
   [junit4]   2> Maximum concurrent create/delete watches above limit:
   [junit4]   2> 
   [junit4]   2> 	3	/solr/aliases.json
   [junit4]   2> 	3	/solr/security.json
   [junit4]   2> 
   [junit4]   2> Maximum concurrent data watches above limit:
   [junit4]   2> 
   [junit4]   2> 	3	/solr/clusterstate.json
   [junit4]   2> 
   [junit4]   2> Maximum concurrent children watches above limit:
   [junit4]   2> 
   [junit4]   2> 	3	/solr/live_nodes
   [junit4]   2> 	3	/solr/collections
   [junit4]   2> 
   [junit4]   2> 497245 INFO  (TEST-TestAuthenticationFramework.testStopAllStartAll-seed#[E47929A367D31986]) [    ] o.a.s.c.ZkTestServer STARTING ZK TEST SERVER
   [junit4]   2> 497247 INFO  (Thread-1239) [    ] o.a.s.c.ZkTestServer client port:0.0.0.0/0.0.0.0:0
   [junit4]   2> 497247 INFO  (Thread-1239) [    ] o.a.s.c.ZkTestServer Starting server
   [junit4]   2> 497367 INFO  (TEST-TestAuthenticationFramework.testStopAllStartAll-seed#[E47929A367D31986]) [    ] o.a.s.c.ZkTestServer start zk server on port:54650
   [junit4]   2> 497367 INFO  (TEST-TestAuthenticationFramework.testStopAllStartAll-seed#[E47929A367D31986]) [    ] o.a.s.c.c.SolrZkClient Using default ZkCredentialsProvider
   [junit4]   2> 497368 INFO  (TEST-TestAuthenticationFramework.testStopAllStartAll-seed#[E47929A367D31986]) [    ] o.a.s.c.c.ConnectionManager Waiting for client to connect to ZooKeeper
   [junit4]   2> 497566 INFO  (zkCallback-882-thread-1) [    ] o.a.s.c.c.ConnectionManager Watcher org.apache.solr.common.cloud.ConnectionManager@4f8ce5 name:ZooKeeperConnection Watcher:127.0.0.1:54650 got event WatchedEvent state:SyncConnected type:None path:null path:null type:None
   [junit4]   2> 497566 INFO  (TEST-TestAuthenticationFramework.testStopAllStartAll-seed#[E47929A367D31986]) [    ] o.a.s.c.c.ConnectionManager Client is connected to ZooKeeper
   [junit4]   2> 497566 INFO  (TEST-TestAuthenticationFramework.testStopAllStartAll-seed#[E47929A367D31986]) [    ] o.a.s.c.c.SolrZkClient Using default ZkACLProvider
   [junit4]   2> 497567 INFO  (TEST-TestAuthenticationFramework.testStopAllStartAll-seed#[E47929A367D31986]) [    ] o.a.s.c.c.SolrZkClient makePath: /solr/solr.xml
   [junit4]   2> 497844 INFO  (jetty-launcher-881-thread-2) [    ] o.e.j.s.Server jetty-9.2.13.v20150730
   [junit4]   2> 497844 INFO  (jetty-launcher-881-thread-3) [    ] o.e.j.s.Server jetty-9.2.13.v20150730
   [junit4]   2> 497847 INFO  (jetty-launcher-881-thread-1) [    ] o.e.j.s.Server jetty-9.2.13.v20150730
   [junit4]   2> 497849 INFO  (jetty-launcher-881-thread-2) [    ] o.e.j.s.h.ContextHandler Started o.e.j.s.ServletContextHandler@1e5c9dd{/solr,null,AVAILABLE}
   [junit4]   2> 497851 INFO  (jetty-launcher-881-thread-2) [    ] o.e.j.s.ServerConnector Started ServerConnector@284b0c{HTTP/1.1}{127.0.0.1:54654}
   [junit4]   2> 497851 INFO  (jetty-launcher-881-thread-2) [    ] o.e.j.s.Server Started @502830ms
   [junit4]   2> 497851 INFO  (jetty-launcher-881-thread-2) [    ] o.a.s.c.s.e.JettySolrRunner Jetty properties: {hostContext=/solr, hostPort=54654}
   [junit4]   2> 497851 INFO  (jetty-launcher-881-thread-2) [    ] o.a.s.s.SolrDispatchFilter SolrDispatchFilter.init(): sun.misc.Launcher$AppClassLoader@1d16e93
   [junit4]   2> 497851 INFO  (jetty-launcher-881-thread-2) [    ] o.a.s.c.SolrResourceLoader new SolrResourceLoader for directory: 'C:\Users\JenkinsSlave\workspace\Lucene-Solr-5.5-Windows\solr\build\solr-core\test\J0\temp\solr.cloud.TestAuthenticationFramework_E47929A367D31986-001\tempDir-003\node2'
   [junit4]   2> 497851 INFO  (jetty-launcher-881-thread-2) [    ] o.a.s.c.SolrResourceLoader JNDI not configured for solr (NoInitialContextEx)
   [junit4]   2> 497851 INFO  (jetty-launcher-881-thread-2) [    ] o.a.s.c.SolrResourceLoader solr home defaulted to 'solr/' (could not find system property or JNDI)
   [junit4]   2> 497853 INFO  (jetty-launcher-881-thread-1) [    ] o.e.j.s.h.ContextHandler Started o.e.j.s.ServletContextHandler@752865{/solr,null,AVAILABLE}
   [junit4]   2> 497854 INFO  (jetty-launcher-881-thread-3) [    ] o.e.j.s.h.ContextHandler Started o.e.j.s.ServletContextHandler@2fc074{/solr,null,AVAILABLE}
   [junit4]   2> 497854 INFO  (jetty-launcher-881-thread-1) [    ] o.e.j.s.ServerConnector Started ServerConnector@a3c31c{HTTP/1.1}{127.0.0.1:54657}
   [junit4]   2> 497854 INFO  (jetty-launcher-881-thread-1) [    ] o.e.j.s.Server Started @502833ms
   [junit4]   2> 497854 INFO  (jetty-launcher-881-thread-1) [    ] o.a.s.c.s.e.JettySolrRunner Jetty properties: {hostContext=/solr, hostPort=54657}
   [junit4]   2> 497855 INFO  (jetty-launcher-881-thread-1) [    ] o.a.s.s.SolrDispatchFilter SolrDispatchFilter.init(): sun.misc.Launcher$AppClassLoader@1d16e93
   [junit4]   2> 497855 INFO  (jetty-launcher-881-thread-1) [    ] o.a.s.c.SolrResourceLoader new SolrResourceLoader for directory: 'C:\Users\JenkinsSlave\workspace\Lucene-Solr-5.5-Windows\solr\build\solr-core\test\J0\temp\solr.cloud.TestAuthenti

[...truncated too long message...]

nit4]   2> 	at java.util.concurrent.locks.AbstractQueuedSynchronizer$ConditionObject.reportInterruptAfterWait(AbstractQueuedSynchronizer.java:2014)
   [junit4]   2> 	at java.util.concurrent.locks.AbstractQueuedSynchronizer$ConditionObject.await(AbstractQueuedSynchronizer.java:2048)
   [junit4]   2> 	at java.util.concurrent.LinkedBlockingQueue.take(LinkedBlockingQueue.java:442)
   [junit4]   2> 	at org.apache.zookeeper.server.PrepRequestProcessor.run(PrepRequestProcessor.java:120)
   [junit4]   2> 692373 WARN  (Thread-1598) [    ] o.a.s.c.ZkTestServer Server interrupted
   [junit4]   2> java.lang.InterruptedException
   [junit4]   2> 	at java.lang.Object.wait(Native Method)
   [junit4]   2> 	at java.lang.Thread.join(Thread.java:1245)
   [junit4]   2> 	at java.lang.Thread.join(Thread.java:1319)
   [junit4]   2> 	at org.apache.zookeeper.server.NIOServerCnxnFactory.join(NIOServerCnxnFactory.java:302)
   [junit4]   2> 	at org.apache.solr.cloud.ZkTestServer$ZKServerMain.runFromConfig(ZkTestServer.java:310)
   [junit4]   2> 	at org.apache.solr.cloud.ZkTestServer$2.run(ZkTestServer.java:491)
   [junit4]   2> 692382 ERROR (SessionTracker) [    ] o.a.z.s.SessionTrackerImpl Unexpected interruption
   [junit4]   2> java.lang.InterruptedException
   [junit4]   2> 	at java.lang.Object.wait(Native Method)
   [junit4]   2> 	at org.apache.zookeeper.server.SessionTrackerImpl.run(SessionTrackerImpl.java:146)
   [junit4]   2> Feb 28, 2016 1:13:37 AM com.carrotsearch.randomizedtesting.ThreadLeakControl tryToInterruptAll
   [junit4]   2> SEVERE: There are still zombie threads that couldn't be terminated:
   [junit4]   2>    1) Thread[id=5050, name=NIOServerCxn.Factory:0.0.0.0/0.0.0.0:0, state=RUNNABLE, group=TGRP-TestAuthenticationFramework]
   [junit4]   2>         at sun.nio.ch.WindowsSelectorImpl.setWakeupSocket0(Native Method)
   [junit4]   2>         at sun.nio.ch.WindowsSelectorImpl.setWakeupSocket(WindowsSelectorImpl.java:464)
   [junit4]   2>         at sun.nio.ch.WindowsSelectorImpl.wakeup(WindowsSelectorImpl.java:606)
   [junit4]   2>         at java.nio.channels.spi.AbstractSelector$1.interrupt(AbstractSelector.java:213)
   [junit4]   2>         at java.nio.channels.spi.AbstractSelector.begin(AbstractSelector.java:219)
   [junit4]   2>         at sun.nio.ch.WindowsSelectorImpl.doSelect(WindowsSelectorImpl.java:157)
   [junit4]   2>         at sun.nio.ch.SelectorImpl.lockAndDoSelect(SelectorImpl.java:86)
   [junit4]   2>         at sun.nio.ch.SelectorImpl.select(SelectorImpl.java:97)
   [junit4]   2>         at org.apache.zookeeper.server.NIOServerCnxnFactory.run(NIOServerCnxnFactory.java:178)
   [junit4]   2>         at java.lang.Thread.run(Thread.java:745)
   [junit4]   2> NOTE: test params are: codec=Asserting(Lucene54), sim=RandomSimilarity(queryNorm=true,coord=no): {}, locale=nl-BE, timezone=America/Yellowknife
   [junit4]   2> NOTE: Windows 7 6.1 x86/Oracle Corporation 1.8.0_72 (32-bit)/cpus=3,threads=2,free=63775976,total=210747392
   [junit4]   2> NOTE: All tests run in this JVM: [TestSolrConfigHandlerCloud, TestSolr4Spatial2, PingRequestHandlerTest, LeaderElectionTest, TestChildDocTransformer, DeleteInactiveReplicaTest, TestCloudSchemaless, SliceStateTest, HdfsThreadLeakTest, PeerSyncTest, TestDFRSimilarityFactory, TestDocSet, JsonLoaderTest, TestStressVersions, TestClassicSimilarityFactory, TestDistribDocBasedVersion, DistributedFacetPivotLargeTest, TestCloudManagedSchema, UnloadDistributedZkTest, RemoteQueryErrorTest, RankQueryTest, TestAuthenticationFramework]
   [junit4]   2> NOTE: reproduce with: ant test  -Dtestcase=TestAuthenticationFramework -Dtests.seed=E47929A367D31986 -Dtests.slow=true -Dtests.locale=nl-BE -Dtests.timezone=America/Yellowknife -Dtests.asserts=true -Dtests.file.encoding=Cp1252
   [junit4] ERROR   0.00s J0 | TestAuthenticationFramework (suite) <<<
   [junit4]    > Throwable #1: com.carrotsearch.randomizedtesting.ThreadLeakError: 5 threads leaked from SUITE scope at org.apache.solr.cloud.TestAuthenticationFramework: 
   [junit4]    >    1) Thread[id=5052, name=SyncThread:0, state=WAITING, group=TGRP-TestAuthenticationFramework]
   [junit4]    >         at sun.misc.Unsafe.park(Native Method)
   [junit4]    >         at java.util.concurrent.locks.LockSupport.park(LockSupport.java:175)
   [junit4]    >         at java.util.concurrent.locks.AbstractQueuedSynchronizer$ConditionObject.await(AbstractQueuedSynchronizer.java:2039)
   [junit4]    >         at java.util.concurrent.LinkedBlockingQueue.take(LinkedBlockingQueue.java:442)
   [junit4]    >         at org.apache.zookeeper.server.SyncRequestProcessor.run(SyncRequestProcessor.java:127)
   [junit4]    >    2) Thread[id=5051, name=SessionTracker, state=TIMED_WAITING, group=TGRP-TestAuthenticationFramework]
   [junit4]    >         at java.lang.Object.wait(Native Method)
   [junit4]    >         at org.apache.zookeeper.server.SessionTrackerImpl.run(SessionTrackerImpl.java:146)
   [junit4]    >    3) Thread[id=5049, name=Thread-1598, state=WAITING, group=TGRP-TestAuthenticationFramework]
   [junit4]    >         at java.lang.Object.wait(Native Method)
   [junit4]    >         at java.lang.Thread.join(Thread.java:1245)
   [junit4]    >         at java.lang.Thread.join(Thread.java:1319)
   [junit4]    >         at org.apache.zookeeper.server.NIOServerCnxnFactory.join(NIOServerCnxnFactory.java:302)
   [junit4]    >         at org.apache.solr.cloud.ZkTestServer$ZKServerMain.runFromConfig(ZkTestServer.java:310)
   [junit4]    >         at org.apache.solr.cloud.ZkTestServer$2.run(ZkTestServer.java:491)
   [junit4]    >    4) Thread[id=5050, name=NIOServerCxn.Factory:0.0.0.0/0.0.0.0:0, state=RUNNABLE, group=TGRP-TestAuthenticationFramework]
   [junit4]    >         at sun.nio.ch.WindowsSelectorImpl$SubSelector.poll0(Native Method)
   [junit4]    >         at sun.nio.ch.WindowsSelectorImpl$SubSelector.poll(WindowsSelectorImpl.java:296)
   [junit4]    >         at sun.nio.ch.WindowsSelectorImpl$SubSelector.access$400(WindowsSelectorImpl.java:278)
   [junit4]    >         at sun.nio.ch.WindowsSelectorImpl.doSelect(WindowsSelectorImpl.java:159)
   [junit4]    >         at sun.nio.ch.SelectorImpl.lockAndDoSelect(SelectorImpl.java:86)
   [junit4]    >         at sun.nio.ch.SelectorImpl.select(SelectorImpl.java:97)
   [junit4]    >         at org.apache.zookeeper.server.NIOServerCnxnFactory.run(NIOServerCnxnFactory.java:178)
   [junit4]    >         at java.lang.Thread.run(Thread.java:745)
   [junit4]    >    5) Thread[id=5053, name=ProcessThread(sid:0 cport:-1):, state=WAITING, group=TGRP-TestAuthenticationFramework]
   [junit4]    >         at sun.misc.Unsafe.park(Native Method)
   [junit4]    >         at java.util.concurrent.locks.LockSupport.park(LockSupport.java:175)
   [junit4]    >         at java.util.concurrent.locks.AbstractQueuedSynchronizer$ConditionObject.await(AbstractQueuedSynchronizer.java:2039)
   [junit4]    >         at java.util.concurrent.LinkedBlockingQueue.take(LinkedBlockingQueue.java:442)
   [junit4]    >         at org.apache.zookeeper.server.PrepRequestProcessor.run(PrepRequestProcessor.java:120)
   [junit4]    > 	at __randomizedtesting.SeedInfo.seed([E47929A367D31986]:0)Throwable #2: com.carrotsearch.randomizedtesting.ThreadLeakError: There are still zombie threads that couldn't be terminated:
   [junit4]    >    1) Thread[id=5050, name=NIOServerCxn.Factory:0.0.0.0/0.0.0.0:0, state=RUNNABLE, group=TGRP-TestAuthenticationFramework]
   [junit4]    >         at sun.nio.ch.WindowsSelectorImpl.setWakeupSocket0(Native Method)
   [junit4]    >         at sun.nio.ch.WindowsSelectorImpl.setWakeupSocket(WindowsSelectorImpl.java:464)
   [junit4]    >         at sun.nio.ch.WindowsSelectorImpl.wakeup(WindowsSelectorImpl.java:606)
   [junit4]    >         at java.nio.channels.spi.AbstractSelector$1.interrupt(AbstractSelector.java:213)
   [junit4]    >         at java.nio.channels.spi.AbstractSelector.begin(AbstractSelector.java:219)
   [junit4]    >         at sun.nio.ch.WindowsSelectorImpl.doSelect(WindowsSelectorImpl.java:157)
   [junit4]    >         at sun.nio.ch.SelectorImpl.lockAndDoSelect(SelectorImpl.java:86)
   [junit4]    >         at sun.nio.ch.SelectorImpl.select(SelectorImpl.java:97)
   [junit4]    >         at org.apache.zookeeper.server.NIOServerCnxnFactory.run(NIOServerCnxnFactory.java:178)
   [junit4]    >         at java.lang.Thread.run(Thread.java:745)
   [junit4]    > 	at __randomizedtesting.SeedInfo.seed([E47929A367D31986]:0)
   [junit4] Completed [81/566 (1!)] on J0 in 211.96s, 7 tests, 1 failure, 2 errors <<< FAILURES!

[...truncated 1521 lines...]
BUILD FAILED
C:\Users\JenkinsSlave\workspace\Lucene-Solr-5.5-Windows\build.xml:750: The following error occurred while executing this line:
C:\Users\JenkinsSlave\workspace\Lucene-Solr-5.5-Windows\build.xml:694: The following error occurred while executing this line:
C:\Users\JenkinsSlave\workspace\Lucene-Solr-5.5-Windows\build.xml:59: The following error occurred while executing this line:
C:\Users\JenkinsSlave\workspace\Lucene-Solr-5.5-Windows\solr\build.xml:233: The following error occurred while executing this line:
C:\Users\JenkinsSlave\workspace\Lucene-Solr-5.5-Windows\solr\common-build.xml:534: The following error occurred while executing this line:
C:\Users\JenkinsSlave\workspace\Lucene-Solr-5.5-Windows\lucene\common-build.xml:1477: The following error occurred while executing this line:
C:\Users\JenkinsSlave\workspace\Lucene-Solr-5.5-Windows\lucene\common-build.xml:1033: There were test failures: 566 suites (7 ignored), 2277 tests, 2 suite-level errors, 1 failure, 1608 ignored (33 assumptions) [seed: E47929A367D31986]

Total time: 46 minutes 52 seconds
Build step 'Invoke Ant' marked build as failure
Archiving artifacts
[WARNINGS] Skipping publisher since build result is FAILURE
Recording test results
Email was triggered for: Failure - Any
Sending email for trigger: Failure - Any