You are viewing a plain text version of this content. The canonical link for it is here.
Posted to commits@myfaces.apache.org by Apache Jenkins Server <je...@builds.apache.org> on 2017/11/30 14:26:20 UTC
Build failed in Jenkins: Tobago Trunk #1176
See <https://builds.apache.org/job/Tobago%20Trunk/1176/display/redirect?page=changes>
Changes:
[lofwyr] TOBAGO-1782: Clean up * Exception Handling * etc.
------------------------------------------
Started by an SCM change
[EnvInject] - Loading node environment variables.
Building remotely on ubuntu-2 (ubuntu trusty) in workspace <https://builds.apache.org/job/Tobago%20Trunk/ws/>
> git rev-parse --is-inside-work-tree # timeout=10
Fetching changes from the remote Git repository
> git config remote.origin.url https://gitbox.apache.org/repos/asf/myfaces-tobago.git # timeout=10
Fetching upstream changes from https://gitbox.apache.org/repos/asf/myfaces-tobago.git
> git --version # timeout=10
> git fetch --tags --progress https://gitbox.apache.org/repos/asf/myfaces-tobago.git +refs/heads/*:refs/remotes/origin/*
> git rev-parse refs/remotes/origin/master^{commit} # timeout=10
> git rev-parse refs/remotes/origin/origin/master^{commit} # timeout=10
Checking out Revision 8dc1837905af69747b8b3d24322f46ff71bc8f21 (refs/remotes/origin/master)
> git config core.sparsecheckout # timeout=10
> git checkout -f 8dc1837905af69747b8b3d24322f46ff71bc8f21
Commit message: "TOBAGO-1782: Clean up * Exception Handling * etc."
> git rev-list 67ba08af84aa49e9fafb169b001e68ae1e99b10e # timeout=10
Parsing POMs
Downloaded artifact http://repo.maven.apache.org/maven2/org/jboss/arquillian/arquillian-bom/1.1.15.Final/arquillian-bom-1.1.15.Final.pom
Downloaded artifact http://repo.maven.apache.org/maven2/org/jboss/shrinkwrap/resolver/shrinkwrap-resolver-bom/2.2.6/shrinkwrap-resolver-bom-2.2.6.pom
Downloaded artifact http://repo.maven.apache.org/maven2/org/jboss/shrinkwrap/descriptors/shrinkwrap-descriptors-bom/2.0.0/shrinkwrap-descriptors-bom-2.0.0.pom
Downloaded artifact http://repo.maven.apache.org/maven2/org/jboss/arquillian/selenium/selenium-bom/3.7.1/selenium-bom-3.7.1.pom
Downloaded artifact http://repo.maven.apache.org/maven2/org/jboss/arquillian/extension/arquillian-drone-bom/2.4.5/arquillian-drone-bom-2.4.5.pom
Modules changed, recalculating dependency graph
Established TCP socket on 50650
maven35-agent.jar already up to date
maven35-interceptor.jar already up to date
maven3-interceptor-commons.jar already up to date
[Tobago Trunk] $ /home/jenkins/tools/java/latest1.8/bin/java -Xmx2g -Xms256m -cp /home/jenkins/jenkins-slave/maven35-agent.jar:/home/jenkins/tools/maven/latest/boot/plexus-classworlds-2.5.2.jar:/home/jenkins/tools/maven/latest/conf/logging jenkins.maven3.agent.Maven35Main /home/jenkins/tools/maven/latest/ /home/jenkins/jenkins-slave/slave.jar /home/jenkins/jenkins-slave/maven35-interceptor.jar /home/jenkins/jenkins-slave/maven3-interceptor-commons.jar 50650
<===[JENKINS REMOTING CAPACITY]===> channel started
Executing Maven: -B -f <https://builds.apache.org/job/Tobago%20Trunk/ws/pom.xml> -Dmaven.repo.local=/home/jenkins/jenkins-slave/maven-repositories/1 clean animal-sniffer:check checkstyle:check install
[INFO] Scanning for projects...
[WARNING]
[WARNING] Some problems were encountered while building the effective model for org.apache.myfaces.tobago:tobago-example-demo:war:4.0.0-SNAPSHOT
[WARNING] 'dependencyManagement.dependencies.dependency.type' for commons-codec:commons-codec:jar must be 'pom' to import the managed dependencies. @ org.apache.myfaces.tobago:tobago-example-demo:[unknown-version], <https://builds.apache.org/job/Tobago%20Trunk/ws/tobago-example/tobago-example-demo/pom.xml,> line 208, column 19
[WARNING]
[WARNING] It is highly recommended to fix these problems because they threaten the stability of your build.
[WARNING]
[WARNING] For this reason, future Maven versions might no longer support building such malformed projects.
[WARNING]
[INFO] ------------------------------------------------------------------------
[INFO] Reactor Build Order:
[INFO]
[INFO] Apache Tobago
[INFO] Tobago Tool
[INFO] Tobago Tool Annotation
[INFO] Tobago Tool Apt
[INFO] Tobago Core
[INFO] Tobago Themes
[INFO] Tobago Theme Standard
[INFO] Tobago Theme Scarborough
[INFO] Tobago Theme Speyside
[INFO] Tobago Theme Roxborough
[INFO] Tobago Examples
[INFO] Tobago Example Blank
[INFO] Tobago Example Data
[INFO] Tobago Example Demo
[INFO] Tobago Example Assembly
[INFO] Tobago Assembly
[INFO]
[INFO] ------------------------------------------------------------------------
[INFO] Building Apache Tobago 4.0.0-SNAPSHOT
[INFO] ------------------------------------------------------------------------
[INFO]
[INFO] --- maven-clean-plugin:2.6.1:clean (default-clean) @ tobago ---
[INFO] Deleting <https://builds.apache.org/job/Tobago%20Trunk/ws/target>
[INFO]
[INFO] --- animal-sniffer-maven-plugin:1.14:check (default-cli) @ tobago ---
[INFO] Checking unresolved references to org.codehaus.mojo.signature:java16:1.1
[INFO]
[INFO] --- maven-checkstyle-plugin:2.17:check (default-cli) @ tobago ---
[INFO] Starting audit...
Audit done.
[INFO]
[INFO] --- maven-enforcer-plugin:3.0.0-M1:enforce (enforce) @ tobago ---
[INFO]
[INFO] --- maven-remote-resources-plugin:1.5:process (default) @ tobago ---
[INFO]
[INFO] --- maven-site-plugin:3.6:attach-descriptor (attach-descriptor) @ tobago ---
[INFO] Attaching 'src/site/site.xml' site descriptor with classifier 'site'.
[INFO]
[INFO] --- maven-install-plugin:2.5.2:install (default-install) @ tobago ---
[INFO] Installing <https://builds.apache.org/job/Tobago%20Trunk/ws/pom.xml> to /home/jenkins/jenkins-slave/maven-repositories/1/org/apache/myfaces/tobago/tobago/4.0.0-SNAPSHOT/tobago-4.0.0-SNAPSHOT.pom
[INFO] Installing <https://builds.apache.org/job/Tobago%20Trunk/ws/target/tobago-4.0.0-SNAPSHOT-site.xml> to /home/jenkins/jenkins-slave/maven-repositories/1/org/apache/myfaces/tobago/tobago/4.0.0-SNAPSHOT/tobago-4.0.0-SNAPSHOT-site.xml
[INFO]
[INFO] ------------------------------------------------------------------------
[INFO] Building Tobago Tool 4.0.0-SNAPSHOT
[INFO] ------------------------------------------------------------------------
[INFO]
[INFO] --- maven-clean-plugin:2.6.1:clean (default-clean) @ tobago-tool ---
[INFO] Deleting <https://builds.apache.org/job/Tobago%20Trunk/ws/tobago-tool/target>
[INFO]
[INFO] --- animal-sniffer-maven-plugin:1.14:check (default-cli) @ tobago-tool ---
[INFO] Checking unresolved references to org.codehaus.mojo.signature:java16:1.1
[INFO]
[INFO] --- maven-checkstyle-plugin:2.17:check (default-cli) @ tobago-tool ---
[INFO] Starting audit...
Audit done.
[INFO]
[INFO] --- maven-enforcer-plugin:3.0.0-M1:enforce (enforce) @ tobago-tool ---
[INFO]
[INFO] --- maven-remote-resources-plugin:1.5:process (default) @ tobago-tool ---
[INFO]
[INFO] --- maven-site-plugin:3.6:attach-descriptor (attach-descriptor) @ tobago-tool ---
[INFO] No site descriptor found: nothing to attach.
[INFO]
[INFO] --- maven-install-plugin:2.5.2:install (default-install) @ tobago-tool ---
[INFO] Installing <https://builds.apache.org/job/Tobago%20Trunk/ws/tobago-tool/pom.xml> to /home/jenkins/jenkins-slave/maven-repositories/1/org/apache/myfaces/tobago/tobago-tool/4.0.0-SNAPSHOT/tobago-tool-4.0.0-SNAPSHOT.pom
[INFO]
[INFO] ------------------------------------------------------------------------
[INFO] Building Tobago Tool Annotation 4.0.0-SNAPSHOT
[INFO] ------------------------------------------------------------------------
[INFO]
[INFO] --- maven-clean-plugin:2.6.1:clean (default-clean) @ tobago-tool-annotation ---
[INFO] Deleting <https://builds.apache.org/job/Tobago%20Trunk/ws/tobago-tool/tobago-tool-annotation/target>
[INFO]
[INFO] --- animal-sniffer-maven-plugin:1.14:check (default-cli) @ tobago-tool-annotation ---
[INFO] Checking unresolved references to org.codehaus.mojo.signature:java16:1.1
[INFO]
[INFO] --- maven-checkstyle-plugin:2.17:check (default-cli) @ tobago-tool-annotation ---
[INFO] Starting audit...
Audit done.
[INFO]
[INFO] --- maven-enforcer-plugin:3.0.0-M1:enforce (enforce) @ tobago-tool-annotation ---
[INFO]
[INFO] --- maven-remote-resources-plugin:1.5:process (default) @ tobago-tool-annotation ---
[INFO]
[INFO] --- maven-resources-plugin:2.7:resources (default-resources) @ tobago-tool-annotation ---
[INFO] Using 'UTF-8' encoding to copy filtered resources.
[INFO] skip non existing resourceDirectory <https://builds.apache.org/job/Tobago%20Trunk/ws/tobago-tool/tobago-tool-annotation/src/main/resources>
[INFO] Copying 3 resources
[INFO]
[INFO] --- maven-compiler-plugin:3.6.2:compile (default-compile) @ tobago-tool-annotation ---
[INFO] Compiling 17 source files to <https://builds.apache.org/job/Tobago%20Trunk/ws/tobago-tool/tobago-tool-annotation/target/classes>
[INFO]
[INFO] --- maven-resources-plugin:2.7:testResources (default-testResources) @ tobago-tool-annotation ---
[INFO] Using 'UTF-8' encoding to copy filtered resources.
[INFO] skip non existing resourceDirectory <https://builds.apache.org/job/Tobago%20Trunk/ws/tobago-tool/tobago-tool-annotation/src/test/resources>
[INFO] Copying 3 resources
[INFO]
[INFO] --- maven-compiler-plugin:3.6.2:testCompile (default-testCompile) @ tobago-tool-annotation ---
[INFO] No sources to compile
[INFO]
[INFO] --- maven-surefire-plugin:2.19.1:test (default-test) @ tobago-tool-annotation ---
[JENKINS] Recording test results
[INFO]
[INFO] --- maven-jar-plugin:3.0.2:jar (default-jar) @ tobago-tool-annotation ---
[INFO] Building jar: <https://builds.apache.org/job/Tobago%20Trunk/ws/tobago-tool/tobago-tool-annotation/target/tobago-tool-annotation-4.0.0-SNAPSHOT.jar>
[INFO]
[INFO] --- maven-site-plugin:3.6:attach-descriptor (attach-descriptor) @ tobago-tool-annotation ---
[INFO] Skipping because packaging 'jar' is not pom.
[INFO]
[INFO] --- maven-install-plugin:2.5.2:install (default-install) @ tobago-tool-annotation ---
[INFO] Installing <https://builds.apache.org/job/Tobago%20Trunk/ws/tobago-tool/tobago-tool-annotation/target/tobago-tool-annotation-4.0.0-SNAPSHOT.jar> to /home/jenkins/jenkins-slave/maven-repositories/1/org/apache/myfaces/tobago/tobago-tool-annotation/4.0.0-SNAPSHOT/tobago-tool-annotation-4.0.0-SNAPSHOT.jar
[INFO] Installing <https://builds.apache.org/job/Tobago%20Trunk/ws/tobago-tool/tobago-tool-annotation/pom.xml> to /home/jenkins/jenkins-slave/maven-repositories/1/org/apache/myfaces/tobago/tobago-tool-annotation/4.0.0-SNAPSHOT/tobago-tool-annotation-4.0.0-SNAPSHOT.pom
[INFO]
[INFO] ------------------------------------------------------------------------
[INFO] Building Tobago Tool Apt 4.0.0-SNAPSHOT
[INFO] ------------------------------------------------------------------------
[INFO] Downloading from central: https://repo.maven.apache.org/maven2/org/apache/commons/commons-lang3/3.7/commons-lang3-3.7.pom
[INFO] Downloaded from central: https://repo.maven.apache.org/maven2/org/apache/commons/commons-lang3/3.7/commons-lang3-3.7.pom (28 kB at 87 kB/s)
[INFO] Downloading from central: https://repo.maven.apache.org/maven2/org/apache/commons/commons-lang3/3.7/commons-lang3-3.7.jar
[INFO] Downloaded from central: https://repo.maven.apache.org/maven2/org/apache/commons/commons-lang3/3.7/commons-lang3-3.7.jar (500 kB at 5.8 MB/s)
[INFO]
[INFO] --- maven-clean-plugin:2.6.1:clean (default-clean) @ tobago-tool-apt ---
[INFO] Deleting <https://builds.apache.org/job/Tobago%20Trunk/ws/tobago-tool/tobago-tool-apt/target>
[INFO]
[INFO] --- animal-sniffer-maven-plugin:1.14:check (default-cli) @ tobago-tool-apt ---
[INFO] Checking unresolved references to org.codehaus.mojo.signature:java16:1.0
[INFO]
[INFO] --- maven-checkstyle-plugin:2.17:check (default-cli) @ tobago-tool-apt ---
[INFO] Starting audit...
<https://builds.apache.org/job/Tobago%20Trunk/ws/tobago-tool/tobago-tool-apt/src/main/java/org/apache/myfaces/tobago/apt/processor/ClassesGenerator.java>:133: error: Line is longer than 120 characters (found 126).
Audit done.
[INFO] There is 1 error reported by Checkstyle 6.11.2 with tobago/checkstyle.xml ruleset.
[ERROR] src/main/java/org/apache/myfaces/tobago/apt/processor/ClassesGenerator.java:[133] (sizes) LineLength: Line is longer than 120 characters (found 126).
[INFO] ------------------------------------------------------------------------
[INFO] Reactor Summary:
[INFO]
[INFO] Apache Tobago ...................................... SUCCESS [ 8.619 s]
[INFO] Tobago Tool ........................................ SUCCESS [ 2.460 s]
[INFO] Tobago Tool Annotation ............................. SUCCESS [ 6.130 s]
[INFO] Tobago Tool Apt .................................... FAILURE [ 3.221 s]
[INFO] Tobago Core ........................................ SKIPPED
[INFO] Tobago Themes ...................................... SKIPPED
[INFO] Tobago Theme Standard .............................. SKIPPED
[INFO] Tobago Theme Scarborough ........................... SKIPPED
[INFO] Tobago Theme Speyside .............................. SKIPPED
[INFO] Tobago Theme Roxborough ............................ SKIPPED
[INFO] Tobago Examples .................................... SKIPPED
[INFO] Tobago Example Blank ............................... SKIPPED
[INFO] Tobago Example Data ................................ SKIPPED
[INFO] Tobago Example Demo ................................ SKIPPED
[INFO] Tobago Example Assembly ............................ SKIPPED
[INFO] Tobago Assembly .................................... SKIPPED
[INFO] ------------------------------------------------------------------------
[INFO] BUILD FAILURE
[INFO] ------------------------------------------------------------------------
[INFO] Total time: 42.897 s
[INFO] Finished at: 2017-11-30T14:26:11Z
[INFO] Final Memory: 41M/559M
[INFO] ------------------------------------------------------------------------
[ERROR] Failed to execute goal org.apache.maven.plugins:maven-checkstyle-plugin:2.17:check (default-cli) on project tobago-tool-apt: You have 1 Checkstyle violation. -> [Help 1]
[ERROR]
[ERROR] To see the full stack trace of the errors, re-run Maven with the -e switch.
[ERROR] Re-run Maven using the -X switch to enable full debug logging.
[ERROR]
[ERROR] For more information about the errors and possible solutions, please read the following articles:
[ERROR] [Help 1] http://cwiki.apache.org/confluence/display/MAVEN/MojoFailureException
[ERROR]
[ERROR] After correcting the problems, you can resume the build with the command
[ERROR] mvn <goals> -rf :tobago-tool-apt
[JENKINS] Archiving <https://builds.apache.org/job/Tobago%20Trunk/ws/tobago-theme/pom.xml> to org.apache.myfaces.tobago/tobago-theme/4.0.0-SNAPSHOT/tobago-theme-4.0.0-SNAPSHOT.pom
[JENKINS] Archiving <https://builds.apache.org/job/Tobago%20Trunk/ws/tobago-example/tobago-example-blank/pom.xml> to org.apache.myfaces.tobago/tobago-example-blank/4.0.0-SNAPSHOT/tobago-example-blank-4.0.0-SNAPSHOT.pom
Sending e-mails to: commits@myfaces.apache.org
ERROR: Failed to parse POMs
hudson.util.IOException2: java.lang.InterruptedException
stream=1f8b08000000000000008d55c172db3610edad33fa855eb63cc51d9354d2cca4e3caca288935e1d4a132269dd4270f44ae28d824c0009028dd92dedb7feac7f43fb200499b4aec99ea2201d87d786fdf2ef4f9af9ffef9f2e53fa98a80d52c5b6350ed572c431d18b964850cdb2f1f77acaa4bf4972513b7e1f3601c8cfd249ebd4fde2ed20763fcc398a096d5d1df9397bbaa842d2acda538f59e06630f506432e7a238f52ed3b9ff9bf7723a9afcecfb23f805ce798642630e46825923cc1c4348e4ca344c21cce546e4cc10163c9925f323a0252a9002412aa8a4428b924961145f6e0ced952d22b0422156288c0e001244071f2fd2e8f519ac78899073dd26d1ed0d376b0b64d65c4323d52dac088ae539b757b312b8a08daa25a2b060caeaa17bebbde2c5da806c04495ef33ab030a95592cc7b2ebac575b792ce2bb9e9640c14778538860f6de9e05930b6504f6c8cd79d7a47bfc39eb22bb607210d6c340ea07197616d882af122973813190e94dddd41f5b8ea40e4d2308a674e09c8d5300c98a1449beb3e6b63ea93306c9aa66f23eaa8b057189e535de3e4cc6f69dbac4b51a2d654ad4f1baea8c6cb3db09a68656c49644bd658079d4bce7da2d1282ab7288e4177f65b98a14df755eb3992f66100d58d09f06609448907af6649941c5b908f51fa767199c2c7d9c5c52c4ea3b3041617f07a11bf89d26811d36a0eb3f80afe88e237c7805433ba0777b5b20a8826b7f5c4dc99dbf7524fc1768a5deb1a33bee2194913c586150885a43910b6516a5415d7d6574d04730b53f28a1bd750fa7b5dc1c8f769486a256f3033402325f4a9d75950b12d8aa109ef17efda79f5dac8939de677d1d6b0e65717f76c3c7e1afef9ee3ca1c48af95c68637b84b2343fd16ef35c668ed3ffb80c1e8b701bfef6f9f5f87a1cec74ee4d4700934ae65876cd3d750093f060cf06d564ba30f6272d0a253775944f1f7db926611fd2263065389d1bda387caf26e1e0a88ddd0e99dcbd6193703b6013ded3791cbb7d0bbfbd819464b7ac20efa7d4c816a95fda43c12a9ca60e06ce5a1878d5c2b8231b93a3ce14afad19d319545cf08adea12ea91b247b184cc261e8c8e62e37bcec85ae38bd5fb1457d98f7fdb993dca5b60c6aa4c6141947dd81d1ab0d82069646cdb67db5157083c6ec4fd446806d59177597b86f371ef6b2402549940cece0e86fbc3cac781feadf6439bfa6ff946b9bf380abe1e1d583b5d3302223da919a8e7ea0cf8fffbe987efe0ada15bf7120070000
at com.cloudbees.jenkins.plugins.jsync.archiver.JSyncArtifactManager.inflate(JSyncArtifactManager.java:286)
at com.cloudbees.jenkins.plugins.jsync.archiver.JSyncArtifactManager.remoteSync(JSyncArtifactManager.java:155)
at com.cloudbees.jenkins.plugins.jsync.archiver.JSyncArtifactManager.archive(JSyncArtifactManager.java:76)
at hudson.maven.MavenBuild$ProxyImpl.performArchiving(MavenBuild.java:512)
at hudson.maven.MavenModuleSetBuild$MavenModuleSetBuildExecution.doRun(MavenModuleSetBuild.java:881)
at hudson.model.AbstractBuild$AbstractBuildExecution.run(AbstractBuild.java:496)
at hudson.model.Run.execute(Run.java:1737)
at hudson.maven.MavenModuleSetBuild.run(MavenModuleSetBuild.java:543)
at hudson.model.ResourceController.execute(ResourceController.java:97)
at hudson.model.Executor.run(Executor.java:419)
Caused by: java.io.IOException: java.lang.InterruptedException
at hudson.remoting.FastPipedInputStream.read(FastPipedInputStream.java:177)
at hudson.remoting.FastPipedInputStream.read(FastPipedInputStream.java:146)
at hudson.util.HeadBufferingStream.read(HeadBufferingStream.java:53)
at java.util.zip.CheckedInputStream.read(CheckedInputStream.java:59)
at java.util.zip.GZIPInputStream.readUByte(GZIPInputStream.java:266)
at java.util.zip.GZIPInputStream.readUShort(GZIPInputStream.java:258)
at java.util.zip.GZIPInputStream.readHeader(GZIPInputStream.java:164)
at java.util.zip.GZIPInputStream.<init>(GZIPInputStream.java:79)
at com.cloudbees.jenkins.plugins.jsync.archiver.JSyncArtifactManager.inflate(JSyncArtifactManager.java:282)
... 9 more
Caused by: java.lang.InterruptedException
at java.lang.Object.wait(Native Method)
at hudson.remoting.FastPipedInputStream.read(FastPipedInputStream.java:175)
... 17 more
channel stopped
[JIRA] Updating issue TOBAGO-1782
Jenkins build is back to normal : Tobago Trunk #1183
Posted by Apache Jenkins Server <je...@builds.apache.org>.
See <https://builds.apache.org/job/Tobago%20Trunk/1183/display/redirect?page=changes>
Build failed in Jenkins: Tobago Trunk #1182
Posted by Apache Jenkins Server <je...@builds.apache.org>.
See <https://builds.apache.org/job/Tobago%20Trunk/1182/display/redirect>
------------------------------------------
[...truncated 230.16 KB...]
[INFO] Copying 3 resources
[INFO]
[INFO] --- maven-compiler-plugin:3.6.2:compile (default-compile) @ tobago-theme-speyside ---
[INFO] No sources to compile
[INFO]
[INFO] --- maven-antrun-plugin:1.8:run (set-version) @ tobago-theme-speyside ---
[INFO] Executing tasks
main:
[INFO] Executed tasks
[INFO]
[INFO] --- maven-resources-plugin:2.7:testResources (default-testResources) @ tobago-theme-speyside ---
[INFO] Using 'UTF-8' encoding to copy filtered resources.
[INFO] skip non existing resourceDirectory <https://builds.apache.org/job/Tobago%20Trunk/ws/tobago-theme/tobago-theme-speyside/src/test/resources>
[INFO] Copying 3 resources
[INFO]
[INFO] --- maven-compiler-plugin:3.6.2:testCompile (default-testCompile) @ tobago-theme-speyside ---
[INFO] No sources to compile
[INFO]
[INFO] --- maven-surefire-plugin:2.19.1:test (default-test) @ tobago-theme-speyside ---
[JENKINS] Recording test results
[INFO]
[INFO] --- maven-jar-plugin:3.0.2:jar (default-jar) @ tobago-theme-speyside ---
[INFO] Building jar: <https://builds.apache.org/job/Tobago%20Trunk/ws/tobago-theme/tobago-theme-speyside/target/tobago-theme-speyside-4.0.0-SNAPSHOT.jar>
[INFO]
[INFO] --- maven-site-plugin:3.6:attach-descriptor (attach-descriptor) @ tobago-theme-speyside ---
[INFO] Skipping because packaging 'jar' is not pom.
[INFO]
[INFO] --- maven-install-plugin:2.5.2:install (default-install) @ tobago-theme-speyside ---
[INFO] Installing <https://builds.apache.org/job/Tobago%20Trunk/ws/tobago-theme/tobago-theme-speyside/target/tobago-theme-speyside-4.0.0-SNAPSHOT.jar> to /home/jenkins/jenkins-slave/maven-repositories/0/org/apache/myfaces/tobago/tobago-theme-speyside/4.0.0-SNAPSHOT/tobago-theme-speyside-4.0.0-SNAPSHOT.jar
[INFO] Installing <https://builds.apache.org/job/Tobago%20Trunk/ws/tobago-theme/tobago-theme-speyside/pom.xml> to /home/jenkins/jenkins-slave/maven-repositories/0/org/apache/myfaces/tobago/tobago-theme-speyside/4.0.0-SNAPSHOT/tobago-theme-speyside-4.0.0-SNAPSHOT.pom
[INFO]
[INFO] ------------------------------------------------------------------------
[INFO] Building Tobago Theme Roxborough 4.0.0-SNAPSHOT
[INFO] ------------------------------------------------------------------------
[INFO]
[INFO] --- maven-clean-plugin:2.6.1:clean (default-clean) @ tobago-theme-roxborough ---
[INFO] Deleting <https://builds.apache.org/job/Tobago%20Trunk/ws/tobago-theme/tobago-theme-roxborough/target>
[INFO]
[INFO] --- animal-sniffer-maven-plugin:1.14:check (default-cli) @ tobago-theme-roxborough ---
[INFO] Checking unresolved references to org.codehaus.mojo.signature:java16:1.1
[INFO]
[INFO] --- maven-checkstyle-plugin:2.17:check (default-cli) @ tobago-theme-roxborough ---
[INFO] Starting audit...
Audit done.
[INFO]
[INFO] --- maven-enforcer-plugin:3.0.0-M1:enforce (enforce) @ tobago-theme-roxborough ---
[INFO]
[INFO] --- maven-remote-resources-plugin:1.5:process (default) @ tobago-theme-roxborough ---
[INFO]
[INFO] --- maven-resources-plugin:2.7:resources (default-resources) @ tobago-theme-roxborough ---
[INFO] Using 'UTF-8' encoding to copy filtered resources.
[INFO] Copying 1 resource
[INFO] Copying 10 resources
[INFO] Copying 3 resources
[INFO]
[INFO] --- maven-compiler-plugin:3.6.2:compile (default-compile) @ tobago-theme-roxborough ---
[INFO] No sources to compile
[INFO]
[INFO] --- maven-antrun-plugin:1.8:run (set-version) @ tobago-theme-roxborough ---
[INFO] Executing tasks
main:
[INFO] Executed tasks
[INFO]
[INFO] --- maven-resources-plugin:2.7:testResources (default-testResources) @ tobago-theme-roxborough ---
[INFO] Using 'UTF-8' encoding to copy filtered resources.
[INFO] skip non existing resourceDirectory <https://builds.apache.org/job/Tobago%20Trunk/ws/tobago-theme/tobago-theme-roxborough/src/test/resources>
[INFO] Copying 3 resources
[INFO]
[INFO] --- maven-compiler-plugin:3.6.2:testCompile (default-testCompile) @ tobago-theme-roxborough ---
[INFO] No sources to compile
[INFO]
[INFO] --- maven-surefire-plugin:2.19.1:test (default-test) @ tobago-theme-roxborough ---
[JENKINS] Recording test results
[INFO]
[INFO] --- maven-jar-plugin:3.0.2:jar (default-jar) @ tobago-theme-roxborough ---
[INFO] Building jar: <https://builds.apache.org/job/Tobago%20Trunk/ws/tobago-theme/tobago-theme-roxborough/target/tobago-theme-roxborough-4.0.0-SNAPSHOT.jar>
[INFO]
[INFO] --- maven-site-plugin:3.6:attach-descriptor (attach-descriptor) @ tobago-theme-roxborough ---
[INFO] Skipping because packaging 'jar' is not pom.
[INFO]
[INFO] --- maven-install-plugin:2.5.2:install (default-install) @ tobago-theme-roxborough ---
[INFO] Installing <https://builds.apache.org/job/Tobago%20Trunk/ws/tobago-theme/tobago-theme-roxborough/target/tobago-theme-roxborough-4.0.0-SNAPSHOT.jar> to /home/jenkins/jenkins-slave/maven-repositories/0/org/apache/myfaces/tobago/tobago-theme-roxborough/4.0.0-SNAPSHOT/tobago-theme-roxborough-4.0.0-SNAPSHOT.jar
[INFO] Installing <https://builds.apache.org/job/Tobago%20Trunk/ws/tobago-theme/tobago-theme-roxborough/pom.xml> to /home/jenkins/jenkins-slave/maven-repositories/0/org/apache/myfaces/tobago/tobago-theme-roxborough/4.0.0-SNAPSHOT/tobago-theme-roxborough-4.0.0-SNAPSHOT.pom
[INFO]
[INFO] ------------------------------------------------------------------------
[INFO] Building Tobago Examples 4.0.0-SNAPSHOT
[INFO] ------------------------------------------------------------------------
[INFO]
[INFO] --- maven-clean-plugin:2.6.1:clean (default-clean) @ tobago-example ---
[INFO] Deleting <https://builds.apache.org/job/Tobago%20Trunk/ws/tobago-example/target>
[INFO]
[INFO] --- animal-sniffer-maven-plugin:1.14:check (default-cli) @ tobago-example ---
[INFO] Checking unresolved references to org.codehaus.mojo.signature:java16:1.1
[INFO]
[INFO] --- maven-checkstyle-plugin:2.17:check (default-cli) @ tobago-example ---
[INFO] Starting audit...
Audit done.
[INFO]
[INFO] --- maven-enforcer-plugin:3.0.0-M1:enforce (enforce) @ tobago-example ---
[INFO]
[INFO] --- maven-remote-resources-plugin:1.5:process (default) @ tobago-example ---
[INFO]
[INFO] --- maven-site-plugin:3.6:attach-descriptor (attach-descriptor) @ tobago-example ---
[INFO] No site descriptor found: nothing to attach.
[INFO]
[INFO] --- maven-install-plugin:2.5.2:install (default-install) @ tobago-example ---
[INFO] Installing <https://builds.apache.org/job/Tobago%20Trunk/ws/tobago-example/pom.xml> to /home/jenkins/jenkins-slave/maven-repositories/0/org/apache/myfaces/tobago/tobago-example/4.0.0-SNAPSHOT/tobago-example-4.0.0-SNAPSHOT.pom
[INFO]
[INFO] ------------------------------------------------------------------------
[INFO] Building Tobago Example Blank 4.0.0-SNAPSHOT
[INFO] ------------------------------------------------------------------------
[INFO]
[INFO] --- maven-clean-plugin:2.6.1:clean (default-clean) @ tobago-example-blank ---
[INFO] Deleting <https://builds.apache.org/job/Tobago%20Trunk/ws/tobago-example/tobago-example-blank/target>
[INFO]
[INFO] --- animal-sniffer-maven-plugin:1.14:check (default-cli) @ tobago-example-blank ---
[INFO] Checking unresolved references to org.codehaus.mojo.signature:java16:1.1
[INFO]
[INFO] --- maven-checkstyle-plugin:2.17:check (default-cli) @ tobago-example-blank ---
[INFO] Starting audit...
Audit done.
[INFO]
[INFO] --- maven-enforcer-plugin:3.0.0-M1:enforce (enforce) @ tobago-example-blank ---
[INFO]
[INFO] --- maven-remote-resources-plugin:1.5:process (default) @ tobago-example-blank ---
[INFO]
[INFO] --- maven-resources-plugin:2.7:resources (default-resources) @ tobago-example-blank ---
[INFO] Using 'UTF-8' encoding to copy filtered resources.
[INFO] Copying 1 resource
[INFO] Copying 3 resources
[INFO]
[INFO] --- maven-compiler-plugin:3.6.2:compile (default-compile) @ tobago-example-blank ---
[INFO] Compiling 1 source file to <https://builds.apache.org/job/Tobago%20Trunk/ws/tobago-example/tobago-example-blank/target/classes>
[INFO]
[INFO] --- maven-resources-plugin:2.7:testResources (default-testResources) @ tobago-example-blank ---
[INFO] Using 'UTF-8' encoding to copy filtered resources.
[INFO] skip non existing resourceDirectory <https://builds.apache.org/job/Tobago%20Trunk/ws/tobago-example/tobago-example-blank/src/test/resources>
[INFO] Copying 3 resources
[INFO]
[INFO] --- maven-compiler-plugin:3.6.2:testCompile (default-testCompile) @ tobago-example-blank ---
[INFO] No sources to compile
[INFO]
[INFO] --- maven-surefire-plugin:2.19.1:test (default-test) @ tobago-example-blank ---
[JENKINS] Recording test results
[INFO]
[INFO] --- maven-war-plugin:3.1.0:war (default-war) @ tobago-example-blank ---
[INFO] Packaging webapp
[INFO] Assembling webapp [tobago-example-blank] in [<https://builds.apache.org/job/Tobago%20Trunk/ws/tobago-example/tobago-example-blank/target/tobago-example-blank]>
[INFO] Processing war project
[INFO] Copying webapp resources [<https://builds.apache.org/job/Tobago%20Trunk/ws/tobago-example/tobago-example-blank/src/main/webapp]>
[INFO] Webapp assembled in [51 msecs]
[INFO] Building war: <https://builds.apache.org/job/Tobago%20Trunk/ws/tobago-example/tobago-example-blank/target/tobago-example-blank.war>
[INFO]
[INFO] --- maven-site-plugin:3.6:attach-descriptor (attach-descriptor) @ tobago-example-blank ---
[INFO] Skipping because packaging 'war' is not pom.
[INFO]
[INFO] --- maven-install-plugin:2.5.2:install (default-install) @ tobago-example-blank ---
[INFO] Installing <https://builds.apache.org/job/Tobago%20Trunk/ws/tobago-example/tobago-example-blank/target/tobago-example-blank.war> to /home/jenkins/jenkins-slave/maven-repositories/0/org/apache/myfaces/tobago/tobago-example-blank/4.0.0-SNAPSHOT/tobago-example-blank-4.0.0-SNAPSHOT.war
[INFO] Installing <https://builds.apache.org/job/Tobago%20Trunk/ws/tobago-example/tobago-example-blank/pom.xml> to /home/jenkins/jenkins-slave/maven-repositories/0/org/apache/myfaces/tobago/tobago-example-blank/4.0.0-SNAPSHOT/tobago-example-blank-4.0.0-SNAPSHOT.pom
[INFO]
[INFO] ------------------------------------------------------------------------
[INFO] Building Tobago Example Data 4.0.0-SNAPSHOT
[INFO] ------------------------------------------------------------------------
[INFO]
[INFO] --- maven-clean-plugin:2.6.1:clean (default-clean) @ tobago-example-data ---
[INFO] Deleting <https://builds.apache.org/job/Tobago%20Trunk/ws/tobago-example/tobago-example-data/target>
[INFO]
[INFO] --- animal-sniffer-maven-plugin:1.14:check (default-cli) @ tobago-example-data ---
[INFO] Checking unresolved references to org.codehaus.mojo.signature:java16:1.1
[INFO]
[INFO] --- maven-checkstyle-plugin:2.17:check (default-cli) @ tobago-example-data ---
[INFO] Starting audit...
<https://builds.apache.org/job/Tobago%20Trunk/ws/tobago-example/tobago-example-data/src/main/java/org/apache/myfaces/tobago/example/data/SolarObject.java>:252: error: Line is longer than 120 characters (found 121).
Audit done.
[INFO] There is 1 error reported by Checkstyle 6.11.2 with tobago/checkstyle.xml ruleset.
[ERROR] src/main/java/org/apache/myfaces/tobago/example/data/SolarObject.java:[252] (sizes) LineLength: Line is longer than 120 characters (found 121).
[INFO] ------------------------------------------------------------------------
[INFO] Reactor Summary:
[INFO]
[INFO] Apache Tobago ...................................... SUCCESS [ 8.361 s]
[INFO] Tobago Tool ........................................ SUCCESS [ 2.343 s]
[INFO] Tobago Tool Annotation ............................. SUCCESS [ 5.753 s]
[INFO] Tobago Tool Apt .................................... SUCCESS [01:02 min]
[INFO] Tobago Core ........................................ SUCCESS [ 19.466 s]
[INFO] Tobago Themes ...................................... SUCCESS [ 2.247 s]
[INFO] Tobago Theme Standard .............................. SUCCESS [ 11.027 s]
[INFO] Tobago Theme Scarborough ........................... SUCCESS [ 3.906 s]
[INFO] Tobago Theme Speyside .............................. SUCCESS [ 4.020 s]
[INFO] Tobago Theme Roxborough ............................ SUCCESS [ 3.836 s]
[INFO] Tobago Examples .................................... SUCCESS [ 2.473 s]
[INFO] Tobago Example Blank ............................... SUCCESS [ 4.326 s]
[INFO] Tobago Example Data ................................ FAILURE [ 1.598 s]
[INFO] Tobago Example Demo ................................ SKIPPED
[INFO] Tobago Example Assembly ............................ SKIPPED
[INFO] Tobago Assembly .................................... SKIPPED
[INFO] ------------------------------------------------------------------------
[INFO] BUILD FAILURE
[INFO] ------------------------------------------------------------------------
[INFO] Total time: 02:52 min
[INFO] Finished at: 2017-12-01T08:55:48Z
[INFO] Final Memory: 60M/840M
[INFO] ------------------------------------------------------------------------
[ERROR] Failed to execute goal org.apache.maven.plugins:maven-checkstyle-plugin:2.17:check (default-cli) on project tobago-example-data: You have 1 Checkstyle violation. -> [Help 1]
[ERROR]
[ERROR] To see the full stack trace of the errors, re-run Maven with the -e switch.
[ERROR] Re-run Maven using the -X switch to enable full debug logging.
[ERROR]
[ERROR] For more information about the errors and possible solutions, please read the following articles:
[ERROR] [Help 1] http://cwiki.apache.org/confluence/display/MAVEN/MojoFailureException
[ERROR]
[ERROR] After correcting the problems, you can resume the build with the command
[ERROR] mvn <goals> -rf :tobago-example-data
[JENKINS] Archiving <https://builds.apache.org/job/Tobago%20Trunk/ws/tobago-theme/pom.xml> to org.apache.myfaces.tobago/tobago-theme/4.0.0-SNAPSHOT/tobago-theme-4.0.0-SNAPSHOT.pom
[JENKINS] Archiving <https://builds.apache.org/job/Tobago%20Trunk/ws/tobago-example/tobago-example-blank/pom.xml> to org.apache.myfaces.tobago/tobago-example-blank/4.0.0-SNAPSHOT/tobago-example-blank-4.0.0-SNAPSHOT.pom
[JENKINS] Archiving <https://builds.apache.org/job/Tobago%20Trunk/ws/tobago-example/tobago-example-blank/target/tobago-example-blank.war> to org.apache.myfaces.tobago/tobago-example-blank/4.0.0-SNAPSHOT/tobago-example-blank-4.0.0-SNAPSHOT.war
[Fast Archiver] Compressed 8.05 MB of artifacts by 52.4% relative to #1181
[JENKINS] Archiving <https://builds.apache.org/job/Tobago%20Trunk/ws/tobago-assembly/pom.xml> to org.apache.myfaces.tobago/tobago-assembly/4.0.0-SNAPSHOT/tobago-assembly-4.0.0-SNAPSHOT.pom
[JENKINS] Archiving <https://builds.apache.org/job/Tobago%20Trunk/ws/pom.xml> to org.apache.myfaces.tobago/tobago/4.0.0-SNAPSHOT/tobago-4.0.0-SNAPSHOT.pom
[JENKINS] Archiving <https://builds.apache.org/job/Tobago%20Trunk/ws/target/tobago-4.0.0-SNAPSHOT-site.xml> to org.apache.myfaces.tobago/tobago/4.0.0-SNAPSHOT/tobago-4.0.0-SNAPSHOT-site.xml
[Fast Archiver] Compressed 52.96 KB of artifacts by 60.4% relative to #1181
[JENKINS] Archiving <https://builds.apache.org/job/Tobago%20Trunk/ws/tobago-theme/tobago-theme-standard/pom.xml> to org.apache.myfaces.tobago/tobago-theme-standard/4.0.0-SNAPSHOT/tobago-theme-standard-4.0.0-SNAPSHOT.pom
[JENKINS] Archiving <https://builds.apache.org/job/Tobago%20Trunk/ws/tobago-theme/tobago-theme-standard/target/tobago-theme-standard-4.0.0-SNAPSHOT.jar> to org.apache.myfaces.tobago/tobago-theme-standard/4.0.0-SNAPSHOT/tobago-theme-standard-4.0.0-SNAPSHOT.jar
[Fast Archiver] Compressed 1.56 MB of artifacts by 54.2% relative to #1181
[JENKINS] Archiving <https://builds.apache.org/job/Tobago%20Trunk/ws/tobago-theme/tobago-theme-scarborough/pom.xml> to org.apache.myfaces.tobago/tobago-theme-scarborough/4.0.0-SNAPSHOT/tobago-theme-scarborough-4.0.0-SNAPSHOT.pom
[JENKINS] Archiving <https://builds.apache.org/job/Tobago%20Trunk/ws/tobago-theme/tobago-theme-scarborough/target/tobago-theme-scarborough-4.0.0-SNAPSHOT.jar> to org.apache.myfaces.tobago/tobago-theme-scarborough/4.0.0-SNAPSHOT/tobago-theme-scarborough-4.0.0-SNAPSHOT.jar
[Fast Archiver] Compressed 288.45 KB of artifacts by 33.3% relative to #1181
[JENKINS] Archiving <https://builds.apache.org/job/Tobago%20Trunk/ws/tobago-example/tobago-example-assembly/pom.xml> to org.apache.myfaces.tobago/tobago-example-assembly/4.0.0-SNAPSHOT/tobago-example-assembly-4.0.0-SNAPSHOT.pom
[JENKINS] Archiving <https://builds.apache.org/job/Tobago%20Trunk/ws/tobago-theme/tobago-theme-speyside/pom.xml> to org.apache.myfaces.tobago/tobago-theme-speyside/4.0.0-SNAPSHOT/tobago-theme-speyside-4.0.0-SNAPSHOT.pom
[JENKINS] Archiving <https://builds.apache.org/job/Tobago%20Trunk/ws/tobago-theme/tobago-theme-speyside/target/tobago-theme-speyside-4.0.0-SNAPSHOT.jar> to org.apache.myfaces.tobago/tobago-theme-speyside/4.0.0-SNAPSHOT/tobago-theme-speyside-4.0.0-SNAPSHOT.jar
[Fast Archiver] Compressed 325.02 KB of artifacts by 39.4% relative to #1181
[JENKINS] Archiving <https://builds.apache.org/job/Tobago%20Trunk/ws/tobago-theme/tobago-theme-roxborough/pom.xml> to org.apache.myfaces.tobago/tobago-theme-roxborough/4.0.0-SNAPSHOT/tobago-theme-roxborough-4.0.0-SNAPSHOT.pom
[JENKINS] Archiving <https://builds.apache.org/job/Tobago%20Trunk/ws/tobago-theme/tobago-theme-roxborough/target/tobago-theme-roxborough-4.0.0-SNAPSHOT.jar> to org.apache.myfaces.tobago/tobago-theme-roxborough/4.0.0-SNAPSHOT/tobago-theme-roxborough-4.0.0-SNAPSHOT.jar
[Fast Archiver] Compressed 411.10 KB of artifacts by 31.1% relative to #1181
[JENKINS] Archiving <https://builds.apache.org/job/Tobago%20Trunk/ws/tobago-tool/tobago-tool-annotation/pom.xml> to org.apache.myfaces.tobago/tobago-tool-annotation/4.0.0-SNAPSHOT/tobago-tool-annotation-4.0.0-SNAPSHOT.pom
[JENKINS] Archiving <https://builds.apache.org/job/Tobago%20Trunk/ws/tobago-tool/tobago-tool-annotation/target/tobago-tool-annotation-4.0.0-SNAPSHOT.jar> to org.apache.myfaces.tobago/tobago-tool-annotation/4.0.0-SNAPSHOT/tobago-tool-annotation-4.0.0-SNAPSHOT.jar
[JENKINS] Archiving <https://builds.apache.org/job/Tobago%20Trunk/ws/tobago-example/pom.xml> to org.apache.myfaces.tobago/tobago-example/4.0.0-SNAPSHOT/tobago-example-4.0.0-SNAPSHOT.pom
[JENKINS] Archiving <https://builds.apache.org/job/Tobago%20Trunk/ws/tobago-example/tobago-example-data/pom.xml> to org.apache.myfaces.tobago/tobago-example-data/4.0.0-SNAPSHOT/tobago-example-data-4.0.0-SNAPSHOT.pom
[JENKINS] Archiving <https://builds.apache.org/job/Tobago%20Trunk/ws/tobago-tool/pom.xml> to org.apache.myfaces.tobago/tobago-tool/4.0.0-SNAPSHOT/tobago-tool-4.0.0-SNAPSHOT.pom
[JENKINS] Archiving <https://builds.apache.org/job/Tobago%20Trunk/ws/tobago-core/pom.xml> to org.apache.myfaces.tobago/tobago-core/4.0.0-SNAPSHOT/tobago-core-4.0.0-SNAPSHOT.pom
[JENKINS] Archiving <https://builds.apache.org/job/Tobago%20Trunk/ws/tobago-core/target/tobago-core-4.0.0-SNAPSHOT.jar> to org.apache.myfaces.tobago/tobago-core/4.0.0-SNAPSHOT/tobago-core-4.0.0-SNAPSHOT.jar
[JENKINS] Archiving <https://builds.apache.org/job/Tobago%20Trunk/ws/tobago-core/target/tobago-core-4.0.0-SNAPSHOT-tests.jar> to org.apache.myfaces.tobago/tobago-core/4.0.0-SNAPSHOT/tobago-core-4.0.0-SNAPSHOT-tests.jar
[JENKINS] Archiving <https://builds.apache.org/job/Tobago%20Trunk/ws/tobago-core/target/tobago-core-4.0.0-SNAPSHOT-sources.jar> to org.apache.myfaces.tobago/tobago-core/4.0.0-SNAPSHOT/tobago-core-4.0.0-SNAPSHOT-sources.jar
[JENKINS] Archiving <https://builds.apache.org/job/Tobago%20Trunk/ws/tobago-tool/tobago-tool-apt/pom.xml> to org.apache.myfaces.tobago/tobago-tool-apt/4.0.0-SNAPSHOT/tobago-tool-apt-4.0.0-SNAPSHOT.pom
[JENKINS] Archiving <https://builds.apache.org/job/Tobago%20Trunk/ws/tobago-tool/tobago-tool-apt/target/tobago-tool-apt-4.0.0-SNAPSHOT.jar> to org.apache.myfaces.tobago/tobago-tool-apt/4.0.0-SNAPSHOT/tobago-tool-apt-4.0.0-SNAPSHOT.jar
[JENKINS] Archiving <https://builds.apache.org/job/Tobago%20Trunk/ws/tobago-example/tobago-example-demo/pom.xml> to org.apache.myfaces.tobago/tobago-example-demo/4.0.0-SNAPSHOT/tobago-example-demo-4.0.0-SNAPSHOT.pom
Sending e-mails to: commits@myfaces.apache.org
channel stopped
Build failed in Jenkins: Tobago Trunk #1181
Posted by Apache Jenkins Server <je...@builds.apache.org>.
See <https://builds.apache.org/job/Tobago%20Trunk/1181/display/redirect?page=changes>
Changes:
[lofwyr] checkstyle
------------------------------------------
[...truncated 229.89 KB...]
[INFO]
[INFO] --- maven-compiler-plugin:3.6.2:compile (default-compile) @ tobago-theme-speyside ---
[INFO] No sources to compile
[INFO]
[INFO] --- maven-antrun-plugin:1.8:run (set-version) @ tobago-theme-speyside ---
[INFO] Executing tasks
main:
[INFO] Executed tasks
[INFO]
[INFO] --- maven-resources-plugin:2.7:testResources (default-testResources) @ tobago-theme-speyside ---
[INFO] Using 'UTF-8' encoding to copy filtered resources.
[INFO] skip non existing resourceDirectory <https://builds.apache.org/job/Tobago%20Trunk/ws/tobago-theme/tobago-theme-speyside/src/test/resources>
[INFO] Copying 3 resources
[INFO]
[INFO] --- maven-compiler-plugin:3.6.2:testCompile (default-testCompile) @ tobago-theme-speyside ---
[INFO] No sources to compile
[INFO]
[INFO] --- maven-surefire-plugin:2.19.1:test (default-test) @ tobago-theme-speyside ---
[JENKINS] Recording test results
[INFO]
[INFO] --- maven-jar-plugin:3.0.2:jar (default-jar) @ tobago-theme-speyside ---
[INFO] Building jar: <https://builds.apache.org/job/Tobago%20Trunk/ws/tobago-theme/tobago-theme-speyside/target/tobago-theme-speyside-4.0.0-SNAPSHOT.jar>
[INFO]
[INFO] --- maven-site-plugin:3.6:attach-descriptor (attach-descriptor) @ tobago-theme-speyside ---
[INFO] Skipping because packaging 'jar' is not pom.
[INFO]
[INFO] --- maven-install-plugin:2.5.2:install (default-install) @ tobago-theme-speyside ---
[INFO] Installing <https://builds.apache.org/job/Tobago%20Trunk/ws/tobago-theme/tobago-theme-speyside/target/tobago-theme-speyside-4.0.0-SNAPSHOT.jar> to /home/jenkins/jenkins-slave/maven-repositories/1/org/apache/myfaces/tobago/tobago-theme-speyside/4.0.0-SNAPSHOT/tobago-theme-speyside-4.0.0-SNAPSHOT.jar
[INFO] Installing <https://builds.apache.org/job/Tobago%20Trunk/ws/tobago-theme/tobago-theme-speyside/pom.xml> to /home/jenkins/jenkins-slave/maven-repositories/1/org/apache/myfaces/tobago/tobago-theme-speyside/4.0.0-SNAPSHOT/tobago-theme-speyside-4.0.0-SNAPSHOT.pom
[INFO]
[INFO] ------------------------------------------------------------------------
[INFO] Building Tobago Theme Roxborough 4.0.0-SNAPSHOT
[INFO] ------------------------------------------------------------------------
[INFO]
[INFO] --- maven-clean-plugin:2.6.1:clean (default-clean) @ tobago-theme-roxborough ---
[INFO] Deleting <https://builds.apache.org/job/Tobago%20Trunk/ws/tobago-theme/tobago-theme-roxborough/target>
[INFO]
[INFO] --- animal-sniffer-maven-plugin:1.14:check (default-cli) @ tobago-theme-roxborough ---
[INFO] Checking unresolved references to org.codehaus.mojo.signature:java16:1.1
[INFO]
[INFO] --- maven-checkstyle-plugin:2.17:check (default-cli) @ tobago-theme-roxborough ---
[INFO] Starting audit...
Audit done.
[INFO]
[INFO] --- maven-enforcer-plugin:3.0.0-M1:enforce (enforce) @ tobago-theme-roxborough ---
[INFO]
[INFO] --- maven-remote-resources-plugin:1.5:process (default) @ tobago-theme-roxborough ---
[INFO]
[INFO] --- maven-resources-plugin:2.7:resources (default-resources) @ tobago-theme-roxborough ---
[INFO] Using 'UTF-8' encoding to copy filtered resources.
[INFO] Copying 1 resource
[INFO] Copying 10 resources
[INFO] Copying 3 resources
[INFO]
[INFO] --- maven-compiler-plugin:3.6.2:compile (default-compile) @ tobago-theme-roxborough ---
[INFO] No sources to compile
[INFO]
[INFO] --- maven-antrun-plugin:1.8:run (set-version) @ tobago-theme-roxborough ---
[INFO] Executing tasks
main:
[INFO] Executed tasks
[INFO]
[INFO] --- maven-resources-plugin:2.7:testResources (default-testResources) @ tobago-theme-roxborough ---
[INFO] Using 'UTF-8' encoding to copy filtered resources.
[INFO] skip non existing resourceDirectory <https://builds.apache.org/job/Tobago%20Trunk/ws/tobago-theme/tobago-theme-roxborough/src/test/resources>
[INFO] Copying 3 resources
[INFO]
[INFO] --- maven-compiler-plugin:3.6.2:testCompile (default-testCompile) @ tobago-theme-roxborough ---
[INFO] No sources to compile
[INFO]
[INFO] --- maven-surefire-plugin:2.19.1:test (default-test) @ tobago-theme-roxborough ---
[JENKINS] Recording test results
[INFO]
[INFO] --- maven-jar-plugin:3.0.2:jar (default-jar) @ tobago-theme-roxborough ---
[INFO] Building jar: <https://builds.apache.org/job/Tobago%20Trunk/ws/tobago-theme/tobago-theme-roxborough/target/tobago-theme-roxborough-4.0.0-SNAPSHOT.jar>
[INFO]
[INFO] --- maven-site-plugin:3.6:attach-descriptor (attach-descriptor) @ tobago-theme-roxborough ---
[INFO] Skipping because packaging 'jar' is not pom.
[INFO]
[INFO] --- maven-install-plugin:2.5.2:install (default-install) @ tobago-theme-roxborough ---
[INFO] Installing <https://builds.apache.org/job/Tobago%20Trunk/ws/tobago-theme/tobago-theme-roxborough/target/tobago-theme-roxborough-4.0.0-SNAPSHOT.jar> to /home/jenkins/jenkins-slave/maven-repositories/1/org/apache/myfaces/tobago/tobago-theme-roxborough/4.0.0-SNAPSHOT/tobago-theme-roxborough-4.0.0-SNAPSHOT.jar
[INFO] Installing <https://builds.apache.org/job/Tobago%20Trunk/ws/tobago-theme/tobago-theme-roxborough/pom.xml> to /home/jenkins/jenkins-slave/maven-repositories/1/org/apache/myfaces/tobago/tobago-theme-roxborough/4.0.0-SNAPSHOT/tobago-theme-roxborough-4.0.0-SNAPSHOT.pom
[INFO]
[INFO] ------------------------------------------------------------------------
[INFO] Building Tobago Examples 4.0.0-SNAPSHOT
[INFO] ------------------------------------------------------------------------
[INFO]
[INFO] --- maven-clean-plugin:2.6.1:clean (default-clean) @ tobago-example ---
[INFO] Deleting <https://builds.apache.org/job/Tobago%20Trunk/ws/tobago-example/target>
[INFO]
[INFO] --- animal-sniffer-maven-plugin:1.14:check (default-cli) @ tobago-example ---
[INFO] Checking unresolved references to org.codehaus.mojo.signature:java16:1.1
[INFO]
[INFO] --- maven-checkstyle-plugin:2.17:check (default-cli) @ tobago-example ---
[INFO] Starting audit...
Audit done.
[INFO]
[INFO] --- maven-enforcer-plugin:3.0.0-M1:enforce (enforce) @ tobago-example ---
[INFO]
[INFO] --- maven-remote-resources-plugin:1.5:process (default) @ tobago-example ---
[INFO]
[INFO] --- maven-site-plugin:3.6:attach-descriptor (attach-descriptor) @ tobago-example ---
[INFO] No site descriptor found: nothing to attach.
[INFO]
[INFO] --- maven-install-plugin:2.5.2:install (default-install) @ tobago-example ---
[INFO] Installing <https://builds.apache.org/job/Tobago%20Trunk/ws/tobago-example/pom.xml> to /home/jenkins/jenkins-slave/maven-repositories/1/org/apache/myfaces/tobago/tobago-example/4.0.0-SNAPSHOT/tobago-example-4.0.0-SNAPSHOT.pom
[INFO]
[INFO] ------------------------------------------------------------------------
[INFO] Building Tobago Example Blank 4.0.0-SNAPSHOT
[INFO] ------------------------------------------------------------------------
[INFO]
[INFO] --- maven-clean-plugin:2.6.1:clean (default-clean) @ tobago-example-blank ---
[INFO] Deleting <https://builds.apache.org/job/Tobago%20Trunk/ws/tobago-example/tobago-example-blank/target>
[INFO]
[INFO] --- animal-sniffer-maven-plugin:1.14:check (default-cli) @ tobago-example-blank ---
[INFO] Checking unresolved references to org.codehaus.mojo.signature:java16:1.1
[INFO]
[INFO] --- maven-checkstyle-plugin:2.17:check (default-cli) @ tobago-example-blank ---
[INFO] Starting audit...
Audit done.
[INFO]
[INFO] --- maven-enforcer-plugin:3.0.0-M1:enforce (enforce) @ tobago-example-blank ---
[INFO]
[INFO] --- maven-remote-resources-plugin:1.5:process (default) @ tobago-example-blank ---
[INFO]
[INFO] --- maven-resources-plugin:2.7:resources (default-resources) @ tobago-example-blank ---
[INFO] Using 'UTF-8' encoding to copy filtered resources.
[INFO] Copying 1 resource
[INFO] Copying 3 resources
[INFO]
[INFO] --- maven-compiler-plugin:3.6.2:compile (default-compile) @ tobago-example-blank ---
[INFO] Compiling 1 source file to <https://builds.apache.org/job/Tobago%20Trunk/ws/tobago-example/tobago-example-blank/target/classes>
[INFO]
[INFO] --- maven-resources-plugin:2.7:testResources (default-testResources) @ tobago-example-blank ---
[INFO] Using 'UTF-8' encoding to copy filtered resources.
[INFO] skip non existing resourceDirectory <https://builds.apache.org/job/Tobago%20Trunk/ws/tobago-example/tobago-example-blank/src/test/resources>
[INFO] Copying 3 resources
[INFO]
[INFO] --- maven-compiler-plugin:3.6.2:testCompile (default-testCompile) @ tobago-example-blank ---
[INFO] No sources to compile
[INFO]
[INFO] --- maven-surefire-plugin:2.19.1:test (default-test) @ tobago-example-blank ---
[JENKINS] Recording test results
[INFO]
[INFO] --- maven-war-plugin:3.1.0:war (default-war) @ tobago-example-blank ---
[INFO] Packaging webapp
[INFO] Assembling webapp [tobago-example-blank] in [<https://builds.apache.org/job/Tobago%20Trunk/ws/tobago-example/tobago-example-blank/target/tobago-example-blank]>
[INFO] Processing war project
[INFO] Copying webapp resources [<https://builds.apache.org/job/Tobago%20Trunk/ws/tobago-example/tobago-example-blank/src/main/webapp]>
[INFO] Webapp assembled in [52 msecs]
[INFO] Building war: <https://builds.apache.org/job/Tobago%20Trunk/ws/tobago-example/tobago-example-blank/target/tobago-example-blank.war>
[INFO]
[INFO] --- maven-site-plugin:3.6:attach-descriptor (attach-descriptor) @ tobago-example-blank ---
[INFO] Skipping because packaging 'war' is not pom.
[INFO]
[INFO] --- maven-install-plugin:2.5.2:install (default-install) @ tobago-example-blank ---
[INFO] Installing <https://builds.apache.org/job/Tobago%20Trunk/ws/tobago-example/tobago-example-blank/target/tobago-example-blank.war> to /home/jenkins/jenkins-slave/maven-repositories/1/org/apache/myfaces/tobago/tobago-example-blank/4.0.0-SNAPSHOT/tobago-example-blank-4.0.0-SNAPSHOT.war
[INFO] Installing <https://builds.apache.org/job/Tobago%20Trunk/ws/tobago-example/tobago-example-blank/pom.xml> to /home/jenkins/jenkins-slave/maven-repositories/1/org/apache/myfaces/tobago/tobago-example-blank/4.0.0-SNAPSHOT/tobago-example-blank-4.0.0-SNAPSHOT.pom
[INFO]
[INFO] ------------------------------------------------------------------------
[INFO] Building Tobago Example Data 4.0.0-SNAPSHOT
[INFO] ------------------------------------------------------------------------
[INFO]
[INFO] --- maven-clean-plugin:2.6.1:clean (default-clean) @ tobago-example-data ---
[INFO] Deleting <https://builds.apache.org/job/Tobago%20Trunk/ws/tobago-example/tobago-example-data/target>
[INFO]
[INFO] --- animal-sniffer-maven-plugin:1.14:check (default-cli) @ tobago-example-data ---
[INFO] Checking unresolved references to org.codehaus.mojo.signature:java16:1.1
[INFO]
[INFO] --- maven-checkstyle-plugin:2.17:check (default-cli) @ tobago-example-data ---
[INFO] Starting audit...
<https://builds.apache.org/job/Tobago%20Trunk/ws/tobago-example/tobago-example-data/src/main/java/org/apache/myfaces/tobago/example/data/SolarObject.java>:252: error: Line is longer than 120 characters (found 121).
Audit done.
[INFO] There is 1 error reported by Checkstyle 6.11.2 with tobago/checkstyle.xml ruleset.
[ERROR] src/main/java/org/apache/myfaces/tobago/example/data/SolarObject.java:[252] (sizes) LineLength: Line is longer than 120 characters (found 121).
[INFO] ------------------------------------------------------------------------
[INFO] Reactor Summary:
[INFO]
[INFO] Apache Tobago ...................................... SUCCESS [ 7.248 s]
[INFO] Tobago Tool ........................................ SUCCESS [ 2.317 s]
[INFO] Tobago Tool Annotation ............................. SUCCESS [ 6.362 s]
[INFO] Tobago Tool Apt .................................... SUCCESS [01:02 min]
[INFO] Tobago Core ........................................ SUCCESS [ 19.950 s]
[INFO] Tobago Themes ...................................... SUCCESS [ 2.543 s]
[INFO] Tobago Theme Standard .............................. SUCCESS [ 12.904 s]
[INFO] Tobago Theme Scarborough ........................... SUCCESS [ 3.828 s]
[INFO] Tobago Theme Speyside .............................. SUCCESS [ 4.072 s]
[INFO] Tobago Theme Roxborough ............................ SUCCESS [ 4.037 s]
[INFO] Tobago Examples .................................... SUCCESS [ 2.538 s]
[INFO] Tobago Example Blank ............................... SUCCESS [ 4.248 s]
[INFO] Tobago Example Data ................................ FAILURE [ 1.747 s]
[INFO] Tobago Example Demo ................................ SKIPPED
[INFO] Tobago Example Assembly ............................ SKIPPED
[INFO] Tobago Assembly .................................... SKIPPED
[INFO] ------------------------------------------------------------------------
[INFO] BUILD FAILURE
[INFO] ------------------------------------------------------------------------
[INFO] Total time: 02:54 min
[INFO] Finished at: 2017-12-01T08:19:09Z
[INFO] Final Memory: 61M/858M
[INFO] ------------------------------------------------------------------------
[ERROR] Failed to execute goal org.apache.maven.plugins:maven-checkstyle-plugin:2.17:check (default-cli) on project tobago-example-data: You have 1 Checkstyle violation. -> [Help 1]
[ERROR]
[ERROR] To see the full stack trace of the errors, re-run Maven with the -e switch.
[ERROR] Re-run Maven using the -X switch to enable full debug logging.
[ERROR]
[ERROR] For more information about the errors and possible solutions, please read the following articles:
[ERROR] [Help 1] http://cwiki.apache.org/confluence/display/MAVEN/MojoFailureException
[ERROR]
[ERROR] After correcting the problems, you can resume the build with the command
[ERROR] mvn <goals> -rf :tobago-example-data
[JENKINS] Archiving <https://builds.apache.org/job/Tobago%20Trunk/ws/tobago-theme/pom.xml> to org.apache.myfaces.tobago/tobago-theme/4.0.0-SNAPSHOT/tobago-theme-4.0.0-SNAPSHOT.pom
[JENKINS] Archiving <https://builds.apache.org/job/Tobago%20Trunk/ws/tobago-example/tobago-example-blank/pom.xml> to org.apache.myfaces.tobago/tobago-example-blank/4.0.0-SNAPSHOT/tobago-example-blank-4.0.0-SNAPSHOT.pom
[JENKINS] Archiving <https://builds.apache.org/job/Tobago%20Trunk/ws/tobago-example/tobago-example-blank/target/tobago-example-blank.war> to org.apache.myfaces.tobago/tobago-example-blank/4.0.0-SNAPSHOT/tobago-example-blank-4.0.0-SNAPSHOT.war
[Fast Archiver] Compressed 8.05 MB of artifacts by 54.3% relative to #1171
[JENKINS] Archiving <https://builds.apache.org/job/Tobago%20Trunk/ws/tobago-assembly/pom.xml> to org.apache.myfaces.tobago/tobago-assembly/4.0.0-SNAPSHOT/tobago-assembly-4.0.0-SNAPSHOT.pom
[JENKINS] Archiving <https://builds.apache.org/job/Tobago%20Trunk/ws/pom.xml> to org.apache.myfaces.tobago/tobago/4.0.0-SNAPSHOT/tobago-4.0.0-SNAPSHOT.pom
[JENKINS] Archiving <https://builds.apache.org/job/Tobago%20Trunk/ws/target/tobago-4.0.0-SNAPSHOT-site.xml> to org.apache.myfaces.tobago/tobago/4.0.0-SNAPSHOT/tobago-4.0.0-SNAPSHOT-site.xml
[Fast Archiver] Compressed 52.96 KB of artifacts by 60.4% relative to #1180
[JENKINS] Archiving <https://builds.apache.org/job/Tobago%20Trunk/ws/tobago-theme/tobago-theme-standard/pom.xml> to org.apache.myfaces.tobago/tobago-theme-standard/4.0.0-SNAPSHOT/tobago-theme-standard-4.0.0-SNAPSHOT.pom
[JENKINS] Archiving <https://builds.apache.org/job/Tobago%20Trunk/ws/tobago-theme/tobago-theme-standard/target/tobago-theme-standard-4.0.0-SNAPSHOT.jar> to org.apache.myfaces.tobago/tobago-theme-standard/4.0.0-SNAPSHOT/tobago-theme-standard-4.0.0-SNAPSHOT.jar
[Fast Archiver] Compressed 1.56 MB of artifacts by 50.2% relative to #1171
[JENKINS] Archiving <https://builds.apache.org/job/Tobago%20Trunk/ws/tobago-theme/tobago-theme-scarborough/pom.xml> to org.apache.myfaces.tobago/tobago-theme-scarborough/4.0.0-SNAPSHOT/tobago-theme-scarborough-4.0.0-SNAPSHOT.pom
[JENKINS] Archiving <https://builds.apache.org/job/Tobago%20Trunk/ws/tobago-theme/tobago-theme-scarborough/target/tobago-theme-scarborough-4.0.0-SNAPSHOT.jar> to org.apache.myfaces.tobago/tobago-theme-scarborough/4.0.0-SNAPSHOT/tobago-theme-scarborough-4.0.0-SNAPSHOT.jar
[Fast Archiver] Compressed 288.45 KB of artifacts by 33.3% relative to #1171
[JENKINS] Archiving <https://builds.apache.org/job/Tobago%20Trunk/ws/tobago-example/tobago-example-assembly/pom.xml> to org.apache.myfaces.tobago/tobago-example-assembly/4.0.0-SNAPSHOT/tobago-example-assembly-4.0.0-SNAPSHOT.pom
[JENKINS] Archiving <https://builds.apache.org/job/Tobago%20Trunk/ws/tobago-theme/tobago-theme-speyside/pom.xml> to org.apache.myfaces.tobago/tobago-theme-speyside/4.0.0-SNAPSHOT/tobago-theme-speyside-4.0.0-SNAPSHOT.pom
[JENKINS] Archiving <https://builds.apache.org/job/Tobago%20Trunk/ws/tobago-theme/tobago-theme-speyside/target/tobago-theme-speyside-4.0.0-SNAPSHOT.jar> to org.apache.myfaces.tobago/tobago-theme-speyside/4.0.0-SNAPSHOT/tobago-theme-speyside-4.0.0-SNAPSHOT.jar
[Fast Archiver] Compressed 325.02 KB of artifacts by 39.4% relative to #1171
[JENKINS] Archiving <https://builds.apache.org/job/Tobago%20Trunk/ws/tobago-theme/tobago-theme-roxborough/pom.xml> to org.apache.myfaces.tobago/tobago-theme-roxborough/4.0.0-SNAPSHOT/tobago-theme-roxborough-4.0.0-SNAPSHOT.pom
[JENKINS] Archiving <https://builds.apache.org/job/Tobago%20Trunk/ws/tobago-theme/tobago-theme-roxborough/target/tobago-theme-roxborough-4.0.0-SNAPSHOT.jar> to org.apache.myfaces.tobago/tobago-theme-roxborough/4.0.0-SNAPSHOT/tobago-theme-roxborough-4.0.0-SNAPSHOT.jar
[Fast Archiver] Compressed 411.10 KB of artifacts by 31.1% relative to #1171
[JENKINS] Archiving <https://builds.apache.org/job/Tobago%20Trunk/ws/tobago-tool/tobago-tool-annotation/pom.xml> to org.apache.myfaces.tobago/tobago-tool-annotation/4.0.0-SNAPSHOT/tobago-tool-annotation-4.0.0-SNAPSHOT.pom
[JENKINS] Archiving <https://builds.apache.org/job/Tobago%20Trunk/ws/tobago-tool/tobago-tool-annotation/target/tobago-tool-annotation-4.0.0-SNAPSHOT.jar> to org.apache.myfaces.tobago/tobago-tool-annotation/4.0.0-SNAPSHOT/tobago-tool-annotation-4.0.0-SNAPSHOT.jar
[JENKINS] Archiving <https://builds.apache.org/job/Tobago%20Trunk/ws/tobago-example/pom.xml> to org.apache.myfaces.tobago/tobago-example/4.0.0-SNAPSHOT/tobago-example-4.0.0-SNAPSHOT.pom
[JENKINS] Archiving <https://builds.apache.org/job/Tobago%20Trunk/ws/tobago-example/tobago-example-data/pom.xml> to org.apache.myfaces.tobago/tobago-example-data/4.0.0-SNAPSHOT/tobago-example-data-4.0.0-SNAPSHOT.pom
[JENKINS] Archiving <https://builds.apache.org/job/Tobago%20Trunk/ws/tobago-tool/pom.xml> to org.apache.myfaces.tobago/tobago-tool/4.0.0-SNAPSHOT/tobago-tool-4.0.0-SNAPSHOT.pom
[JENKINS] Archiving <https://builds.apache.org/job/Tobago%20Trunk/ws/tobago-core/pom.xml> to org.apache.myfaces.tobago/tobago-core/4.0.0-SNAPSHOT/tobago-core-4.0.0-SNAPSHOT.pom
[JENKINS] Archiving <https://builds.apache.org/job/Tobago%20Trunk/ws/tobago-core/target/tobago-core-4.0.0-SNAPSHOT.jar> to org.apache.myfaces.tobago/tobago-core/4.0.0-SNAPSHOT/tobago-core-4.0.0-SNAPSHOT.jar
[JENKINS] Archiving <https://builds.apache.org/job/Tobago%20Trunk/ws/tobago-core/target/tobago-core-4.0.0-SNAPSHOT-tests.jar> to org.apache.myfaces.tobago/tobago-core/4.0.0-SNAPSHOT/tobago-core-4.0.0-SNAPSHOT-tests.jar
[JENKINS] Archiving <https://builds.apache.org/job/Tobago%20Trunk/ws/tobago-core/target/tobago-core-4.0.0-SNAPSHOT-sources.jar> to org.apache.myfaces.tobago/tobago-core/4.0.0-SNAPSHOT/tobago-core-4.0.0-SNAPSHOT-sources.jar
[JENKINS] Archiving <https://builds.apache.org/job/Tobago%20Trunk/ws/tobago-tool/tobago-tool-apt/pom.xml> to org.apache.myfaces.tobago/tobago-tool-apt/4.0.0-SNAPSHOT/tobago-tool-apt-4.0.0-SNAPSHOT.pom
[JENKINS] Archiving <https://builds.apache.org/job/Tobago%20Trunk/ws/tobago-tool/tobago-tool-apt/target/tobago-tool-apt-4.0.0-SNAPSHOT.jar> to org.apache.myfaces.tobago/tobago-tool-apt/4.0.0-SNAPSHOT/tobago-tool-apt-4.0.0-SNAPSHOT.jar
[JENKINS] Archiving <https://builds.apache.org/job/Tobago%20Trunk/ws/tobago-example/tobago-example-demo/pom.xml> to org.apache.myfaces.tobago/tobago-example-demo/4.0.0-SNAPSHOT/tobago-example-demo-4.0.0-SNAPSHOT.pom
Sending e-mails to: commits@myfaces.apache.org
Sending e-mails to: commits@myfaces.apache.org
channel stopped
Build failed in Jenkins: Tobago Trunk #1180
Posted by Apache Jenkins Server <je...@builds.apache.org>.
See <https://builds.apache.org/job/Tobago%20Trunk/1180/display/redirect?page=changes>
Changes:
[hnoeth] improve demo * better width for navigation
------------------------------------------
[...truncated 5.35 KB...]
[INFO] Apache Tobago
[INFO] Tobago Tool
[INFO] Tobago Tool Annotation
[INFO] Tobago Tool Apt
[INFO] Tobago Core
[INFO] Tobago Themes
[INFO] Tobago Theme Standard
[INFO] Tobago Theme Scarborough
[INFO] Tobago Theme Speyside
[INFO] Tobago Theme Roxborough
[INFO] Tobago Examples
[INFO] Tobago Example Blank
[INFO] Tobago Example Data
[INFO] Tobago Example Demo
[INFO] Tobago Example Assembly
[INFO] Tobago Assembly
[INFO]
[INFO] ------------------------------------------------------------------------
[INFO] Building Apache Tobago 4.0.0-SNAPSHOT
[INFO] ------------------------------------------------------------------------
[INFO]
[INFO] --- maven-clean-plugin:2.6.1:clean (default-clean) @ tobago ---
[INFO] Deleting <https://builds.apache.org/job/Tobago%20Trunk/ws/target>
[INFO]
[INFO] --- animal-sniffer-maven-plugin:1.14:check (default-cli) @ tobago ---
[INFO] Checking unresolved references to org.codehaus.mojo.signature:java16:1.1
[INFO]
[INFO] --- maven-checkstyle-plugin:2.17:check (default-cli) @ tobago ---
[INFO] Starting audit...
Audit done.
[INFO]
[INFO] --- maven-enforcer-plugin:3.0.0-M1:enforce (enforce) @ tobago ---
[INFO]
[INFO] --- maven-remote-resources-plugin:1.5:process (default) @ tobago ---
[INFO]
[INFO] --- maven-site-plugin:3.6:attach-descriptor (attach-descriptor) @ tobago ---
[INFO] Attaching 'src/site/site.xml' site descriptor with classifier 'site'.
[INFO]
[INFO] --- maven-install-plugin:2.5.2:install (default-install) @ tobago ---
[INFO] Installing <https://builds.apache.org/job/Tobago%20Trunk/ws/pom.xml> to /home/jenkins/jenkins-slave/maven-repositories/0/org/apache/myfaces/tobago/tobago/4.0.0-SNAPSHOT/tobago-4.0.0-SNAPSHOT.pom
[INFO] Installing <https://builds.apache.org/job/Tobago%20Trunk/ws/target/tobago-4.0.0-SNAPSHOT-site.xml> to /home/jenkins/jenkins-slave/maven-repositories/0/org/apache/myfaces/tobago/tobago/4.0.0-SNAPSHOT/tobago-4.0.0-SNAPSHOT-site.xml
[INFO]
[INFO] ------------------------------------------------------------------------
[INFO] Building Tobago Tool 4.0.0-SNAPSHOT
[INFO] ------------------------------------------------------------------------
[INFO]
[INFO] --- maven-clean-plugin:2.6.1:clean (default-clean) @ tobago-tool ---
[INFO] Deleting <https://builds.apache.org/job/Tobago%20Trunk/ws/tobago-tool/target>
[INFO]
[INFO] --- animal-sniffer-maven-plugin:1.14:check (default-cli) @ tobago-tool ---
[INFO] Checking unresolved references to org.codehaus.mojo.signature:java16:1.1
[INFO]
[INFO] --- maven-checkstyle-plugin:2.17:check (default-cli) @ tobago-tool ---
[INFO] Starting audit...
Audit done.
[INFO]
[INFO] --- maven-enforcer-plugin:3.0.0-M1:enforce (enforce) @ tobago-tool ---
[INFO]
[INFO] --- maven-remote-resources-plugin:1.5:process (default) @ tobago-tool ---
[INFO]
[INFO] --- maven-site-plugin:3.6:attach-descriptor (attach-descriptor) @ tobago-tool ---
[INFO] No site descriptor found: nothing to attach.
[INFO]
[INFO] --- maven-install-plugin:2.5.2:install (default-install) @ tobago-tool ---
[INFO] Installing <https://builds.apache.org/job/Tobago%20Trunk/ws/tobago-tool/pom.xml> to /home/jenkins/jenkins-slave/maven-repositories/0/org/apache/myfaces/tobago/tobago-tool/4.0.0-SNAPSHOT/tobago-tool-4.0.0-SNAPSHOT.pom
[INFO]
[INFO] ------------------------------------------------------------------------
[INFO] Building Tobago Tool Annotation 4.0.0-SNAPSHOT
[INFO] ------------------------------------------------------------------------
[INFO]
[INFO] --- maven-clean-plugin:2.6.1:clean (default-clean) @ tobago-tool-annotation ---
[INFO] Deleting <https://builds.apache.org/job/Tobago%20Trunk/ws/tobago-tool/tobago-tool-annotation/target>
[INFO]
[INFO] --- animal-sniffer-maven-plugin:1.14:check (default-cli) @ tobago-tool-annotation ---
[INFO] Checking unresolved references to org.codehaus.mojo.signature:java16:1.1
[INFO]
[INFO] --- maven-checkstyle-plugin:2.17:check (default-cli) @ tobago-tool-annotation ---
[INFO] Starting audit...
Audit done.
[INFO]
[INFO] --- maven-enforcer-plugin:3.0.0-M1:enforce (enforce) @ tobago-tool-annotation ---
[INFO]
[INFO] --- maven-remote-resources-plugin:1.5:process (default) @ tobago-tool-annotation ---
[INFO]
[INFO] --- maven-resources-plugin:2.7:resources (default-resources) @ tobago-tool-annotation ---
[INFO] Using 'UTF-8' encoding to copy filtered resources.
[INFO] skip non existing resourceDirectory <https://builds.apache.org/job/Tobago%20Trunk/ws/tobago-tool/tobago-tool-annotation/src/main/resources>
[INFO] Copying 3 resources
[INFO]
[INFO] --- maven-compiler-plugin:3.6.2:compile (default-compile) @ tobago-tool-annotation ---
[INFO] Compiling 17 source files to <https://builds.apache.org/job/Tobago%20Trunk/ws/tobago-tool/tobago-tool-annotation/target/classes>
[INFO]
[INFO] --- maven-resources-plugin:2.7:testResources (default-testResources) @ tobago-tool-annotation ---
[INFO] Using 'UTF-8' encoding to copy filtered resources.
[INFO] skip non existing resourceDirectory <https://builds.apache.org/job/Tobago%20Trunk/ws/tobago-tool/tobago-tool-annotation/src/test/resources>
[INFO] Copying 3 resources
[INFO]
[INFO] --- maven-compiler-plugin:3.6.2:testCompile (default-testCompile) @ tobago-tool-annotation ---
[INFO] No sources to compile
[INFO]
[INFO] --- maven-surefire-plugin:2.19.1:test (default-test) @ tobago-tool-annotation ---
[JENKINS] Recording test results
[INFO]
[INFO] --- maven-jar-plugin:3.0.2:jar (default-jar) @ tobago-tool-annotation ---
[INFO] Building jar: <https://builds.apache.org/job/Tobago%20Trunk/ws/tobago-tool/tobago-tool-annotation/target/tobago-tool-annotation-4.0.0-SNAPSHOT.jar>
[INFO]
[INFO] --- maven-site-plugin:3.6:attach-descriptor (attach-descriptor) @ tobago-tool-annotation ---
[INFO] Skipping because packaging 'jar' is not pom.
[INFO]
[INFO] --- maven-install-plugin:2.5.2:install (default-install) @ tobago-tool-annotation ---
[INFO] Installing <https://builds.apache.org/job/Tobago%20Trunk/ws/tobago-tool/tobago-tool-annotation/target/tobago-tool-annotation-4.0.0-SNAPSHOT.jar> to /home/jenkins/jenkins-slave/maven-repositories/0/org/apache/myfaces/tobago/tobago-tool-annotation/4.0.0-SNAPSHOT/tobago-tool-annotation-4.0.0-SNAPSHOT.jar
[INFO] Installing <https://builds.apache.org/job/Tobago%20Trunk/ws/tobago-tool/tobago-tool-annotation/pom.xml> to /home/jenkins/jenkins-slave/maven-repositories/0/org/apache/myfaces/tobago/tobago-tool-annotation/4.0.0-SNAPSHOT/tobago-tool-annotation-4.0.0-SNAPSHOT.pom
[INFO]
[INFO] ------------------------------------------------------------------------
[INFO] Building Tobago Tool Apt 4.0.0-SNAPSHOT
[INFO] ------------------------------------------------------------------------
[INFO]
[INFO] --- maven-clean-plugin:2.6.1:clean (default-clean) @ tobago-tool-apt ---
[INFO] Deleting <https://builds.apache.org/job/Tobago%20Trunk/ws/tobago-tool/tobago-tool-apt/target>
[INFO]
[INFO] --- animal-sniffer-maven-plugin:1.14:check (default-cli) @ tobago-tool-apt ---
[INFO] Checking unresolved references to org.codehaus.mojo.signature:java16:1.0
[INFO]
[INFO] --- maven-checkstyle-plugin:2.17:check (default-cli) @ tobago-tool-apt ---
[INFO] Starting audit...
Audit done.
[INFO]
[INFO] --- maven-enforcer-plugin:3.0.0-M1:enforce (enforce) @ tobago-tool-apt ---
[INFO]
[INFO] --- maven-remote-resources-plugin:1.5:process (default) @ tobago-tool-apt ---
[INFO]
[INFO] --- maven-resources-plugin:2.7:resources (default-resources) @ tobago-tool-apt ---
[INFO] Using 'UTF-8' encoding to copy filtered resources.
[INFO] Copying 1 resource
[INFO] Copying 3 resources
[INFO]
[INFO] --- maven-compiler-plugin:3.6.2:compile (default-compile) @ tobago-tool-apt ---
[INFO] Compiling 15 source files to <https://builds.apache.org/job/Tobago%20Trunk/ws/tobago-tool/tobago-tool-apt/target/classes>
[INFO] <https://builds.apache.org/job/Tobago%20Trunk/ws/tobago-tool/tobago-tool-apt/src/main/java/org/apache/myfaces/tobago/apt/processor/TaglibGenerator.java>: Some input files use or override a deprecated API.
[INFO] <https://builds.apache.org/job/Tobago%20Trunk/ws/tobago-tool/tobago-tool-apt/src/main/java/org/apache/myfaces/tobago/apt/processor/TaglibGenerator.java>: Recompile with -Xlint:deprecation for details.
[INFO]
[INFO] --- maven-resources-plugin:2.7:testResources (default-testResources) @ tobago-tool-apt ---
[INFO] Using 'UTF-8' encoding to copy filtered resources.
[INFO] skip non existing resourceDirectory <https://builds.apache.org/job/Tobago%20Trunk/ws/tobago-tool/tobago-tool-apt/src/test/resources>
[INFO] Copying 3 resources
[INFO]
[INFO] --- maven-compiler-plugin:3.6.2:testCompile (default-testCompile) @ tobago-tool-apt ---
[INFO] Compiling 1 source file to <https://builds.apache.org/job/Tobago%20Trunk/ws/tobago-tool/tobago-tool-apt/target/test-classes>
[INFO]
[INFO] --- maven-surefire-plugin:2.19.1:test (default-test) @ tobago-tool-apt ---
-------------------------------------------------------
T E S T S
-------------------------------------------------------
Running org.apache.myfaces.tobago.apt.processor.CheckstyleConfigGeneratorUnitTest
Tests run: 1, Failures: 0, Errors: 0, Skipped: 0, Time elapsed: 0.062 sec - in org.apache.myfaces.tobago.apt.processor.CheckstyleConfigGeneratorUnitTest
Results :
Tests run: 1, Failures: 0, Errors: 0, Skipped: 0
[JENKINS] Recording test results
[INFO]
[INFO] --- maven-jar-plugin:3.0.2:jar (default-jar) @ tobago-tool-apt ---
[INFO] Building jar: <https://builds.apache.org/job/Tobago%20Trunk/ws/tobago-tool/tobago-tool-apt/target/tobago-tool-apt-4.0.0-SNAPSHOT.jar>
[INFO]
[INFO] --- maven-site-plugin:3.6:attach-descriptor (attach-descriptor) @ tobago-tool-apt ---
[INFO] Skipping because packaging 'jar' is not pom.
[INFO]
[INFO] --- maven-install-plugin:2.5.2:install (default-install) @ tobago-tool-apt ---
[INFO] Installing <https://builds.apache.org/job/Tobago%20Trunk/ws/tobago-tool/tobago-tool-apt/target/tobago-tool-apt-4.0.0-SNAPSHOT.jar> to /home/jenkins/jenkins-slave/maven-repositories/0/org/apache/myfaces/tobago/tobago-tool-apt/4.0.0-SNAPSHOT/tobago-tool-apt-4.0.0-SNAPSHOT.jar
[INFO] Installing <https://builds.apache.org/job/Tobago%20Trunk/ws/tobago-tool/tobago-tool-apt/pom.xml> to /home/jenkins/jenkins-slave/maven-repositories/0/org/apache/myfaces/tobago/tobago-tool-apt/4.0.0-SNAPSHOT/tobago-tool-apt-4.0.0-SNAPSHOT.pom
[INFO]
[INFO] ------------------------------------------------------------------------
[INFO] Building Tobago Core 4.0.0-SNAPSHOT
[INFO] ------------------------------------------------------------------------
[INFO]
[INFO] --- maven-clean-plugin:2.6.1:clean (default-clean) @ tobago-core ---
[INFO] Deleting <https://builds.apache.org/job/Tobago%20Trunk/ws/tobago-core/target>
[INFO]
[INFO] --- animal-sniffer-maven-plugin:1.14:check (default-cli) @ tobago-core ---
[INFO] Checking unresolved references to org.codehaus.mojo.signature:java16:1.1
[INFO]
[INFO] --- maven-checkstyle-plugin:2.17:check (default-cli) @ tobago-core ---
[INFO] Starting audit...
<https://builds.apache.org/job/Tobago%20Trunk/ws/tobago-core/src/main/java/org/apache/myfaces/tobago/sanitizer/JsoupSanitizer.java>:76: error: Line is longer than 120 characters (found 122).
<https://builds.apache.org/job/Tobago%20Trunk/ws/tobago-core/src/main/java/org/apache/myfaces/tobago/servlet/ResourceServlet.java>:142:29: error: ';' is not followed by whitespace.
Audit done.
[INFO] There are 2 errors reported by Checkstyle 6.11.2 with tobago/checkstyle.xml ruleset.
[ERROR] src/main/java/org/apache/myfaces/tobago/sanitizer/JsoupSanitizer.java:[76] (sizes) LineLength: Line is longer than 120 characters (found 122).
[ERROR] src/main/java/org/apache/myfaces/tobago/servlet/ResourceServlet.java:[142,29] (whitespace) WhitespaceAfter: ';' is not followed by whitespace.
[INFO] ------------------------------------------------------------------------
[INFO] Reactor Summary:
[INFO]
[INFO] Apache Tobago ...................................... SUCCESS [ 8.101 s]
[INFO] Tobago Tool ........................................ SUCCESS [ 2.588 s]
[INFO] Tobago Tool Annotation ............................. SUCCESS [ 6.543 s]
[INFO] Tobago Tool Apt .................................... SUCCESS [ 59.508 s]
[INFO] Tobago Core ........................................ FAILURE [ 5.540 s]
[INFO] Tobago Themes ...................................... SKIPPED
[INFO] Tobago Theme Standard .............................. SKIPPED
[INFO] Tobago Theme Scarborough ........................... SKIPPED
[INFO] Tobago Theme Speyside .............................. SKIPPED
[INFO] Tobago Theme Roxborough ............................ SKIPPED
[INFO] Tobago Examples .................................... SKIPPED
[INFO] Tobago Example Blank ............................... SKIPPED
[INFO] Tobago Example Data ................................ SKIPPED
[INFO] Tobago Example Demo ................................ SKIPPED
[INFO] Tobago Example Assembly ............................ SKIPPED
[INFO] Tobago Assembly .................................... SKIPPED
[INFO] ------------------------------------------------------------------------
[INFO] BUILD FAILURE
[INFO] ------------------------------------------------------------------------
[INFO] Total time: 01:45 min
[INFO] Finished at: 2017-11-30T16:54:12Z
[INFO] Final Memory: 42M/608M
[INFO] ------------------------------------------------------------------------
[ERROR] Failed to execute goal org.apache.maven.plugins:maven-checkstyle-plugin:2.17:check (default-cli) on project tobago-core: You have 2 Checkstyle violations. -> [Help 1]
[ERROR]
[ERROR] To see the full stack trace of the errors, re-run Maven with the -e switch.
[ERROR] Re-run Maven using the -X switch to enable full debug logging.
[ERROR]
[ERROR] For more information about the errors and possible solutions, please read the following articles:
[ERROR] [Help 1] http://cwiki.apache.org/confluence/display/MAVEN/MojoFailureException
[ERROR]
[ERROR] After correcting the problems, you can resume the build with the command
[ERROR] mvn <goals> -rf :tobago-core
[JENKINS] Archiving <https://builds.apache.org/job/Tobago%20Trunk/ws/tobago-theme/pom.xml> to org.apache.myfaces.tobago/tobago-theme/4.0.0-SNAPSHOT/tobago-theme-4.0.0-SNAPSHOT.pom
[JENKINS] Archiving <https://builds.apache.org/job/Tobago%20Trunk/ws/tobago-example/tobago-example-blank/pom.xml> to org.apache.myfaces.tobago/tobago-example-blank/4.0.0-SNAPSHOT/tobago-example-blank-4.0.0-SNAPSHOT.pom
[JENKINS] Archiving <https://builds.apache.org/job/Tobago%20Trunk/ws/tobago-assembly/pom.xml> to org.apache.myfaces.tobago/tobago-assembly/4.0.0-SNAPSHOT/tobago-assembly-4.0.0-SNAPSHOT.pom
[JENKINS] Archiving <https://builds.apache.org/job/Tobago%20Trunk/ws/pom.xml> to org.apache.myfaces.tobago/tobago/4.0.0-SNAPSHOT/tobago-4.0.0-SNAPSHOT.pom
[JENKINS] Archiving <https://builds.apache.org/job/Tobago%20Trunk/ws/target/tobago-4.0.0-SNAPSHOT-site.xml> to org.apache.myfaces.tobago/tobago/4.0.0-SNAPSHOT/tobago-4.0.0-SNAPSHOT-site.xml
[Fast Archiver] Compressed 52.96 KB of artifacts by 60.4% relative to #1179
[JENKINS] Archiving <https://builds.apache.org/job/Tobago%20Trunk/ws/tobago-theme/tobago-theme-standard/pom.xml> to org.apache.myfaces.tobago/tobago-theme-standard/4.0.0-SNAPSHOT/tobago-theme-standard-4.0.0-SNAPSHOT.pom
[JENKINS] Archiving <https://builds.apache.org/job/Tobago%20Trunk/ws/tobago-theme/tobago-theme-scarborough/pom.xml> to org.apache.myfaces.tobago/tobago-theme-scarborough/4.0.0-SNAPSHOT/tobago-theme-scarborough-4.0.0-SNAPSHOT.pom
[JENKINS] Archiving <https://builds.apache.org/job/Tobago%20Trunk/ws/tobago-example/tobago-example-assembly/pom.xml> to org.apache.myfaces.tobago/tobago-example-assembly/4.0.0-SNAPSHOT/tobago-example-assembly-4.0.0-SNAPSHOT.pom
[JENKINS] Archiving <https://builds.apache.org/job/Tobago%20Trunk/ws/tobago-theme/tobago-theme-speyside/pom.xml> to org.apache.myfaces.tobago/tobago-theme-speyside/4.0.0-SNAPSHOT/tobago-theme-speyside-4.0.0-SNAPSHOT.pom
[JENKINS] Archiving <https://builds.apache.org/job/Tobago%20Trunk/ws/tobago-theme/tobago-theme-roxborough/pom.xml> to org.apache.myfaces.tobago/tobago-theme-roxborough/4.0.0-SNAPSHOT/tobago-theme-roxborough-4.0.0-SNAPSHOT.pom
[JENKINS] Archiving <https://builds.apache.org/job/Tobago%20Trunk/ws/tobago-tool/tobago-tool-annotation/pom.xml> to org.apache.myfaces.tobago/tobago-tool-annotation/4.0.0-SNAPSHOT/tobago-tool-annotation-4.0.0-SNAPSHOT.pom
[JENKINS] Archiving <https://builds.apache.org/job/Tobago%20Trunk/ws/tobago-tool/tobago-tool-annotation/target/tobago-tool-annotation-4.0.0-SNAPSHOT.jar> to org.apache.myfaces.tobago/tobago-tool-annotation/4.0.0-SNAPSHOT/tobago-tool-annotation-4.0.0-SNAPSHOT.jar
[JENKINS] Archiving <https://builds.apache.org/job/Tobago%20Trunk/ws/tobago-example/pom.xml> to org.apache.myfaces.tobago/tobago-example/4.0.0-SNAPSHOT/tobago-example-4.0.0-SNAPSHOT.pom
[JENKINS] Archiving <https://builds.apache.org/job/Tobago%20Trunk/ws/tobago-example/tobago-example-data/pom.xml> to org.apache.myfaces.tobago/tobago-example-data/4.0.0-SNAPSHOT/tobago-example-data-4.0.0-SNAPSHOT.pom
[JENKINS] Archiving <https://builds.apache.org/job/Tobago%20Trunk/ws/tobago-tool/pom.xml> to org.apache.myfaces.tobago/tobago-tool/4.0.0-SNAPSHOT/tobago-tool-4.0.0-SNAPSHOT.pom
[JENKINS] Archiving <https://builds.apache.org/job/Tobago%20Trunk/ws/tobago-core/pom.xml> to org.apache.myfaces.tobago/tobago-core/4.0.0-SNAPSHOT/tobago-core-4.0.0-SNAPSHOT.pom
[JENKINS] Archiving <https://builds.apache.org/job/Tobago%20Trunk/ws/tobago-tool/tobago-tool-apt/pom.xml> to org.apache.myfaces.tobago/tobago-tool-apt/4.0.0-SNAPSHOT/tobago-tool-apt-4.0.0-SNAPSHOT.pom
[JENKINS] Archiving <https://builds.apache.org/job/Tobago%20Trunk/ws/tobago-tool/tobago-tool-apt/target/tobago-tool-apt-4.0.0-SNAPSHOT.jar> to org.apache.myfaces.tobago/tobago-tool-apt/4.0.0-SNAPSHOT/tobago-tool-apt-4.0.0-SNAPSHOT.jar
[JENKINS] Archiving <https://builds.apache.org/job/Tobago%20Trunk/ws/tobago-example/tobago-example-demo/pom.xml> to org.apache.myfaces.tobago/tobago-example-demo/4.0.0-SNAPSHOT/tobago-example-demo-4.0.0-SNAPSHOT.pom
Sending e-mails to: commits@myfaces.apache.org
channel stopped
Build failed in Jenkins: Tobago Trunk #1179
Posted by Apache Jenkins Server <je...@builds.apache.org>.
See <https://builds.apache.org/job/Tobago%20Trunk/1179/display/redirect?page=changes>
Changes:
[lofwyr] add license text
------------------------------------------
[...truncated 4.63 KB...]
[INFO] Apache Tobago
[INFO] Tobago Tool
[INFO] Tobago Tool Annotation
[INFO] Tobago Tool Apt
[INFO] Tobago Core
[INFO] Tobago Themes
[INFO] Tobago Theme Standard
[INFO] Tobago Theme Scarborough
[INFO] Tobago Theme Speyside
[INFO] Tobago Theme Roxborough
[INFO] Tobago Examples
[INFO] Tobago Example Blank
[INFO] Tobago Example Data
[INFO] Tobago Example Demo
[INFO] Tobago Example Assembly
[INFO] Tobago Assembly
[INFO]
[INFO] ------------------------------------------------------------------------
[INFO] Building Apache Tobago 4.0.0-SNAPSHOT
[INFO] ------------------------------------------------------------------------
[INFO]
[INFO] --- maven-clean-plugin:2.6.1:clean (default-clean) @ tobago ---
[INFO] Deleting <https://builds.apache.org/job/Tobago%20Trunk/ws/target>
[INFO]
[INFO] --- animal-sniffer-maven-plugin:1.14:check (default-cli) @ tobago ---
[INFO] Checking unresolved references to org.codehaus.mojo.signature:java16:1.1
[INFO]
[INFO] --- maven-checkstyle-plugin:2.17:check (default-cli) @ tobago ---
[INFO] Starting audit...
Audit done.
[INFO]
[INFO] --- maven-enforcer-plugin:3.0.0-M1:enforce (enforce) @ tobago ---
[INFO]
[INFO] --- maven-remote-resources-plugin:1.5:process (default) @ tobago ---
[INFO]
[INFO] --- maven-site-plugin:3.6:attach-descriptor (attach-descriptor) @ tobago ---
[INFO] Attaching 'src/site/site.xml' site descriptor with classifier 'site'.
[INFO]
[INFO] --- maven-install-plugin:2.5.2:install (default-install) @ tobago ---
[INFO] Installing <https://builds.apache.org/job/Tobago%20Trunk/ws/pom.xml> to /home/jenkins/jenkins-slave/maven-repositories/1/org/apache/myfaces/tobago/tobago/4.0.0-SNAPSHOT/tobago-4.0.0-SNAPSHOT.pom
[INFO] Installing <https://builds.apache.org/job/Tobago%20Trunk/ws/target/tobago-4.0.0-SNAPSHOT-site.xml> to /home/jenkins/jenkins-slave/maven-repositories/1/org/apache/myfaces/tobago/tobago/4.0.0-SNAPSHOT/tobago-4.0.0-SNAPSHOT-site.xml
[INFO]
[INFO] ------------------------------------------------------------------------
[INFO] Building Tobago Tool 4.0.0-SNAPSHOT
[INFO] ------------------------------------------------------------------------
[INFO]
[INFO] --- maven-clean-plugin:2.6.1:clean (default-clean) @ tobago-tool ---
[INFO] Deleting <https://builds.apache.org/job/Tobago%20Trunk/ws/tobago-tool/target>
[INFO]
[INFO] --- animal-sniffer-maven-plugin:1.14:check (default-cli) @ tobago-tool ---
[INFO] Checking unresolved references to org.codehaus.mojo.signature:java16:1.1
[INFO]
[INFO] --- maven-checkstyle-plugin:2.17:check (default-cli) @ tobago-tool ---
[INFO] Starting audit...
Audit done.
[INFO]
[INFO] --- maven-enforcer-plugin:3.0.0-M1:enforce (enforce) @ tobago-tool ---
[INFO]
[INFO] --- maven-remote-resources-plugin:1.5:process (default) @ tobago-tool ---
[INFO]
[INFO] --- maven-site-plugin:3.6:attach-descriptor (attach-descriptor) @ tobago-tool ---
[INFO] No site descriptor found: nothing to attach.
[INFO]
[INFO] --- maven-install-plugin:2.5.2:install (default-install) @ tobago-tool ---
[INFO] Installing <https://builds.apache.org/job/Tobago%20Trunk/ws/tobago-tool/pom.xml> to /home/jenkins/jenkins-slave/maven-repositories/1/org/apache/myfaces/tobago/tobago-tool/4.0.0-SNAPSHOT/tobago-tool-4.0.0-SNAPSHOT.pom
[INFO]
[INFO] ------------------------------------------------------------------------
[INFO] Building Tobago Tool Annotation 4.0.0-SNAPSHOT
[INFO] ------------------------------------------------------------------------
[INFO]
[INFO] --- maven-clean-plugin:2.6.1:clean (default-clean) @ tobago-tool-annotation ---
[INFO] Deleting <https://builds.apache.org/job/Tobago%20Trunk/ws/tobago-tool/tobago-tool-annotation/target>
[INFO]
[INFO] --- animal-sniffer-maven-plugin:1.14:check (default-cli) @ tobago-tool-annotation ---
[INFO] Checking unresolved references to org.codehaus.mojo.signature:java16:1.1
[INFO]
[INFO] --- maven-checkstyle-plugin:2.17:check (default-cli) @ tobago-tool-annotation ---
[INFO] Starting audit...
Audit done.
[INFO]
[INFO] --- maven-enforcer-plugin:3.0.0-M1:enforce (enforce) @ tobago-tool-annotation ---
[INFO]
[INFO] --- maven-remote-resources-plugin:1.5:process (default) @ tobago-tool-annotation ---
[INFO]
[INFO] --- maven-resources-plugin:2.7:resources (default-resources) @ tobago-tool-annotation ---
[INFO] Using 'UTF-8' encoding to copy filtered resources.
[INFO] skip non existing resourceDirectory <https://builds.apache.org/job/Tobago%20Trunk/ws/tobago-tool/tobago-tool-annotation/src/main/resources>
[INFO] Copying 3 resources
[INFO]
[INFO] --- maven-compiler-plugin:3.6.2:compile (default-compile) @ tobago-tool-annotation ---
[INFO] Compiling 17 source files to <https://builds.apache.org/job/Tobago%20Trunk/ws/tobago-tool/tobago-tool-annotation/target/classes>
[INFO]
[INFO] --- maven-resources-plugin:2.7:testResources (default-testResources) @ tobago-tool-annotation ---
[INFO] Using 'UTF-8' encoding to copy filtered resources.
[INFO] skip non existing resourceDirectory <https://builds.apache.org/job/Tobago%20Trunk/ws/tobago-tool/tobago-tool-annotation/src/test/resources>
[INFO] Copying 3 resources
[INFO]
[INFO] --- maven-compiler-plugin:3.6.2:testCompile (default-testCompile) @ tobago-tool-annotation ---
[INFO] No sources to compile
[INFO]
[INFO] --- maven-surefire-plugin:2.19.1:test (default-test) @ tobago-tool-annotation ---
[JENKINS] Recording test results
[INFO]
[INFO] --- maven-jar-plugin:3.0.2:jar (default-jar) @ tobago-tool-annotation ---
[INFO] Building jar: <https://builds.apache.org/job/Tobago%20Trunk/ws/tobago-tool/tobago-tool-annotation/target/tobago-tool-annotation-4.0.0-SNAPSHOT.jar>
[INFO]
[INFO] --- maven-site-plugin:3.6:attach-descriptor (attach-descriptor) @ tobago-tool-annotation ---
[INFO] Skipping because packaging 'jar' is not pom.
[INFO]
[INFO] --- maven-install-plugin:2.5.2:install (default-install) @ tobago-tool-annotation ---
[INFO] Installing <https://builds.apache.org/job/Tobago%20Trunk/ws/tobago-tool/tobago-tool-annotation/target/tobago-tool-annotation-4.0.0-SNAPSHOT.jar> to /home/jenkins/jenkins-slave/maven-repositories/1/org/apache/myfaces/tobago/tobago-tool-annotation/4.0.0-SNAPSHOT/tobago-tool-annotation-4.0.0-SNAPSHOT.jar
[INFO] Installing <https://builds.apache.org/job/Tobago%20Trunk/ws/tobago-tool/tobago-tool-annotation/pom.xml> to /home/jenkins/jenkins-slave/maven-repositories/1/org/apache/myfaces/tobago/tobago-tool-annotation/4.0.0-SNAPSHOT/tobago-tool-annotation-4.0.0-SNAPSHOT.pom
[INFO]
[INFO] ------------------------------------------------------------------------
[INFO] Building Tobago Tool Apt 4.0.0-SNAPSHOT
[INFO] ------------------------------------------------------------------------
[INFO]
[INFO] --- maven-clean-plugin:2.6.1:clean (default-clean) @ tobago-tool-apt ---
[INFO] Deleting <https://builds.apache.org/job/Tobago%20Trunk/ws/tobago-tool/tobago-tool-apt/target>
[INFO]
[INFO] --- animal-sniffer-maven-plugin:1.14:check (default-cli) @ tobago-tool-apt ---
[INFO] Checking unresolved references to org.codehaus.mojo.signature:java16:1.0
[INFO]
[INFO] --- maven-checkstyle-plugin:2.17:check (default-cli) @ tobago-tool-apt ---
[INFO] Starting audit...
Audit done.
[INFO]
[INFO] --- maven-enforcer-plugin:3.0.0-M1:enforce (enforce) @ tobago-tool-apt ---
[INFO]
[INFO] --- maven-remote-resources-plugin:1.5:process (default) @ tobago-tool-apt ---
[INFO]
[INFO] --- maven-resources-plugin:2.7:resources (default-resources) @ tobago-tool-apt ---
[INFO] Using 'UTF-8' encoding to copy filtered resources.
[INFO] Copying 1 resource
[INFO] Copying 3 resources
[INFO]
[INFO] --- maven-compiler-plugin:3.6.2:compile (default-compile) @ tobago-tool-apt ---
[INFO] Compiling 15 source files to <https://builds.apache.org/job/Tobago%20Trunk/ws/tobago-tool/tobago-tool-apt/target/classes>
[INFO] <https://builds.apache.org/job/Tobago%20Trunk/ws/tobago-tool/tobago-tool-apt/src/main/java/org/apache/myfaces/tobago/apt/processor/TaglibGenerator.java>: Some input files use or override a deprecated API.
[INFO] <https://builds.apache.org/job/Tobago%20Trunk/ws/tobago-tool/tobago-tool-apt/src/main/java/org/apache/myfaces/tobago/apt/processor/TaglibGenerator.java>: Recompile with -Xlint:deprecation for details.
[INFO]
[INFO] --- maven-resources-plugin:2.7:testResources (default-testResources) @ tobago-tool-apt ---
[INFO] Using 'UTF-8' encoding to copy filtered resources.
[INFO] skip non existing resourceDirectory <https://builds.apache.org/job/Tobago%20Trunk/ws/tobago-tool/tobago-tool-apt/src/test/resources>
[INFO] Copying 3 resources
[INFO]
[INFO] --- maven-compiler-plugin:3.6.2:testCompile (default-testCompile) @ tobago-tool-apt ---
[INFO] Compiling 1 source file to <https://builds.apache.org/job/Tobago%20Trunk/ws/tobago-tool/tobago-tool-apt/target/test-classes>
[INFO]
[INFO] --- maven-surefire-plugin:2.19.1:test (default-test) @ tobago-tool-apt ---
-------------------------------------------------------
T E S T S
-------------------------------------------------------
Running org.apache.myfaces.tobago.apt.processor.CheckstyleConfigGeneratorUnitTest
Tests run: 1, Failures: 0, Errors: 0, Skipped: 0, Time elapsed: 0.038 sec - in org.apache.myfaces.tobago.apt.processor.CheckstyleConfigGeneratorUnitTest
Results :
Tests run: 1, Failures: 0, Errors: 0, Skipped: 0
[JENKINS] Recording test results
[INFO]
[INFO] --- maven-jar-plugin:3.0.2:jar (default-jar) @ tobago-tool-apt ---
[INFO] Building jar: <https://builds.apache.org/job/Tobago%20Trunk/ws/tobago-tool/tobago-tool-apt/target/tobago-tool-apt-4.0.0-SNAPSHOT.jar>
[INFO]
[INFO] --- maven-site-plugin:3.6:attach-descriptor (attach-descriptor) @ tobago-tool-apt ---
[INFO] Skipping because packaging 'jar' is not pom.
[INFO]
[INFO] --- maven-install-plugin:2.5.2:install (default-install) @ tobago-tool-apt ---
[INFO] Installing <https://builds.apache.org/job/Tobago%20Trunk/ws/tobago-tool/tobago-tool-apt/target/tobago-tool-apt-4.0.0-SNAPSHOT.jar> to /home/jenkins/jenkins-slave/maven-repositories/1/org/apache/myfaces/tobago/tobago-tool-apt/4.0.0-SNAPSHOT/tobago-tool-apt-4.0.0-SNAPSHOT.jar
[INFO] Installing <https://builds.apache.org/job/Tobago%20Trunk/ws/tobago-tool/tobago-tool-apt/pom.xml> to /home/jenkins/jenkins-slave/maven-repositories/1/org/apache/myfaces/tobago/tobago-tool-apt/4.0.0-SNAPSHOT/tobago-tool-apt-4.0.0-SNAPSHOT.pom
[INFO]
[INFO] ------------------------------------------------------------------------
[INFO] Building Tobago Core 4.0.0-SNAPSHOT
[INFO] ------------------------------------------------------------------------
[INFO]
[INFO] --- maven-clean-plugin:2.6.1:clean (default-clean) @ tobago-core ---
[INFO] Deleting <https://builds.apache.org/job/Tobago%20Trunk/ws/tobago-core/target>
[INFO]
[INFO] --- animal-sniffer-maven-plugin:1.14:check (default-cli) @ tobago-core ---
[INFO] Checking unresolved references to org.codehaus.mojo.signature:java16:1.1
[INFO]
[INFO] --- maven-checkstyle-plugin:2.17:check (default-cli) @ tobago-core ---
[INFO] Starting audit...
<https://builds.apache.org/job/Tobago%20Trunk/ws/tobago-core/src/main/java/org/apache/myfaces/tobago/sanitizer/JsoupSanitizer.java>:76: error: Line is longer than 120 characters (found 122).
<https://builds.apache.org/job/Tobago%20Trunk/ws/tobago-core/src/main/java/org/apache/myfaces/tobago/servlet/ResourceServlet.java>:142:29: error: ';' is not followed by whitespace.
Audit done.
[INFO] There are 2 errors reported by Checkstyle 6.11.2 with tobago/checkstyle.xml ruleset.
[ERROR] src/main/java/org/apache/myfaces/tobago/sanitizer/JsoupSanitizer.java:[76] (sizes) LineLength: Line is longer than 120 characters (found 122).
[ERROR] src/main/java/org/apache/myfaces/tobago/servlet/ResourceServlet.java:[142,29] (whitespace) WhitespaceAfter: ';' is not followed by whitespace.
[INFO] ------------------------------------------------------------------------
[INFO] Reactor Summary:
[INFO]
[INFO] Apache Tobago ...................................... SUCCESS [ 7.136 s]
[INFO] Tobago Tool ........................................ SUCCESS [ 2.396 s]
[INFO] Tobago Tool Annotation ............................. SUCCESS [ 6.170 s]
[INFO] Tobago Tool Apt .................................... SUCCESS [01:02 min]
[INFO] Tobago Core ........................................ FAILURE [ 3.943 s]
[INFO] Tobago Themes ...................................... SKIPPED
[INFO] Tobago Theme Standard .............................. SKIPPED
[INFO] Tobago Theme Scarborough ........................... SKIPPED
[INFO] Tobago Theme Speyside .............................. SKIPPED
[INFO] Tobago Theme Roxborough ............................ SKIPPED
[INFO] Tobago Examples .................................... SKIPPED
[INFO] Tobago Example Blank ............................... SKIPPED
[INFO] Tobago Example Data ................................ SKIPPED
[INFO] Tobago Example Demo ................................ SKIPPED
[INFO] Tobago Example Assembly ............................ SKIPPED
[INFO] Tobago Assembly .................................... SKIPPED
[INFO] ------------------------------------------------------------------------
[INFO] BUILD FAILURE
[INFO] ------------------------------------------------------------------------
[INFO] Total time: 01:45 min
[INFO] Finished at: 2017-11-30T15:02:39Z
[INFO] Final Memory: 42M/580M
[INFO] ------------------------------------------------------------------------
[ERROR] Failed to execute goal org.apache.maven.plugins:maven-checkstyle-plugin:2.17:check (default-cli) on project tobago-core: You have 2 Checkstyle violations. -> [Help 1]
[ERROR]
[ERROR] To see the full stack trace of the errors, re-run Maven with the -e switch.
[ERROR] Re-run Maven using the -X switch to enable full debug logging.
[ERROR]
[ERROR] For more information about the errors and possible solutions, please read the following articles:
[ERROR] [Help 1] http://cwiki.apache.org/confluence/display/MAVEN/MojoFailureException
[ERROR]
[ERROR] After correcting the problems, you can resume the build with the command
[ERROR] mvn <goals> -rf :tobago-core
[JENKINS] Archiving <https://builds.apache.org/job/Tobago%20Trunk/ws/tobago-theme/pom.xml> to org.apache.myfaces.tobago/tobago-theme/4.0.0-SNAPSHOT/tobago-theme-4.0.0-SNAPSHOT.pom
[JENKINS] Archiving <https://builds.apache.org/job/Tobago%20Trunk/ws/tobago-example/tobago-example-blank/pom.xml> to org.apache.myfaces.tobago/tobago-example-blank/4.0.0-SNAPSHOT/tobago-example-blank-4.0.0-SNAPSHOT.pom
[JENKINS] Archiving <https://builds.apache.org/job/Tobago%20Trunk/ws/tobago-assembly/pom.xml> to org.apache.myfaces.tobago/tobago-assembly/4.0.0-SNAPSHOT/tobago-assembly-4.0.0-SNAPSHOT.pom
[JENKINS] Archiving <https://builds.apache.org/job/Tobago%20Trunk/ws/pom.xml> to org.apache.myfaces.tobago/tobago/4.0.0-SNAPSHOT/tobago-4.0.0-SNAPSHOT.pom
[JENKINS] Archiving <https://builds.apache.org/job/Tobago%20Trunk/ws/target/tobago-4.0.0-SNAPSHOT-site.xml> to org.apache.myfaces.tobago/tobago/4.0.0-SNAPSHOT/tobago-4.0.0-SNAPSHOT-site.xml
[Fast Archiver] Compressed 52.96 KB of artifacts by 60.4% relative to #1178
[JENKINS] Archiving <https://builds.apache.org/job/Tobago%20Trunk/ws/tobago-theme/tobago-theme-standard/pom.xml> to org.apache.myfaces.tobago/tobago-theme-standard/4.0.0-SNAPSHOT/tobago-theme-standard-4.0.0-SNAPSHOT.pom
[JENKINS] Archiving <https://builds.apache.org/job/Tobago%20Trunk/ws/tobago-theme/tobago-theme-scarborough/pom.xml> to org.apache.myfaces.tobago/tobago-theme-scarborough/4.0.0-SNAPSHOT/tobago-theme-scarborough-4.0.0-SNAPSHOT.pom
[JENKINS] Archiving <https://builds.apache.org/job/Tobago%20Trunk/ws/tobago-example/tobago-example-assembly/pom.xml> to org.apache.myfaces.tobago/tobago-example-assembly/4.0.0-SNAPSHOT/tobago-example-assembly-4.0.0-SNAPSHOT.pom
[JENKINS] Archiving <https://builds.apache.org/job/Tobago%20Trunk/ws/tobago-theme/tobago-theme-speyside/pom.xml> to org.apache.myfaces.tobago/tobago-theme-speyside/4.0.0-SNAPSHOT/tobago-theme-speyside-4.0.0-SNAPSHOT.pom
[JENKINS] Archiving <https://builds.apache.org/job/Tobago%20Trunk/ws/tobago-theme/tobago-theme-roxborough/pom.xml> to org.apache.myfaces.tobago/tobago-theme-roxborough/4.0.0-SNAPSHOT/tobago-theme-roxborough-4.0.0-SNAPSHOT.pom
[JENKINS] Archiving <https://builds.apache.org/job/Tobago%20Trunk/ws/tobago-tool/tobago-tool-annotation/pom.xml> to org.apache.myfaces.tobago/tobago-tool-annotation/4.0.0-SNAPSHOT/tobago-tool-annotation-4.0.0-SNAPSHOT.pom
[JENKINS] Archiving <https://builds.apache.org/job/Tobago%20Trunk/ws/tobago-tool/tobago-tool-annotation/target/tobago-tool-annotation-4.0.0-SNAPSHOT.jar> to org.apache.myfaces.tobago/tobago-tool-annotation/4.0.0-SNAPSHOT/tobago-tool-annotation-4.0.0-SNAPSHOT.jar
[JENKINS] Archiving <https://builds.apache.org/job/Tobago%20Trunk/ws/tobago-example/pom.xml> to org.apache.myfaces.tobago/tobago-example/4.0.0-SNAPSHOT/tobago-example-4.0.0-SNAPSHOT.pom
[JENKINS] Archiving <https://builds.apache.org/job/Tobago%20Trunk/ws/tobago-example/tobago-example-data/pom.xml> to org.apache.myfaces.tobago/tobago-example-data/4.0.0-SNAPSHOT/tobago-example-data-4.0.0-SNAPSHOT.pom
[JENKINS] Archiving <https://builds.apache.org/job/Tobago%20Trunk/ws/tobago-tool/pom.xml> to org.apache.myfaces.tobago/tobago-tool/4.0.0-SNAPSHOT/tobago-tool-4.0.0-SNAPSHOT.pom
[JENKINS] Archiving <https://builds.apache.org/job/Tobago%20Trunk/ws/tobago-core/pom.xml> to org.apache.myfaces.tobago/tobago-core/4.0.0-SNAPSHOT/tobago-core-4.0.0-SNAPSHOT.pom
[JENKINS] Archiving <https://builds.apache.org/job/Tobago%20Trunk/ws/tobago-tool/tobago-tool-apt/pom.xml> to org.apache.myfaces.tobago/tobago-tool-apt/4.0.0-SNAPSHOT/tobago-tool-apt-4.0.0-SNAPSHOT.pom
[JENKINS] Archiving <https://builds.apache.org/job/Tobago%20Trunk/ws/tobago-tool/tobago-tool-apt/target/tobago-tool-apt-4.0.0-SNAPSHOT.jar> to org.apache.myfaces.tobago/tobago-tool-apt/4.0.0-SNAPSHOT/tobago-tool-apt-4.0.0-SNAPSHOT.jar
[JENKINS] Archiving <https://builds.apache.org/job/Tobago%20Trunk/ws/tobago-example/tobago-example-demo/pom.xml> to org.apache.myfaces.tobago/tobago-example-demo/4.0.0-SNAPSHOT/tobago-example-demo-4.0.0-SNAPSHOT.pom
Sending e-mails to: commits@myfaces.apache.org
channel stopped
Build failed in Jenkins: Tobago Trunk #1178
Posted by Apache Jenkins Server <je...@builds.apache.org>.
See <https://builds.apache.org/job/Tobago%20Trunk/1178/display/redirect?page=changes>
Changes:
[lofwyr] TOBAGO-1782: Clean up * @Override
------------------------------------------
[...truncated 4.65 KB...]
[INFO] Tobago Tool
[INFO] Tobago Tool Annotation
[INFO] Tobago Tool Apt
[INFO] Tobago Core
[INFO] Tobago Themes
[INFO] Tobago Theme Standard
[INFO] Tobago Theme Scarborough
[INFO] Tobago Theme Speyside
[INFO] Tobago Theme Roxborough
[INFO] Tobago Examples
[INFO] Tobago Example Blank
[INFO] Tobago Example Data
[INFO] Tobago Example Demo
[INFO] Tobago Example Assembly
[INFO] Tobago Assembly
[INFO]
[INFO] ------------------------------------------------------------------------
[INFO] Building Apache Tobago 4.0.0-SNAPSHOT
[INFO] ------------------------------------------------------------------------
[INFO]
[INFO] --- maven-clean-plugin:2.6.1:clean (default-clean) @ tobago ---
[INFO] Deleting <https://builds.apache.org/job/Tobago%20Trunk/ws/target>
[INFO]
[INFO] --- animal-sniffer-maven-plugin:1.14:check (default-cli) @ tobago ---
[INFO] Checking unresolved references to org.codehaus.mojo.signature:java16:1.1
[INFO]
[INFO] --- maven-checkstyle-plugin:2.17:check (default-cli) @ tobago ---
[INFO] Starting audit...
Audit done.
[INFO]
[INFO] --- maven-enforcer-plugin:3.0.0-M1:enforce (enforce) @ tobago ---
[INFO]
[INFO] --- maven-remote-resources-plugin:1.5:process (default) @ tobago ---
[INFO]
[INFO] --- maven-site-plugin:3.6:attach-descriptor (attach-descriptor) @ tobago ---
[INFO] Attaching 'src/site/site.xml' site descriptor with classifier 'site'.
[INFO]
[INFO] --- maven-install-plugin:2.5.2:install (default-install) @ tobago ---
[INFO] Installing <https://builds.apache.org/job/Tobago%20Trunk/ws/pom.xml> to /home/jenkins/jenkins-slave/maven-repositories/1/org/apache/myfaces/tobago/tobago/4.0.0-SNAPSHOT/tobago-4.0.0-SNAPSHOT.pom
[INFO] Installing <https://builds.apache.org/job/Tobago%20Trunk/ws/target/tobago-4.0.0-SNAPSHOT-site.xml> to /home/jenkins/jenkins-slave/maven-repositories/1/org/apache/myfaces/tobago/tobago/4.0.0-SNAPSHOT/tobago-4.0.0-SNAPSHOT-site.xml
[INFO]
[INFO] ------------------------------------------------------------------------
[INFO] Building Tobago Tool 4.0.0-SNAPSHOT
[INFO] ------------------------------------------------------------------------
[INFO]
[INFO] --- maven-clean-plugin:2.6.1:clean (default-clean) @ tobago-tool ---
[INFO] Deleting <https://builds.apache.org/job/Tobago%20Trunk/ws/tobago-tool/target>
[INFO]
[INFO] --- animal-sniffer-maven-plugin:1.14:check (default-cli) @ tobago-tool ---
[INFO] Checking unresolved references to org.codehaus.mojo.signature:java16:1.1
[INFO]
[INFO] --- maven-checkstyle-plugin:2.17:check (default-cli) @ tobago-tool ---
[INFO] Starting audit...
Audit done.
[INFO]
[INFO] --- maven-enforcer-plugin:3.0.0-M1:enforce (enforce) @ tobago-tool ---
[INFO]
[INFO] --- maven-remote-resources-plugin:1.5:process (default) @ tobago-tool ---
[INFO]
[INFO] --- maven-site-plugin:3.6:attach-descriptor (attach-descriptor) @ tobago-tool ---
[INFO] No site descriptor found: nothing to attach.
[INFO]
[INFO] --- maven-install-plugin:2.5.2:install (default-install) @ tobago-tool ---
[INFO] Installing <https://builds.apache.org/job/Tobago%20Trunk/ws/tobago-tool/pom.xml> to /home/jenkins/jenkins-slave/maven-repositories/1/org/apache/myfaces/tobago/tobago-tool/4.0.0-SNAPSHOT/tobago-tool-4.0.0-SNAPSHOT.pom
[INFO]
[INFO] ------------------------------------------------------------------------
[INFO] Building Tobago Tool Annotation 4.0.0-SNAPSHOT
[INFO] ------------------------------------------------------------------------
[INFO]
[INFO] --- maven-clean-plugin:2.6.1:clean (default-clean) @ tobago-tool-annotation ---
[INFO] Deleting <https://builds.apache.org/job/Tobago%20Trunk/ws/tobago-tool/tobago-tool-annotation/target>
[INFO]
[INFO] --- animal-sniffer-maven-plugin:1.14:check (default-cli) @ tobago-tool-annotation ---
[INFO] Checking unresolved references to org.codehaus.mojo.signature:java16:1.1
[INFO]
[INFO] --- maven-checkstyle-plugin:2.17:check (default-cli) @ tobago-tool-annotation ---
[INFO] Starting audit...
Audit done.
[INFO]
[INFO] --- maven-enforcer-plugin:3.0.0-M1:enforce (enforce) @ tobago-tool-annotation ---
[INFO]
[INFO] --- maven-remote-resources-plugin:1.5:process (default) @ tobago-tool-annotation ---
[INFO]
[INFO] --- maven-resources-plugin:2.7:resources (default-resources) @ tobago-tool-annotation ---
[INFO] Using 'UTF-8' encoding to copy filtered resources.
[INFO] skip non existing resourceDirectory <https://builds.apache.org/job/Tobago%20Trunk/ws/tobago-tool/tobago-tool-annotation/src/main/resources>
[INFO] Copying 3 resources
[INFO]
[INFO] --- maven-compiler-plugin:3.6.2:compile (default-compile) @ tobago-tool-annotation ---
[INFO] Compiling 17 source files to <https://builds.apache.org/job/Tobago%20Trunk/ws/tobago-tool/tobago-tool-annotation/target/classes>
[INFO]
[INFO] --- maven-resources-plugin:2.7:testResources (default-testResources) @ tobago-tool-annotation ---
[INFO] Using 'UTF-8' encoding to copy filtered resources.
[INFO] skip non existing resourceDirectory <https://builds.apache.org/job/Tobago%20Trunk/ws/tobago-tool/tobago-tool-annotation/src/test/resources>
[INFO] Copying 3 resources
[INFO]
[INFO] --- maven-compiler-plugin:3.6.2:testCompile (default-testCompile) @ tobago-tool-annotation ---
[INFO] No sources to compile
[INFO]
[INFO] --- maven-surefire-plugin:2.19.1:test (default-test) @ tobago-tool-annotation ---
[JENKINS] Recording test results
[INFO]
[INFO] --- maven-jar-plugin:3.0.2:jar (default-jar) @ tobago-tool-annotation ---
[INFO] Building jar: <https://builds.apache.org/job/Tobago%20Trunk/ws/tobago-tool/tobago-tool-annotation/target/tobago-tool-annotation-4.0.0-SNAPSHOT.jar>
[INFO]
[INFO] --- maven-site-plugin:3.6:attach-descriptor (attach-descriptor) @ tobago-tool-annotation ---
[INFO] Skipping because packaging 'jar' is not pom.
[INFO]
[INFO] --- maven-install-plugin:2.5.2:install (default-install) @ tobago-tool-annotation ---
[INFO] Installing <https://builds.apache.org/job/Tobago%20Trunk/ws/tobago-tool/tobago-tool-annotation/target/tobago-tool-annotation-4.0.0-SNAPSHOT.jar> to /home/jenkins/jenkins-slave/maven-repositories/1/org/apache/myfaces/tobago/tobago-tool-annotation/4.0.0-SNAPSHOT/tobago-tool-annotation-4.0.0-SNAPSHOT.jar
[INFO] Installing <https://builds.apache.org/job/Tobago%20Trunk/ws/tobago-tool/tobago-tool-annotation/pom.xml> to /home/jenkins/jenkins-slave/maven-repositories/1/org/apache/myfaces/tobago/tobago-tool-annotation/4.0.0-SNAPSHOT/tobago-tool-annotation-4.0.0-SNAPSHOT.pom
[INFO]
[INFO] ------------------------------------------------------------------------
[INFO] Building Tobago Tool Apt 4.0.0-SNAPSHOT
[INFO] ------------------------------------------------------------------------
[INFO]
[INFO] --- maven-clean-plugin:2.6.1:clean (default-clean) @ tobago-tool-apt ---
[INFO] Deleting <https://builds.apache.org/job/Tobago%20Trunk/ws/tobago-tool/tobago-tool-apt/target>
[INFO]
[INFO] --- animal-sniffer-maven-plugin:1.14:check (default-cli) @ tobago-tool-apt ---
[INFO] Checking unresolved references to org.codehaus.mojo.signature:java16:1.0
[INFO]
[INFO] --- maven-checkstyle-plugin:2.17:check (default-cli) @ tobago-tool-apt ---
[INFO] Starting audit...
Audit done.
[INFO]
[INFO] --- maven-enforcer-plugin:3.0.0-M1:enforce (enforce) @ tobago-tool-apt ---
[INFO]
[INFO] --- maven-remote-resources-plugin:1.5:process (default) @ tobago-tool-apt ---
[INFO]
[INFO] --- maven-resources-plugin:2.7:resources (default-resources) @ tobago-tool-apt ---
[INFO] Using 'UTF-8' encoding to copy filtered resources.
[INFO] Copying 1 resource
[INFO] Copying 3 resources
[INFO]
[INFO] --- maven-compiler-plugin:3.6.2:compile (default-compile) @ tobago-tool-apt ---
[INFO] Compiling 15 source files to <https://builds.apache.org/job/Tobago%20Trunk/ws/tobago-tool/tobago-tool-apt/target/classes>
[INFO] <https://builds.apache.org/job/Tobago%20Trunk/ws/tobago-tool/tobago-tool-apt/src/main/java/org/apache/myfaces/tobago/apt/processor/TaglibGenerator.java>: Some input files use or override a deprecated API.
[INFO] <https://builds.apache.org/job/Tobago%20Trunk/ws/tobago-tool/tobago-tool-apt/src/main/java/org/apache/myfaces/tobago/apt/processor/TaglibGenerator.java>: Recompile with -Xlint:deprecation for details.
[INFO]
[INFO] --- maven-resources-plugin:2.7:testResources (default-testResources) @ tobago-tool-apt ---
[INFO] Using 'UTF-8' encoding to copy filtered resources.
[INFO] skip non existing resourceDirectory <https://builds.apache.org/job/Tobago%20Trunk/ws/tobago-tool/tobago-tool-apt/src/test/resources>
[INFO] Copying 3 resources
[INFO]
[INFO] --- maven-compiler-plugin:3.6.2:testCompile (default-testCompile) @ tobago-tool-apt ---
[INFO] Compiling 1 source file to <https://builds.apache.org/job/Tobago%20Trunk/ws/tobago-tool/tobago-tool-apt/target/test-classes>
[INFO]
[INFO] --- maven-surefire-plugin:2.19.1:test (default-test) @ tobago-tool-apt ---
-------------------------------------------------------
T E S T S
-------------------------------------------------------
Running org.apache.myfaces.tobago.apt.processor.CheckstyleConfigGeneratorUnitTest
Tests run: 1, Failures: 0, Errors: 0, Skipped: 0, Time elapsed: 0.039 sec - in org.apache.myfaces.tobago.apt.processor.CheckstyleConfigGeneratorUnitTest
Results :
Tests run: 1, Failures: 0, Errors: 0, Skipped: 0
[JENKINS] Recording test results
[INFO]
[INFO] --- maven-jar-plugin:3.0.2:jar (default-jar) @ tobago-tool-apt ---
[INFO] Building jar: <https://builds.apache.org/job/Tobago%20Trunk/ws/tobago-tool/tobago-tool-apt/target/tobago-tool-apt-4.0.0-SNAPSHOT.jar>
[INFO]
[INFO] --- maven-site-plugin:3.6:attach-descriptor (attach-descriptor) @ tobago-tool-apt ---
[INFO] Skipping because packaging 'jar' is not pom.
[INFO]
[INFO] --- maven-install-plugin:2.5.2:install (default-install) @ tobago-tool-apt ---
[INFO] Installing <https://builds.apache.org/job/Tobago%20Trunk/ws/tobago-tool/tobago-tool-apt/target/tobago-tool-apt-4.0.0-SNAPSHOT.jar> to /home/jenkins/jenkins-slave/maven-repositories/1/org/apache/myfaces/tobago/tobago-tool-apt/4.0.0-SNAPSHOT/tobago-tool-apt-4.0.0-SNAPSHOT.jar
[INFO] Installing <https://builds.apache.org/job/Tobago%20Trunk/ws/tobago-tool/tobago-tool-apt/pom.xml> to /home/jenkins/jenkins-slave/maven-repositories/1/org/apache/myfaces/tobago/tobago-tool-apt/4.0.0-SNAPSHOT/tobago-tool-apt-4.0.0-SNAPSHOT.pom
[INFO]
[INFO] ------------------------------------------------------------------------
[INFO] Building Tobago Core 4.0.0-SNAPSHOT
[INFO] ------------------------------------------------------------------------
[INFO]
[INFO] --- maven-clean-plugin:2.6.1:clean (default-clean) @ tobago-core ---
[INFO] Deleting <https://builds.apache.org/job/Tobago%20Trunk/ws/tobago-core/target>
[INFO]
[INFO] --- animal-sniffer-maven-plugin:1.14:check (default-cli) @ tobago-core ---
[INFO] Checking unresolved references to org.codehaus.mojo.signature:java16:1.1
[INFO]
[INFO] --- maven-checkstyle-plugin:2.17:check (default-cli) @ tobago-core ---
[INFO] Starting audit...
<https://builds.apache.org/job/Tobago%20Trunk/ws/tobago-core/src/main/java/org/apache/myfaces/tobago/sanitizer/JsoupSanitizer.java>:76: error: Line is longer than 120 characters (found 122).
<https://builds.apache.org/job/Tobago%20Trunk/ws/tobago-core/src/main/java/org/apache/myfaces/tobago/servlet/ResourceServlet.java>:142:29: error: ';' is not followed by whitespace.
Audit done.
[INFO] There are 2 errors reported by Checkstyle 6.11.2 with tobago/checkstyle.xml ruleset.
[ERROR] src/main/java/org/apache/myfaces/tobago/sanitizer/JsoupSanitizer.java:[76] (sizes) LineLength: Line is longer than 120 characters (found 122).
[ERROR] src/main/java/org/apache/myfaces/tobago/servlet/ResourceServlet.java:[142,29] (whitespace) WhitespaceAfter: ';' is not followed by whitespace.
[INFO] ------------------------------------------------------------------------
[INFO] Reactor Summary:
[INFO]
[INFO] Apache Tobago ...................................... SUCCESS [ 7.081 s]
[INFO] Tobago Tool ........................................ SUCCESS [ 2.445 s]
[INFO] Tobago Tool Annotation ............................. SUCCESS [ 6.130 s]
[INFO] Tobago Tool Apt .................................... SUCCESS [01:03 min]
[INFO] Tobago Core ........................................ FAILURE [ 4.402 s]
[INFO] Tobago Themes ...................................... SKIPPED
[INFO] Tobago Theme Standard .............................. SKIPPED
[INFO] Tobago Theme Scarborough ........................... SKIPPED
[INFO] Tobago Theme Speyside .............................. SKIPPED
[INFO] Tobago Theme Roxborough ............................ SKIPPED
[INFO] Tobago Examples .................................... SKIPPED
[INFO] Tobago Example Blank ............................... SKIPPED
[INFO] Tobago Example Data ................................ SKIPPED
[INFO] Tobago Example Demo ................................ SKIPPED
[INFO] Tobago Example Assembly ............................ SKIPPED
[INFO] Tobago Assembly .................................... SKIPPED
[INFO] ------------------------------------------------------------------------
[INFO] BUILD FAILURE
[INFO] ------------------------------------------------------------------------
[INFO] Total time: 01:47 min
[INFO] Finished at: 2017-11-30T14:33:58Z
[INFO] Final Memory: 42M/599M
[INFO] ------------------------------------------------------------------------
[ERROR] Failed to execute goal org.apache.maven.plugins:maven-checkstyle-plugin:2.17:check (default-cli) on project tobago-core: You have 2 Checkstyle violations. -> [Help 1]
[ERROR]
[ERROR] To see the full stack trace of the errors, re-run Maven with the -e switch.
[ERROR] Re-run Maven using the -X switch to enable full debug logging.
[ERROR]
[ERROR] For more information about the errors and possible solutions, please read the following articles:
[ERROR] [Help 1] http://cwiki.apache.org/confluence/display/MAVEN/MojoFailureException
[ERROR]
[ERROR] After correcting the problems, you can resume the build with the command
[ERROR] mvn <goals> -rf :tobago-core
[JENKINS] Archiving <https://builds.apache.org/job/Tobago%20Trunk/ws/tobago-theme/pom.xml> to org.apache.myfaces.tobago/tobago-theme/4.0.0-SNAPSHOT/tobago-theme-4.0.0-SNAPSHOT.pom
[JENKINS] Archiving <https://builds.apache.org/job/Tobago%20Trunk/ws/tobago-example/tobago-example-blank/pom.xml> to org.apache.myfaces.tobago/tobago-example-blank/4.0.0-SNAPSHOT/tobago-example-blank-4.0.0-SNAPSHOT.pom
[JENKINS] Archiving <https://builds.apache.org/job/Tobago%20Trunk/ws/tobago-assembly/pom.xml> to org.apache.myfaces.tobago/tobago-assembly/4.0.0-SNAPSHOT/tobago-assembly-4.0.0-SNAPSHOT.pom
[JENKINS] Archiving <https://builds.apache.org/job/Tobago%20Trunk/ws/pom.xml> to org.apache.myfaces.tobago/tobago/4.0.0-SNAPSHOT/tobago-4.0.0-SNAPSHOT.pom
[JENKINS] Archiving <https://builds.apache.org/job/Tobago%20Trunk/ws/target/tobago-4.0.0-SNAPSHOT-site.xml> to org.apache.myfaces.tobago/tobago/4.0.0-SNAPSHOT/tobago-4.0.0-SNAPSHOT-site.xml
[Fast Archiver] Compressed 52.96 KB of artifacts by 60.4% relative to #1177
[JENKINS] Archiving <https://builds.apache.org/job/Tobago%20Trunk/ws/tobago-theme/tobago-theme-standard/pom.xml> to org.apache.myfaces.tobago/tobago-theme-standard/4.0.0-SNAPSHOT/tobago-theme-standard-4.0.0-SNAPSHOT.pom
[JENKINS] Archiving <https://builds.apache.org/job/Tobago%20Trunk/ws/tobago-theme/tobago-theme-scarborough/pom.xml> to org.apache.myfaces.tobago/tobago-theme-scarborough/4.0.0-SNAPSHOT/tobago-theme-scarborough-4.0.0-SNAPSHOT.pom
[JENKINS] Archiving <https://builds.apache.org/job/Tobago%20Trunk/ws/tobago-example/tobago-example-assembly/pom.xml> to org.apache.myfaces.tobago/tobago-example-assembly/4.0.0-SNAPSHOT/tobago-example-assembly-4.0.0-SNAPSHOT.pom
[JENKINS] Archiving <https://builds.apache.org/job/Tobago%20Trunk/ws/tobago-theme/tobago-theme-speyside/pom.xml> to org.apache.myfaces.tobago/tobago-theme-speyside/4.0.0-SNAPSHOT/tobago-theme-speyside-4.0.0-SNAPSHOT.pom
[JENKINS] Archiving <https://builds.apache.org/job/Tobago%20Trunk/ws/tobago-theme/tobago-theme-roxborough/pom.xml> to org.apache.myfaces.tobago/tobago-theme-roxborough/4.0.0-SNAPSHOT/tobago-theme-roxborough-4.0.0-SNAPSHOT.pom
[JENKINS] Archiving <https://builds.apache.org/job/Tobago%20Trunk/ws/tobago-tool/tobago-tool-annotation/pom.xml> to org.apache.myfaces.tobago/tobago-tool-annotation/4.0.0-SNAPSHOT/tobago-tool-annotation-4.0.0-SNAPSHOT.pom
[JENKINS] Archiving <https://builds.apache.org/job/Tobago%20Trunk/ws/tobago-tool/tobago-tool-annotation/target/tobago-tool-annotation-4.0.0-SNAPSHOT.jar> to org.apache.myfaces.tobago/tobago-tool-annotation/4.0.0-SNAPSHOT/tobago-tool-annotation-4.0.0-SNAPSHOT.jar
[JENKINS] Archiving <https://builds.apache.org/job/Tobago%20Trunk/ws/tobago-example/pom.xml> to org.apache.myfaces.tobago/tobago-example/4.0.0-SNAPSHOT/tobago-example-4.0.0-SNAPSHOT.pom
[JENKINS] Archiving <https://builds.apache.org/job/Tobago%20Trunk/ws/tobago-example/tobago-example-data/pom.xml> to org.apache.myfaces.tobago/tobago-example-data/4.0.0-SNAPSHOT/tobago-example-data-4.0.0-SNAPSHOT.pom
[JENKINS] Archiving <https://builds.apache.org/job/Tobago%20Trunk/ws/tobago-tool/pom.xml> to org.apache.myfaces.tobago/tobago-tool/4.0.0-SNAPSHOT/tobago-tool-4.0.0-SNAPSHOT.pom
[JENKINS] Archiving <https://builds.apache.org/job/Tobago%20Trunk/ws/tobago-core/pom.xml> to org.apache.myfaces.tobago/tobago-core/4.0.0-SNAPSHOT/tobago-core-4.0.0-SNAPSHOT.pom
[JENKINS] Archiving <https://builds.apache.org/job/Tobago%20Trunk/ws/tobago-tool/tobago-tool-apt/pom.xml> to org.apache.myfaces.tobago/tobago-tool-apt/4.0.0-SNAPSHOT/tobago-tool-apt-4.0.0-SNAPSHOT.pom
[JENKINS] Archiving <https://builds.apache.org/job/Tobago%20Trunk/ws/tobago-tool/tobago-tool-apt/target/tobago-tool-apt-4.0.0-SNAPSHOT.jar> to org.apache.myfaces.tobago/tobago-tool-apt/4.0.0-SNAPSHOT/tobago-tool-apt-4.0.0-SNAPSHOT.jar
[JENKINS] Archiving <https://builds.apache.org/job/Tobago%20Trunk/ws/tobago-example/tobago-example-demo/pom.xml> to org.apache.myfaces.tobago/tobago-example-demo/4.0.0-SNAPSHOT/tobago-example-demo-4.0.0-SNAPSHOT.pom
Sending e-mails to: commits@myfaces.apache.org
channel stopped
[JIRA] Updating issue TOBAGO-1782
Build failed in Jenkins: Tobago Trunk #1177
Posted by Apache Jenkins Server <je...@builds.apache.org>.
See <https://builds.apache.org/job/Tobago%20Trunk/1177/display/redirect?page=changes>
Changes:
[lofwyr] TOBAGO-1782: Clean up * checkstyle
------------------------------------------
[...truncated 4.73 KB...]
[INFO] Tobago Core
[INFO] Tobago Themes
[INFO] Tobago Theme Standard
[INFO] Tobago Theme Scarborough
[INFO] Tobago Theme Speyside
[INFO] Tobago Theme Roxborough
[INFO] Tobago Examples
[INFO] Tobago Example Blank
[INFO] Tobago Example Data
[INFO] Tobago Example Demo
[INFO] Tobago Example Assembly
[INFO] Tobago Assembly
[INFO]
[INFO] ------------------------------------------------------------------------
[INFO] Building Apache Tobago 4.0.0-SNAPSHOT
[INFO] ------------------------------------------------------------------------
[INFO]
[INFO] --- maven-clean-plugin:2.6.1:clean (default-clean) @ tobago ---
[INFO] Deleting <https://builds.apache.org/job/Tobago%20Trunk/ws/target>
[INFO]
[INFO] --- animal-sniffer-maven-plugin:1.14:check (default-cli) @ tobago ---
[INFO] Checking unresolved references to org.codehaus.mojo.signature:java16:1.1
[INFO]
[INFO] --- maven-checkstyle-plugin:2.17:check (default-cli) @ tobago ---
[INFO] Starting audit...
Audit done.
[INFO]
[INFO] --- maven-enforcer-plugin:3.0.0-M1:enforce (enforce) @ tobago ---
[INFO]
[INFO] --- maven-remote-resources-plugin:1.5:process (default) @ tobago ---
[INFO]
[INFO] --- maven-site-plugin:3.6:attach-descriptor (attach-descriptor) @ tobago ---
[INFO] Attaching 'src/site/site.xml' site descriptor with classifier 'site'.
[INFO]
[INFO] --- maven-install-plugin:2.5.2:install (default-install) @ tobago ---
[INFO] Installing <https://builds.apache.org/job/Tobago%20Trunk/ws/pom.xml> to /home/jenkins/jenkins-slave/maven-repositories/1/org/apache/myfaces/tobago/tobago/4.0.0-SNAPSHOT/tobago-4.0.0-SNAPSHOT.pom
[INFO] Installing <https://builds.apache.org/job/Tobago%20Trunk/ws/target/tobago-4.0.0-SNAPSHOT-site.xml> to /home/jenkins/jenkins-slave/maven-repositories/1/org/apache/myfaces/tobago/tobago/4.0.0-SNAPSHOT/tobago-4.0.0-SNAPSHOT-site.xml
[INFO]
[INFO] ------------------------------------------------------------------------
[INFO] Building Tobago Tool 4.0.0-SNAPSHOT
[INFO] ------------------------------------------------------------------------
[INFO]
[INFO] --- maven-clean-plugin:2.6.1:clean (default-clean) @ tobago-tool ---
[INFO] Deleting <https://builds.apache.org/job/Tobago%20Trunk/ws/tobago-tool/target>
[INFO]
[INFO] --- animal-sniffer-maven-plugin:1.14:check (default-cli) @ tobago-tool ---
[INFO] Checking unresolved references to org.codehaus.mojo.signature:java16:1.1
[INFO]
[INFO] --- maven-checkstyle-plugin:2.17:check (default-cli) @ tobago-tool ---
[INFO] Starting audit...
Audit done.
[INFO]
[INFO] --- maven-enforcer-plugin:3.0.0-M1:enforce (enforce) @ tobago-tool ---
[INFO]
[INFO] --- maven-remote-resources-plugin:1.5:process (default) @ tobago-tool ---
[INFO]
[INFO] --- maven-site-plugin:3.6:attach-descriptor (attach-descriptor) @ tobago-tool ---
[INFO] No site descriptor found: nothing to attach.
[INFO]
[INFO] --- maven-install-plugin:2.5.2:install (default-install) @ tobago-tool ---
[INFO] Installing <https://builds.apache.org/job/Tobago%20Trunk/ws/tobago-tool/pom.xml> to /home/jenkins/jenkins-slave/maven-repositories/1/org/apache/myfaces/tobago/tobago-tool/4.0.0-SNAPSHOT/tobago-tool-4.0.0-SNAPSHOT.pom
[INFO]
[INFO] ------------------------------------------------------------------------
[INFO] Building Tobago Tool Annotation 4.0.0-SNAPSHOT
[INFO] ------------------------------------------------------------------------
[INFO]
[INFO] --- maven-clean-plugin:2.6.1:clean (default-clean) @ tobago-tool-annotation ---
[INFO] Deleting <https://builds.apache.org/job/Tobago%20Trunk/ws/tobago-tool/tobago-tool-annotation/target>
[INFO]
[INFO] --- animal-sniffer-maven-plugin:1.14:check (default-cli) @ tobago-tool-annotation ---
[INFO] Checking unresolved references to org.codehaus.mojo.signature:java16:1.1
[INFO]
[INFO] --- maven-checkstyle-plugin:2.17:check (default-cli) @ tobago-tool-annotation ---
[INFO] Starting audit...
Audit done.
[INFO]
[INFO] --- maven-enforcer-plugin:3.0.0-M1:enforce (enforce) @ tobago-tool-annotation ---
[INFO]
[INFO] --- maven-remote-resources-plugin:1.5:process (default) @ tobago-tool-annotation ---
[INFO]
[INFO] --- maven-resources-plugin:2.7:resources (default-resources) @ tobago-tool-annotation ---
[INFO] Using 'UTF-8' encoding to copy filtered resources.
[INFO] skip non existing resourceDirectory <https://builds.apache.org/job/Tobago%20Trunk/ws/tobago-tool/tobago-tool-annotation/src/main/resources>
[INFO] Copying 3 resources
[INFO]
[INFO] --- maven-compiler-plugin:3.6.2:compile (default-compile) @ tobago-tool-annotation ---
[INFO] Compiling 17 source files to <https://builds.apache.org/job/Tobago%20Trunk/ws/tobago-tool/tobago-tool-annotation/target/classes>
[INFO]
[INFO] --- maven-resources-plugin:2.7:testResources (default-testResources) @ tobago-tool-annotation ---
[INFO] Using 'UTF-8' encoding to copy filtered resources.
[INFO] skip non existing resourceDirectory <https://builds.apache.org/job/Tobago%20Trunk/ws/tobago-tool/tobago-tool-annotation/src/test/resources>
[INFO] Copying 3 resources
[INFO]
[INFO] --- maven-compiler-plugin:3.6.2:testCompile (default-testCompile) @ tobago-tool-annotation ---
[INFO] No sources to compile
[INFO]
[INFO] --- maven-surefire-plugin:2.19.1:test (default-test) @ tobago-tool-annotation ---
[JENKINS] Recording test results
[INFO]
[INFO] --- maven-jar-plugin:3.0.2:jar (default-jar) @ tobago-tool-annotation ---
[INFO] Building jar: <https://builds.apache.org/job/Tobago%20Trunk/ws/tobago-tool/tobago-tool-annotation/target/tobago-tool-annotation-4.0.0-SNAPSHOT.jar>
[INFO]
[INFO] --- maven-site-plugin:3.6:attach-descriptor (attach-descriptor) @ tobago-tool-annotation ---
[INFO] Skipping because packaging 'jar' is not pom.
[INFO]
[INFO] --- maven-install-plugin:2.5.2:install (default-install) @ tobago-tool-annotation ---
[INFO] Installing <https://builds.apache.org/job/Tobago%20Trunk/ws/tobago-tool/tobago-tool-annotation/target/tobago-tool-annotation-4.0.0-SNAPSHOT.jar> to /home/jenkins/jenkins-slave/maven-repositories/1/org/apache/myfaces/tobago/tobago-tool-annotation/4.0.0-SNAPSHOT/tobago-tool-annotation-4.0.0-SNAPSHOT.jar
[INFO] Installing <https://builds.apache.org/job/Tobago%20Trunk/ws/tobago-tool/tobago-tool-annotation/pom.xml> to /home/jenkins/jenkins-slave/maven-repositories/1/org/apache/myfaces/tobago/tobago-tool-annotation/4.0.0-SNAPSHOT/tobago-tool-annotation-4.0.0-SNAPSHOT.pom
[INFO]
[INFO] ------------------------------------------------------------------------
[INFO] Building Tobago Tool Apt 4.0.0-SNAPSHOT
[INFO] ------------------------------------------------------------------------
[INFO]
[INFO] --- maven-clean-plugin:2.6.1:clean (default-clean) @ tobago-tool-apt ---
[INFO] Deleting <https://builds.apache.org/job/Tobago%20Trunk/ws/tobago-tool/tobago-tool-apt/target>
[INFO]
[INFO] --- animal-sniffer-maven-plugin:1.14:check (default-cli) @ tobago-tool-apt ---
[INFO] Checking unresolved references to org.codehaus.mojo.signature:java16:1.0
[INFO]
[INFO] --- maven-checkstyle-plugin:2.17:check (default-cli) @ tobago-tool-apt ---
[INFO] Starting audit...
Audit done.
[INFO]
[INFO] --- maven-enforcer-plugin:3.0.0-M1:enforce (enforce) @ tobago-tool-apt ---
[INFO]
[INFO] --- maven-remote-resources-plugin:1.5:process (default) @ tobago-tool-apt ---
[INFO]
[INFO] --- maven-resources-plugin:2.7:resources (default-resources) @ tobago-tool-apt ---
[INFO] Using 'UTF-8' encoding to copy filtered resources.
[INFO] Copying 1 resource
[INFO] Copying 3 resources
[INFO]
[INFO] --- maven-compiler-plugin:3.6.2:compile (default-compile) @ tobago-tool-apt ---
[INFO] Compiling 15 source files to <https://builds.apache.org/job/Tobago%20Trunk/ws/tobago-tool/tobago-tool-apt/target/classes>
[INFO] <https://builds.apache.org/job/Tobago%20Trunk/ws/tobago-tool/tobago-tool-apt/src/main/java/org/apache/myfaces/tobago/apt/processor/TaglibGenerator.java>: Some input files use or override a deprecated API.
[INFO] <https://builds.apache.org/job/Tobago%20Trunk/ws/tobago-tool/tobago-tool-apt/src/main/java/org/apache/myfaces/tobago/apt/processor/TaglibGenerator.java>: Recompile with -Xlint:deprecation for details.
[INFO]
[INFO] --- maven-resources-plugin:2.7:testResources (default-testResources) @ tobago-tool-apt ---
[INFO] Using 'UTF-8' encoding to copy filtered resources.
[INFO] skip non existing resourceDirectory <https://builds.apache.org/job/Tobago%20Trunk/ws/tobago-tool/tobago-tool-apt/src/test/resources>
[INFO] Copying 3 resources
[INFO]
[INFO] --- maven-compiler-plugin:3.6.2:testCompile (default-testCompile) @ tobago-tool-apt ---
[INFO] Compiling 1 source file to <https://builds.apache.org/job/Tobago%20Trunk/ws/tobago-tool/tobago-tool-apt/target/test-classes>
[INFO]
[INFO] --- maven-surefire-plugin:2.19.1:test (default-test) @ tobago-tool-apt ---
-------------------------------------------------------
T E S T S
-------------------------------------------------------
Running org.apache.myfaces.tobago.apt.processor.CheckstyleConfigGeneratorUnitTest
Tests run: 1, Failures: 0, Errors: 0, Skipped: 0, Time elapsed: 0.048 sec - in org.apache.myfaces.tobago.apt.processor.CheckstyleConfigGeneratorUnitTest
Results :
Tests run: 1, Failures: 0, Errors: 0, Skipped: 0
[JENKINS] Recording test results
[INFO]
[INFO] --- maven-jar-plugin:3.0.2:jar (default-jar) @ tobago-tool-apt ---
[INFO] Building jar: <https://builds.apache.org/job/Tobago%20Trunk/ws/tobago-tool/tobago-tool-apt/target/tobago-tool-apt-4.0.0-SNAPSHOT.jar>
[INFO]
[INFO] --- maven-site-plugin:3.6:attach-descriptor (attach-descriptor) @ tobago-tool-apt ---
[INFO] Skipping because packaging 'jar' is not pom.
[INFO]
[INFO] --- maven-install-plugin:2.5.2:install (default-install) @ tobago-tool-apt ---
[INFO] Installing <https://builds.apache.org/job/Tobago%20Trunk/ws/tobago-tool/tobago-tool-apt/target/tobago-tool-apt-4.0.0-SNAPSHOT.jar> to /home/jenkins/jenkins-slave/maven-repositories/1/org/apache/myfaces/tobago/tobago-tool-apt/4.0.0-SNAPSHOT/tobago-tool-apt-4.0.0-SNAPSHOT.jar
[INFO] Installing <https://builds.apache.org/job/Tobago%20Trunk/ws/tobago-tool/tobago-tool-apt/pom.xml> to /home/jenkins/jenkins-slave/maven-repositories/1/org/apache/myfaces/tobago/tobago-tool-apt/4.0.0-SNAPSHOT/tobago-tool-apt-4.0.0-SNAPSHOT.pom
[INFO]
[INFO] ------------------------------------------------------------------------
[INFO] Building Tobago Core 4.0.0-SNAPSHOT
[INFO] ------------------------------------------------------------------------
[INFO]
[INFO] --- maven-clean-plugin:2.6.1:clean (default-clean) @ tobago-core ---
[INFO] Deleting <https://builds.apache.org/job/Tobago%20Trunk/ws/tobago-core/target>
[INFO]
[INFO] --- animal-sniffer-maven-plugin:1.14:check (default-cli) @ tobago-core ---
[INFO] Checking unresolved references to org.codehaus.mojo.signature:java16:1.1
[INFO]
[INFO] --- maven-checkstyle-plugin:2.17:check (default-cli) @ tobago-core ---
[INFO] Starting audit...
<https://builds.apache.org/job/Tobago%20Trunk/ws/tobago-core/src/main/java/org/apache/myfaces/tobago/servlet/ResourceServlet.java>:142:29: error: ';' is not followed by whitespace.
<https://builds.apache.org/job/Tobago%20Trunk/ws/tobago-core/src/main/java/org/apache/myfaces/tobago/sanitizer/JsoupSanitizer.java>:76: error: Line is longer than 120 characters (found 122).
Audit done.
[INFO] There are 2 errors reported by Checkstyle 6.11.2 with tobago/checkstyle.xml ruleset.
[ERROR] src/main/java/org/apache/myfaces/tobago/servlet/ResourceServlet.java:[142,29] (whitespace) WhitespaceAfter: ';' is not followed by whitespace.
[ERROR] src/main/java/org/apache/myfaces/tobago/sanitizer/JsoupSanitizer.java:[76] (sizes) LineLength: Line is longer than 120 characters (found 122).
[INFO] ------------------------------------------------------------------------
[INFO] Reactor Summary:
[INFO]
[INFO] Apache Tobago ...................................... SUCCESS [ 7.386 s]
[INFO] Tobago Tool ........................................ SUCCESS [ 2.762 s]
[INFO] Tobago Tool Annotation ............................. SUCCESS [ 6.133 s]
[INFO] Tobago Tool Apt .................................... SUCCESS [01:00 min]
[INFO] Tobago Core ........................................ FAILURE [ 4.742 s]
[INFO] Tobago Themes ...................................... SKIPPED
[INFO] Tobago Theme Standard .............................. SKIPPED
[INFO] Tobago Theme Scarborough ........................... SKIPPED
[INFO] Tobago Theme Speyside .............................. SKIPPED
[INFO] Tobago Theme Roxborough ............................ SKIPPED
[INFO] Tobago Examples .................................... SKIPPED
[INFO] Tobago Example Blank ............................... SKIPPED
[INFO] Tobago Example Data ................................ SKIPPED
[INFO] Tobago Example Demo ................................ SKIPPED
[INFO] Tobago Example Assembly ............................ SKIPPED
[INFO] Tobago Assembly .................................... SKIPPED
[INFO] ------------------------------------------------------------------------
[INFO] BUILD FAILURE
[INFO] ------------------------------------------------------------------------
[INFO] Total time: 01:44 min
[INFO] Finished at: 2017-11-30T14:29:06Z
[INFO] Final Memory: 46M/777M
[INFO] ------------------------------------------------------------------------
[ERROR] Failed to execute goal org.apache.maven.plugins:maven-checkstyle-plugin:2.17:check (default-cli) on project tobago-core: You have 2 Checkstyle violations. -> [Help 1]
[ERROR]
[ERROR] To see the full stack trace of the errors, re-run Maven with the -e switch.
[ERROR] Re-run Maven using the -X switch to enable full debug logging.
[ERROR]
[ERROR] For more information about the errors and possible solutions, please read the following articles:
[ERROR] [Help 1] http://cwiki.apache.org/confluence/display/MAVEN/MojoFailureException
[ERROR]
[ERROR] After correcting the problems, you can resume the build with the command
[ERROR] mvn <goals> -rf :tobago-core
[JENKINS] Archiving <https://builds.apache.org/job/Tobago%20Trunk/ws/tobago-theme/pom.xml> to org.apache.myfaces.tobago/tobago-theme/4.0.0-SNAPSHOT/tobago-theme-4.0.0-SNAPSHOT.pom
[JENKINS] Archiving <https://builds.apache.org/job/Tobago%20Trunk/ws/tobago-example/tobago-example-blank/pom.xml> to org.apache.myfaces.tobago/tobago-example-blank/4.0.0-SNAPSHOT/tobago-example-blank-4.0.0-SNAPSHOT.pom
[JENKINS] Archiving <https://builds.apache.org/job/Tobago%20Trunk/ws/tobago-assembly/pom.xml> to org.apache.myfaces.tobago/tobago-assembly/4.0.0-SNAPSHOT/tobago-assembly-4.0.0-SNAPSHOT.pom
[JENKINS] Archiving <https://builds.apache.org/job/Tobago%20Trunk/ws/pom.xml> to org.apache.myfaces.tobago/tobago/4.0.0-SNAPSHOT/tobago-4.0.0-SNAPSHOT.pom
[JENKINS] Archiving <https://builds.apache.org/job/Tobago%20Trunk/ws/target/tobago-4.0.0-SNAPSHOT-site.xml> to org.apache.myfaces.tobago/tobago/4.0.0-SNAPSHOT/tobago-4.0.0-SNAPSHOT-site.xml
[Fast Archiver] No artifacts from Tobago Trunk » Apache Tobago #1176 to compare, so performing full copy of artifacts
[JENKINS] Archiving <https://builds.apache.org/job/Tobago%20Trunk/ws/tobago-theme/tobago-theme-standard/pom.xml> to org.apache.myfaces.tobago/tobago-theme-standard/4.0.0-SNAPSHOT/tobago-theme-standard-4.0.0-SNAPSHOT.pom
[JENKINS] Archiving <https://builds.apache.org/job/Tobago%20Trunk/ws/tobago-theme/tobago-theme-scarborough/pom.xml> to org.apache.myfaces.tobago/tobago-theme-scarborough/4.0.0-SNAPSHOT/tobago-theme-scarborough-4.0.0-SNAPSHOT.pom
[JENKINS] Archiving <https://builds.apache.org/job/Tobago%20Trunk/ws/tobago-example/tobago-example-assembly/pom.xml> to org.apache.myfaces.tobago/tobago-example-assembly/4.0.0-SNAPSHOT/tobago-example-assembly-4.0.0-SNAPSHOT.pom
[JENKINS] Archiving <https://builds.apache.org/job/Tobago%20Trunk/ws/tobago-theme/tobago-theme-speyside/pom.xml> to org.apache.myfaces.tobago/tobago-theme-speyside/4.0.0-SNAPSHOT/tobago-theme-speyside-4.0.0-SNAPSHOT.pom
[JENKINS] Archiving <https://builds.apache.org/job/Tobago%20Trunk/ws/tobago-theme/tobago-theme-roxborough/pom.xml> to org.apache.myfaces.tobago/tobago-theme-roxborough/4.0.0-SNAPSHOT/tobago-theme-roxborough-4.0.0-SNAPSHOT.pom
[JENKINS] Archiving <https://builds.apache.org/job/Tobago%20Trunk/ws/tobago-tool/tobago-tool-annotation/pom.xml> to org.apache.myfaces.tobago/tobago-tool-annotation/4.0.0-SNAPSHOT/tobago-tool-annotation-4.0.0-SNAPSHOT.pom
[JENKINS] Archiving <https://builds.apache.org/job/Tobago%20Trunk/ws/tobago-tool/tobago-tool-annotation/target/tobago-tool-annotation-4.0.0-SNAPSHOT.jar> to org.apache.myfaces.tobago/tobago-tool-annotation/4.0.0-SNAPSHOT/tobago-tool-annotation-4.0.0-SNAPSHOT.jar
[Fast Archiver] No artifacts from Tobago Trunk » Tobago Tool Annotation #1176 to compare, so performing full copy of artifacts
[JENKINS] Archiving <https://builds.apache.org/job/Tobago%20Trunk/ws/tobago-example/pom.xml> to org.apache.myfaces.tobago/tobago-example/4.0.0-SNAPSHOT/tobago-example-4.0.0-SNAPSHOT.pom
[JENKINS] Archiving <https://builds.apache.org/job/Tobago%20Trunk/ws/tobago-example/tobago-example-data/pom.xml> to org.apache.myfaces.tobago/tobago-example-data/4.0.0-SNAPSHOT/tobago-example-data-4.0.0-SNAPSHOT.pom
[JENKINS] Archiving <https://builds.apache.org/job/Tobago%20Trunk/ws/tobago-tool/pom.xml> to org.apache.myfaces.tobago/tobago-tool/4.0.0-SNAPSHOT/tobago-tool-4.0.0-SNAPSHOT.pom
[Fast Archiver] No artifacts from Tobago Trunk » Tobago Tool #1176 to compare, so performing full copy of artifacts
[JENKINS] Archiving <https://builds.apache.org/job/Tobago%20Trunk/ws/tobago-core/pom.xml> to org.apache.myfaces.tobago/tobago-core/4.0.0-SNAPSHOT/tobago-core-4.0.0-SNAPSHOT.pom
[JENKINS] Archiving <https://builds.apache.org/job/Tobago%20Trunk/ws/tobago-tool/tobago-tool-apt/pom.xml> to org.apache.myfaces.tobago/tobago-tool-apt/4.0.0-SNAPSHOT/tobago-tool-apt-4.0.0-SNAPSHOT.pom
[JENKINS] Archiving <https://builds.apache.org/job/Tobago%20Trunk/ws/tobago-tool/tobago-tool-apt/target/tobago-tool-apt-4.0.0-SNAPSHOT.jar> to org.apache.myfaces.tobago/tobago-tool-apt/4.0.0-SNAPSHOT/tobago-tool-apt-4.0.0-SNAPSHOT.jar
[JENKINS] Archiving <https://builds.apache.org/job/Tobago%20Trunk/ws/tobago-example/tobago-example-demo/pom.xml> to org.apache.myfaces.tobago/tobago-example-demo/4.0.0-SNAPSHOT/tobago-example-demo-4.0.0-SNAPSHOT.pom
Sending e-mails to: commits@myfaces.apache.org
Sending e-mails to: commits@myfaces.apache.org
channel stopped
[JIRA] Updating issue TOBAGO-1782