You are viewing a plain text version of this content. The canonical link for it is here.
Posted to issues@tez.apache.org by Apache Jenkins Server <je...@builds.apache.org> on 2015/08/06 06:02:01 UTC

Failed: TEZ-2663 PreCommit Build #966

Jira: https://issues.apache.org/jira/browse/TEZ-2663
Build: https://builds.apache.org/job/PreCommit-TEZ-Build/966/

###################################################################################
########################## LAST 60 LINES OF THE CONSOLE ###########################
[...truncated 2837 lines...]




{color:red}-1 overall{color}.  Here are the results of testing the latest attachment
  http://issues.apache.org/jira/secure/attachment/12748989/TEZ-2663.2.patch
  against master revision edddea8.

    {color:green}+1 @author{color}.  The patch does not contain any @author tags.

    {color:green}+1 tests included{color}.  The patch appears to include 2 new or modified test files.

    {color:green}+1 javac{color}.  The applied patch does not increase the total number of javac compiler warnings.

    {color:green}+1 javadoc{color}.  There were no new javadoc warning messages.

    {color:green}+1 findbugs{color}.  The patch does not introduce any new Findbugs (version 3.0.1) warnings.

    {color:green}+1 release audit{color}.  The applied patch does not increase the total number of release audit warnings.

    {color:red}-1 core tests{color}.  The patch failed these unit tests in :
                   org.apache.tez.test.TestFaultTolerance

Test results: https://builds.apache.org/job/PreCommit-TEZ-Build/966//testReport/
Console output: https://builds.apache.org/job/PreCommit-TEZ-Build/966//console

This message is automatically generated.


======================================================================
======================================================================
    Adding comment to Jira.
======================================================================
======================================================================


Comment added.
6c6bf099af837b5faeb7132cba06bf0f17f77748 logged out


======================================================================
======================================================================
    Finished build.
======================================================================
======================================================================


Build step 'Execute shell' marked build as failure
Archiving artifacts
Sending artifact delta relative to PreCommit-TEZ-Build #965
Archived 50 artifacts
Archive block size is 32768
Received 6 blocks and 2834627 bytes
Compression is 6.5%
Took 0.77 sec
[description-setter] Could not determine description.
Recording test results
Email was triggered for: Failure
Sending email for trigger: Failure



###################################################################################
############################## FAILED TESTS (if any) ##############################
2 tests failed.
REGRESSION:  org.apache.tez.test.TestFaultTolerance.testRandomFailingTasks

Error Message:
expected:<SUCCEEDED> but was:<FAILED>

Stack Trace:
java.lang.AssertionError: expected:<SUCCEEDED> but was:<FAILED>
	at org.junit.Assert.fail(Assert.java:88)
	at org.junit.Assert.failNotEquals(Assert.java:743)
	at org.junit.Assert.assertEquals(Assert.java:118)
	at org.junit.Assert.assertEquals(Assert.java:144)
	at org.apache.tez.test.TestFaultTolerance.runDAGAndVerify(TestFaultTolerance.java:135)
	at org.apache.tez.test.TestFaultTolerance.runDAGAndVerify(TestFaultTolerance.java:114)
	at org.apache.tez.test.TestFaultTolerance.testRandomFailingTasks(TestFaultTolerance.java:723)


REGRESSION:  org.apache.tez.test.TestFaultTolerance.testRandomFailingInputs

Error Message:
expected:<SUCCEEDED> but was:<FAILED>

Stack Trace:
java.lang.AssertionError: expected:<SUCCEEDED> but was:<FAILED>
	at org.junit.Assert.fail(Assert.java:88)
	at org.junit.Assert.failNotEquals(Assert.java:743)
	at org.junit.Assert.assertEquals(Assert.java:118)
	at org.junit.Assert.assertEquals(Assert.java:144)
	at org.apache.tez.test.TestFaultTolerance.runDAGAndVerify(TestFaultTolerance.java:135)
	at org.apache.tez.test.TestFaultTolerance.runDAGAndVerify(TestFaultTolerance.java:114)
	at org.apache.tez.test.TestFaultTolerance.testRandomFailingInputs(TestFaultTolerance.java:732)



Success: TEZ-2618 PreCommit Build #973

Posted by Apache Jenkins Server <je...@builds.apache.org>.
Jira: https://issues.apache.org/jira/browse/TEZ-2618
Build: https://builds.apache.org/job/PreCommit-TEZ-Build/973/

###################################################################################
########################## LAST 60 LINES OF THE CONSOLE ###########################
[...truncated 3198 lines...]
[INFO] Final Memory: 86M/1465M
[INFO] ------------------------------------------------------------------------




{color:green}+1 overall{color}.  Here are the results of testing the latest attachment
  http://issues.apache.org/jira/secure/attachment/12749643/TEZ-2618.1.patch
  against master revision eadbfec.

    {color:green}+1 @author{color}.  The patch does not contain any @author tags.

    {color:green}+1 tests included{color}.  The patch appears to include 1 new or modified test files.

    {color:green}+1 javac{color}.  The applied patch does not increase the total number of javac compiler warnings.

    {color:green}+1 javadoc{color}.  There were no new javadoc warning messages.

    {color:green}+1 findbugs{color}.  The patch does not introduce any new Findbugs (version 3.0.1) warnings.

    {color:green}+1 release audit{color}.  The applied patch does not increase the total number of release audit warnings.

    {color:green}+1 core tests{color}.  The patch passed unit tests in .

Test results: https://builds.apache.org/job/PreCommit-TEZ-Build/973//testReport/
Console output: https://builds.apache.org/job/PreCommit-TEZ-Build/973//console

This message is automatically generated.


======================================================================
======================================================================
    Adding comment to Jira.
======================================================================
======================================================================


Comment added.
de8404d740241e1a641049c7a51412a893e2b675 logged out


======================================================================
======================================================================
    Finished build.
======================================================================
======================================================================


Archiving artifacts
Sending artifact delta relative to PreCommit-TEZ-Build #965
Archived 50 artifacts
Archive block size is 32768
Received 4 blocks and 2946162 bytes
Compression is 4.3%
Took 0.67 sec
Description set: TEZ-2618
Recording test results
Email was triggered for: Success
Sending email for trigger: Success



###################################################################################
############################## FAILED TESTS (if any) ##############################
All tests passed

Failed: TEZ-2658 PreCommit Build #972

Posted by Apache Jenkins Server <je...@builds.apache.org>.
Jira: https://issues.apache.org/jira/browse/TEZ-2658
Build: https://builds.apache.org/job/PreCommit-TEZ-Build/972/

###################################################################################
########################## LAST 60 LINES OF THE CONSOLE ###########################
[...truncated 41 lines...]
Checking patch tez-api/src/main/java/org/apache/tez/client/TezYarnClient.java...
Checking patch tez-api/src/main/java/org/apache/tez/dag/api/client/rpc/DAGClientRPCImpl.java...
Checking patch tez-cli-tools/README.txt...
error: tez-cli-tools/README.txt: No such file or directory
Checking patch tez-cli-tools/findbugs-exclude.xml...
error: tez-cli-tools/findbugs-exclude.xml: No such file or directory
Checking patch tez-cli-tools/pom.xml...
error: tez-cli-tools/pom.xml: No such file or directory
Checking patch tez-cli-tools/src/main/java/org/apache/tez/clitools/DagStatsClient.java...
error: tez-cli-tools/src/main/java/org/apache/tez/clitools/DagStatsClient.java: No such file or directory
Checking patch tez-cli-tools/src/main/java/org/apache/tez/clitools/ExampleDriver.java...
error: tez-cli-tools/src/main/java/org/apache/tez/clitools/ExampleDriver.java: No such file or directory
Checking patch tez-cli-tools/src/test/java/TestDagStatsClient.java...
error: tez-cli-tools/src/test/java/TestDagStatsClient.java: No such file or directory
Checking patch tez-cli-tools/tez.sh...
error: tez-cli-tools/tez.sh: No such file or directory
Checking patch tez-dag/src/main/java/org/apache/tez/client/LocalClient.java...
Checking patch tez-dag/src/main/java/org/apache/tez/dag/api/client/DAGClientHandler.java...
Checking patch tez-dag/src/main/java/org/apache/tez/dag/api/client/rpc/DAGClientAMProtocolBlockingPBServerImpl.java...
PATCH APPLICATION FAILED




{color:red}-1 overall{color}.  Here are the results of testing the latest attachment
  http://issues.apache.org/jira/secure/attachment/12749617/TEZ-2658.2.patch
  against master revision eadbfec.

    {color:red}-1 patch{color}.  The patch command could not apply the patch.

Console output: https://builds.apache.org/job/PreCommit-TEZ-Build/972//console

This message is automatically generated.


======================================================================
======================================================================
    Adding comment to Jira.
======================================================================
======================================================================


Comment added.
d78fc9f7a8b722c275a04ef4cdcc2859d03a92cb logged out


======================================================================
======================================================================
    Finished build.
======================================================================
======================================================================


Build step 'Execute shell' marked build as failure
Archiving artifacts
[description-setter] Could not determine description.
Recording test results
Email was triggered for: Failure
Sending email for trigger: Failure



###################################################################################
############################## FAILED TESTS (if any) ##############################
No tests ran.

Failed: TEZ-2658 PreCommit Build #971

Posted by Apache Jenkins Server <je...@builds.apache.org>.
Jira: https://issues.apache.org/jira/browse/TEZ-2658
Build: https://builds.apache.org/job/PreCommit-TEZ-Build/971/

###################################################################################
########################## LAST 60 LINES OF THE CONSOLE ###########################
[...truncated 3326 lines...]




{color:red}-1 overall{color}.  Here are the results of testing the latest attachment
  http://issues.apache.org/jira/secure/attachment/12749141/TEZ-2658.1.patch
  against master revision eadbfec.

    {color:green}+1 @author{color}.  The patch does not contain any @author tags.

    {color:green}+1 tests included{color}.  The patch appears to include 1 new or modified test files.

    {color:green}+1 javac{color}.  The applied patch does not increase the total number of javac compiler warnings.

    {color:green}+1 javadoc{color}.  There were no new javadoc warning messages.

    {color:red}-1 findbugs{color}.  The patch appears to cause Findbugs (version 3.0.1) to fail.

        {color:red}-1 release audit{color}.  The applied patch generated 3 release audit warnings.

    {color:green}+1 core tests{color}.  The patch passed unit tests in .

Test results: https://builds.apache.org/job/PreCommit-TEZ-Build/971//testReport/
Release audit warnings: https://builds.apache.org/job/PreCommit-TEZ-Build/971//artifact/patchprocess/patchReleaseAuditProblems.txt
Console output: https://builds.apache.org/job/PreCommit-TEZ-Build/971//console

This message is automatically generated.


======================================================================
======================================================================
    Adding comment to Jira.
======================================================================
======================================================================


Comment added.
8ec67cf5e1552d2d82733fe3e63dd561f8e02d4f logged out


======================================================================
======================================================================
    Finished build.
======================================================================
======================================================================


Build step 'Execute shell' marked build as failure
Archiving artifacts
Sending artifact delta relative to PreCommit-TEZ-Build #965
Archived 12 artifacts
Archive block size is 32768
Received 0 blocks and 1816853 bytes
Compression is 0.0%
Took 0.61 sec
[description-setter] Could not determine description.
Recording test results
Email was triggered for: Failure
Sending email for trigger: Failure



###################################################################################
############################## FAILED TESTS (if any) ##############################
All tests passed

Failed: TEZ-2003 PreCommit Build #970

Posted by Apache Jenkins Server <je...@builds.apache.org>.
Jira: https://issues.apache.org/jira/browse/TEZ-2003
Build: https://builds.apache.org/job/PreCommit-TEZ-Build/970/

###################################################################################
########################## LAST 60 LINES OF THE CONSOLE ###########################
[...truncated 3536 lines...]



{color:red}-1 overall{color}.  Here are the results of testing the latest attachment
  http://issues.apache.org/jira/secure/attachment/12749362/2003_20150807.2.txt
  against master revision eadbfec.

    {color:green}+1 @author{color}.  The patch does not contain any @author tags.

    {color:green}+1 tests included{color}.  The patch appears to include 52 new or modified test files.

      {color:red}-1 javac{color}.  The applied patch generated 165 javac compiler warnings (more than the master's current 158 warnings).

    {color:red}-1 javadoc{color}.  The javadoc tool appears to have generated 3 warning messages.
        See https://builds.apache.org/job/PreCommit-TEZ-Build/970//artifact/patchprocess/diffJavadocWarnings.txt for details.

    {color:red}-1 findbugs{color}.  The patch appears to cause Findbugs (version 3.0.1) to fail.

    {color:green}+1 release audit{color}.  The applied patch does not increase the total number of release audit warnings.

    {color:green}+1 core tests{color}.  The patch passed unit tests in .

Test results: https://builds.apache.org/job/PreCommit-TEZ-Build/970//testReport/
Javac warnings: https://builds.apache.org/job/PreCommit-TEZ-Build/970//artifact/patchprocess/diffJavacWarnings.txt
Console output: https://builds.apache.org/job/PreCommit-TEZ-Build/970//console

This message is automatically generated.


======================================================================
======================================================================
    Adding comment to Jira.
======================================================================
======================================================================


Comment added.
b09736ab858213c011f80376828d9e8cc909dff0 logged out


======================================================================
======================================================================
    Finished build.
======================================================================
======================================================================


Build step 'Execute shell' marked build as failure
Archiving artifacts
Sending artifact delta relative to PreCommit-TEZ-Build #965
Archived 12 artifacts
Archive block size is 32768
Received 0 blocks and 2054698 bytes
Compression is 0.0%
Took 0.73 sec
[description-setter] Could not determine description.
Recording test results
Email was triggered for: Failure
Sending email for trigger: Failure



###################################################################################
############################## FAILED TESTS (if any) ##############################
All tests passed

Failed: TEZ-2003 PreCommit Build #969

Posted by Apache Jenkins Server <je...@builds.apache.org>.
Jira: https://issues.apache.org/jira/browse/TEZ-2003
Build: https://builds.apache.org/job/PreCommit-TEZ-Build/969/

###################################################################################
########################## LAST 60 LINES OF THE CONSOLE ###########################
[...truncated 269 lines...]


======================================================================
======================================================================
    Determining number of patched javac warnings.
======================================================================
======================================================================


/home/jenkins/tools/maven/latest/bin/mvn clean test -DskipTests -Ptest-patch > /home/jenkins/jenkins-slave/workspace/PreCommit-TEZ-Build/../patchprocess/patchJavacWarnings.txt 2>&1




{color:red}-1 overall{color}.  Here are the results of testing the latest attachment
  http://issues.apache.org/jira/secure/attachment/12749323/2003_20150807.1.txt
  against master revision eadbfec.

    {color:green}+1 @author{color}.  The patch does not contain any @author tags.

    {color:green}+1 tests included{color}.  The patch appears to include 52 new or modified test files.

    {color:red}-1 javac{color:red}.  The patch appears to cause the build to fail.

Console output: https://builds.apache.org/job/PreCommit-TEZ-Build/969//console

This message is automatically generated.


======================================================================
======================================================================
    Adding comment to Jira.
======================================================================
======================================================================


Comment added.
4fd4d156e435c5cbbd46aa737e45b01d48afa038 logged out


======================================================================
======================================================================
    Finished build.
======================================================================
======================================================================


Build step 'Execute shell' marked build as failure
Archiving artifacts
Sending artifact delta relative to PreCommit-TEZ-Build #965
Archived 3 artifacts
Archive block size is 32768
Received 0 blocks and 955359 bytes
Compression is 0.0%
Took 0.39 sec
[description-setter] Could not determine description.
Recording test results
Email was triggered for: Failure
Sending email for trigger: Failure



###################################################################################
############################## FAILED TESTS (if any) ##############################
No tests ran.

Failed: TEZ-2658 PreCommit Build #968

Posted by Apache Jenkins Server <je...@builds.apache.org>.
Jira: https://issues.apache.org/jira/browse/TEZ-2658
Build: https://builds.apache.org/job/PreCommit-TEZ-Build/968/

###################################################################################
########################## LAST 60 LINES OF THE CONSOLE ###########################
[...truncated 2967 lines...]

{color:red}-1 overall{color}.  Here are the results of testing the latest attachment
  http://issues.apache.org/jira/secure/attachment/12749141/TEZ-2658.1.patch
  against master revision eadbfec.

    {color:green}+1 @author{color}.  The patch does not contain any @author tags.

    {color:green}+1 tests included{color}.  The patch appears to include 1 new or modified test files.

    {color:green}+1 javac{color}.  The applied patch does not increase the total number of javac compiler warnings.

    {color:green}+1 javadoc{color}.  There were no new javadoc warning messages.

    {color:red}-1 findbugs{color}.  The patch appears to cause Findbugs (version 3.0.1) to fail.

        {color:red}-1 release audit{color}.  The applied patch generated 3 release audit warnings.

    {color:red}-1 core tests{color}.  The patch failed these unit tests in :
                   org.apache.tez.test.TestFaultTolerance

Test results: https://builds.apache.org/job/PreCommit-TEZ-Build/968//testReport/
Release audit warnings: https://builds.apache.org/job/PreCommit-TEZ-Build/968//artifact/patchprocess/patchReleaseAuditProblems.txt
Console output: https://builds.apache.org/job/PreCommit-TEZ-Build/968//console

This message is automatically generated.


======================================================================
======================================================================
    Adding comment to Jira.
======================================================================
======================================================================


Unable to log in to server: https://issues.apache.org/jira/rpc/soap/jirasoapservice-v2 with user: tezqa.
 Cause: (503)Service Unavailable
Unable to log in to server: https://issues.apache.org/jira/rpc/soap/jirasoapservice-v2 with user: tezqa.
 Cause: (503)Service Unavailable


======================================================================
======================================================================
    Finished build.
======================================================================
======================================================================


Build step 'Execute shell' marked build as failure
Archiving artifacts
Sending artifact delta relative to PreCommit-TEZ-Build #965
Archived 12 artifacts
Archive block size is 32768
Received 0 blocks and 1790114 bytes
Compression is 0.0%
Took 0.58 sec
[description-setter] Could not determine description.
Recording test results
Email was triggered for: Failure
Sending email for trigger: Failure



###################################################################################
############################## FAILED TESTS (if any) ##############################
3 tests failed.
REGRESSION:  org.apache.tez.test.TestFaultTolerance.testRandomFailingTasks

Error Message:
expected:<SUCCEEDED> but was:<FAILED>

Stack Trace:
java.lang.AssertionError: expected:<SUCCEEDED> but was:<FAILED>
	at org.junit.Assert.fail(Assert.java:88)
	at org.junit.Assert.failNotEquals(Assert.java:743)
	at org.junit.Assert.assertEquals(Assert.java:118)
	at org.junit.Assert.assertEquals(Assert.java:144)
	at org.apache.tez.test.TestFaultTolerance.runDAGAndVerify(TestFaultTolerance.java:135)
	at org.apache.tez.test.TestFaultTolerance.runDAGAndVerify(TestFaultTolerance.java:114)
	at org.apache.tez.test.TestFaultTolerance.testRandomFailingTasks(TestFaultTolerance.java:723)


REGRESSION:  org.apache.tez.test.TestFaultTolerance.testSixLevelsFailingDAGSuccess

Error Message:
expected:<SUCCEEDED> but was:<FAILED>

Stack Trace:
java.lang.AssertionError: expected:<SUCCEEDED> but was:<FAILED>
	at org.junit.Assert.fail(Assert.java:88)
	at org.junit.Assert.failNotEquals(Assert.java:743)
	at org.junit.Assert.assertEquals(Assert.java:118)
	at org.junit.Assert.assertEquals(Assert.java:144)
	at org.apache.tez.test.TestFaultTolerance.runDAGAndVerify(TestFaultTolerance.java:135)
	at org.apache.tez.test.TestFaultTolerance.runDAGAndVerify(TestFaultTolerance.java:114)
	at org.apache.tez.test.TestFaultTolerance.testSixLevelsFailingDAGSuccess(TestFaultTolerance.java:347)


REGRESSION:  org.apache.tez.test.TestFaultTolerance.testRandomFailingInputs

Error Message:
expected:<SUCCEEDED> but was:<FAILED>

Stack Trace:
java.lang.AssertionError: expected:<SUCCEEDED> but was:<FAILED>
	at org.junit.Assert.fail(Assert.java:88)
	at org.junit.Assert.failNotEquals(Assert.java:743)
	at org.junit.Assert.assertEquals(Assert.java:118)
	at org.junit.Assert.assertEquals(Assert.java:144)
	at org.apache.tez.test.TestFaultTolerance.runDAGAndVerify(TestFaultTolerance.java:135)
	at org.apache.tez.test.TestFaultTolerance.runDAGAndVerify(TestFaultTolerance.java:114)
	at org.apache.tez.test.TestFaultTolerance.testRandomFailingInputs(TestFaultTolerance.java:732)



Failed: TEZ-2699 PreCommit Build #967

Posted by Apache Jenkins Server <je...@builds.apache.org>.
Jira: https://issues.apache.org/jira/browse/TEZ-2699
Build: https://builds.apache.org/job/PreCommit-TEZ-Build/967/

###################################################################################
########################## LAST 60 LINES OF THE CONSOLE ###########################
[...truncated 3207 lines...]



{color:red}-1 overall{color}.  Here are the results of testing the latest attachment
  http://issues.apache.org/jira/secure/attachment/12749112/TEZ-2699.1.patch
  against master revision 28cd991.

    {color:green}+1 @author{color}.  The patch does not contain any @author tags.

    {color:red}-1 tests included{color}.  The patch doesn't appear to include any new or modified tests.
                        Please justify why no new tests are needed for this patch.
                        Also please list what manual steps were performed to verify this patch.

    {color:green}+1 javac{color}.  The applied patch does not increase the total number of javac compiler warnings.

    {color:green}+1 javadoc{color}.  There were no new javadoc warning messages.

    {color:green}+1 findbugs{color}.  The patch does not introduce any new Findbugs (version 3.0.1) warnings.

    {color:green}+1 release audit{color}.  The applied patch does not increase the total number of release audit warnings.

    {color:green}+1 core tests{color}.  The patch passed unit tests in .

Test results: https://builds.apache.org/job/PreCommit-TEZ-Build/967//testReport/
Console output: https://builds.apache.org/job/PreCommit-TEZ-Build/967//console

This message is automatically generated.


======================================================================
======================================================================
    Adding comment to Jira.
======================================================================
======================================================================


Comment added.
ecf84e90adba5e542be19dfd92aad2e4631f41b5 logged out


======================================================================
======================================================================
    Finished build.
======================================================================
======================================================================


Build step 'Execute shell' marked build as failure
Archiving artifacts
Sending artifact delta relative to PreCommit-TEZ-Build #965
Archived 50 artifacts
Archive block size is 32768
Received 6 blocks and 2888392 bytes
Compression is 6.4%
Took 0.85 sec
[description-setter] Could not determine description.
Recording test results
Email was triggered for: Failure
Sending email for trigger: Failure



###################################################################################
############################## FAILED TESTS (if any) ##############################
All tests passed