You are viewing a plain text version of this content. The canonical link for it is here.
Posted to commits@directory.apache.org by el...@apache.org on 2025/01/09 16:17:29 UTC
(directory-ldap-api) branch master updated: Removed the 'res' file that was wrongly included
This is an automated email from the ASF dual-hosted git repository.
elecharny pushed a commit to branch master
in repository https://gitbox.apache.org/repos/asf/directory-ldap-api.git
The following commit(s) were added to refs/heads/master by this push:
new 0e5e1dbc1 Removed the 'res' file that was wrongly included
0e5e1dbc1 is described below
commit 0e5e1dbc11b31be5a7a3f0e0086e9f5b17d81b2f
Author: emmanuel lecharny <el...@apache.org>
AuthorDate: Thu Jan 9 17:17:17 2025 +0100
Removed the 'res' file that was wrongly included
---
.../api/asn1/ber/tlv/LongDecoderException.java | 1 -
.../directory/api/ldap/entry/TestEntryUtils.java | 18 +-
ldap/model/res | 1276 --------------------
3 files changed, 10 insertions(+), 1285 deletions(-)
diff --git a/asn1/ber/src/main/java/org/apache/directory/api/asn1/ber/tlv/LongDecoderException.java b/asn1/ber/src/main/java/org/apache/directory/api/asn1/ber/tlv/LongDecoderException.java
index 2ff534fdb..f535eb9db 100644
--- a/asn1/ber/src/main/java/org/apache/directory/api/asn1/ber/tlv/LongDecoderException.java
+++ b/asn1/ber/src/main/java/org/apache/directory/api/asn1/ber/tlv/LongDecoderException.java
@@ -29,7 +29,6 @@ package org.apache.directory.api.asn1.ber.tlv;
*/
public class LongDecoderException extends Exception
{
-
/** Declares the Serial Version Uid */
private static final long serialVersionUID = 1L;
diff --git a/integ/src/test/java/org/apache/directory/api/ldap/entry/TestEntryUtils.java b/integ/src/test/java/org/apache/directory/api/ldap/entry/TestEntryUtils.java
index 04470c62c..f92226c42 100644
--- a/integ/src/test/java/org/apache/directory/api/ldap/entry/TestEntryUtils.java
+++ b/integ/src/test/java/org/apache/directory/api/ldap/entry/TestEntryUtils.java
@@ -46,6 +46,7 @@ public final class TestEntryUtils
*/
static class AT extends AttributeType
{
+ /** Declares the Serial Version Uid */
private static final long serialVersionUID = 0L;
@@ -68,7 +69,7 @@ public final class TestEntryUtils
*/
static class MR extends MatchingRule
{
- /** The mandatory serialVersionUID field */
+ /** Declares the Serial Version Uid */
public static final long serialVersionUID = 1L;
@@ -98,6 +99,7 @@ public final class TestEntryUtils
static class S extends LdapSyntax
{
+ /** Declares the Serial Version Uid */
private static final long serialVersionUID = 0L;
@@ -116,7 +118,7 @@ public final class TestEntryUtils
syntax.setSyntaxChecker( new SyntaxChecker( "1.1.2.1" )
{
- /** The mandatory serialVersionUID field */
+ /** Declares the Serial Version Uid */
public static final long serialVersionUID = 1L;
@@ -145,7 +147,7 @@ public final class TestEntryUtils
matchingRule.setLdapComparator( new LdapComparator<String>( matchingRule.getOid() )
{
- /** The mandatory serialVersionUID field */
+ /** Declares the Serial Version Uid */
public static final long serialVersionUID = 1L;
@@ -157,7 +159,7 @@ public final class TestEntryUtils
Normalizer normalizer = new Normalizer( "1.1.1" )
{
- /** The mandatory serialVersionUID field */
+ /** Declares the Serial Version Uid */
public static final long serialVersionUID = 1L;
@@ -190,7 +192,7 @@ public final class TestEntryUtils
syntax.setSyntaxChecker( new SyntaxChecker( "1.1.2" )
{
- /** The mandatory serialVersionUID field */
+ /** Declares the Serial Version Uid */
public static final long serialVersionUID = 1L;
@@ -207,7 +209,7 @@ public final class TestEntryUtils
matchingRule.setLdapComparator( new LdapComparator<String>( matchingRule.getOid() )
{
- /** The mandatory serialVersionUID field */
+ /** Declares the Serial Version Uid */
public static final long serialVersionUID = 1L;
@@ -233,7 +235,7 @@ public final class TestEntryUtils
syntax.setSyntaxChecker( new SyntaxChecker( "1.2.1" )
{
- /** The mandatory serialVersionUID field */
+ /** Declares the Serial Version Uid */
public static final long serialVersionUID = 1L;
@@ -250,7 +252,7 @@ public final class TestEntryUtils
matchingRule.setNormalizer( new Normalizer( "1.1.1" )
{
- /** The mandatory serialVersionUID field */
+ /** Declares the Serial Version Uid */
public static final long serialVersionUID = 1L;
diff --git a/ldap/model/res b/ldap/model/res
deleted file mode 100644
index 8c805d766..000000000
--- a/ldap/model/res
+++ /dev/null
@@ -1,1276 +0,0 @@
-Apache Maven 3.9.9 (8e8579a9e76f7d015ee5ec7bfcdc97d260186937)
-Maven home: /opt/apache-maven-3.9.9
-Java version: 21.0.4, vendor: Eclipse Adoptium, runtime: /Library/Java/JavaVirtualMachines/temurin-21.jdk/Contents/Home
-Default locale: en_US, platform encoding: UTF-8
-OS name: "mac os x", version: "14.4.1", arch: "aarch64", family: "mac"
-[DEBUG] Created new class realm maven.api
-[DEBUG] Importing foreign packages into class realm maven.api
-[DEBUG] Imported: javax.annotation.* < plexus.core
-[DEBUG] Imported: javax.annotation.security.* < plexus.core
-[DEBUG] Imported: javax.inject.* < plexus.core
-[DEBUG] Imported: org.apache.maven.* < plexus.core
-[DEBUG] Imported: org.apache.maven.artifact < plexus.core
-[DEBUG] Imported: org.apache.maven.classrealm < plexus.core
-[DEBUG] Imported: org.apache.maven.cli < plexus.core
-[DEBUG] Imported: org.apache.maven.configuration < plexus.core
-[DEBUG] Imported: org.apache.maven.exception < plexus.core
-[DEBUG] Imported: org.apache.maven.execution < plexus.core
-[DEBUG] Imported: org.apache.maven.execution.scope < plexus.core
-[DEBUG] Imported: org.apache.maven.graph < plexus.core
-[DEBUG] Imported: org.apache.maven.lifecycle < plexus.core
-[DEBUG] Imported: org.apache.maven.model < plexus.core
-[DEBUG] Imported: org.apache.maven.monitor < plexus.core
-[DEBUG] Imported: org.apache.maven.plugin < plexus.core
-[DEBUG] Imported: org.apache.maven.profiles < plexus.core
-[DEBUG] Imported: org.apache.maven.project < plexus.core
-[DEBUG] Imported: org.apache.maven.reporting < plexus.core
-[DEBUG] Imported: org.apache.maven.repository < plexus.core
-[DEBUG] Imported: org.apache.maven.rtinfo < plexus.core
-[DEBUG] Imported: org.apache.maven.settings < plexus.core
-[DEBUG] Imported: org.apache.maven.toolchain < plexus.core
-[DEBUG] Imported: org.apache.maven.usability < plexus.core
-[DEBUG] Imported: org.apache.maven.wagon.* < plexus.core
-[DEBUG] Imported: org.apache.maven.wagon.authentication < plexus.core
-[DEBUG] Imported: org.apache.maven.wagon.authorization < plexus.core
-[DEBUG] Imported: org.apache.maven.wagon.events < plexus.core
-[DEBUG] Imported: org.apache.maven.wagon.observers < plexus.core
-[DEBUG] Imported: org.apache.maven.wagon.proxy < plexus.core
-[DEBUG] Imported: org.apache.maven.wagon.repository < plexus.core
-[DEBUG] Imported: org.apache.maven.wagon.resource < plexus.core
-[DEBUG] Imported: org.codehaus.classworlds < plexus.core
-[DEBUG] Imported: org.codehaus.plexus.* < plexus.core
-[DEBUG] Imported: org.codehaus.plexus.classworlds < plexus.core
-[DEBUG] Imported: org.codehaus.plexus.component < plexus.core
-[DEBUG] Imported: org.codehaus.plexus.configuration < plexus.core
-[DEBUG] Imported: org.codehaus.plexus.container < plexus.core
-[DEBUG] Imported: org.codehaus.plexus.context < plexus.core
-[DEBUG] Imported: org.codehaus.plexus.lifecycle < plexus.core
-[DEBUG] Imported: org.codehaus.plexus.logging < plexus.core
-[DEBUG] Imported: org.codehaus.plexus.personality < plexus.core
-[DEBUG] Imported: org.codehaus.plexus.util.xml.Xpp3Dom < plexus.core
-[DEBUG] Imported: org.codehaus.plexus.util.xml.pull.XmlPullParser < plexus.core
-[DEBUG] Imported: org.codehaus.plexus.util.xml.pull.XmlPullParserException < plexus.core
-[DEBUG] Imported: org.codehaus.plexus.util.xml.pull.XmlSerializer < plexus.core
-[DEBUG] Imported: org.eclipse.aether.* < plexus.core
-[DEBUG] Imported: org.eclipse.aether.artifact < plexus.core
-[DEBUG] Imported: org.eclipse.aether.collection < plexus.core
-[DEBUG] Imported: org.eclipse.aether.deployment < plexus.core
-[DEBUG] Imported: org.eclipse.aether.graph < plexus.core
-[DEBUG] Imported: org.eclipse.aether.impl < plexus.core
-[DEBUG] Imported: org.eclipse.aether.installation < plexus.core
-[DEBUG] Imported: org.eclipse.aether.internal.impl < plexus.core
-[DEBUG] Imported: org.eclipse.aether.metadata < plexus.core
-[DEBUG] Imported: org.eclipse.aether.repository < plexus.core
-[DEBUG] Imported: org.eclipse.aether.resolution < plexus.core
-[DEBUG] Imported: org.eclipse.aether.spi < plexus.core
-[DEBUG] Imported: org.eclipse.aether.transfer < plexus.core
-[DEBUG] Imported: org.eclipse.aether.util < plexus.core
-[DEBUG] Imported: org.eclipse.aether.version < plexus.core
-[DEBUG] Imported: org.fusesource.jansi.* < plexus.core
-[DEBUG] Imported: org.slf4j.* < plexus.core
-[DEBUG] Imported: org.slf4j.event.* < plexus.core
-[DEBUG] Imported: org.slf4j.helpers.* < plexus.core
-[DEBUG] Imported: org.slf4j.spi.* < plexus.core
-[DEBUG] Populating class realm maven.api
-[DEBUG] Created adapter factory; available factories [file-lock, rwlock-local, semaphore-local, noop]; available name mappers [discriminating, file-gav, file-hgav, file-static, gav, static]
-[INFO] Error stacktraces are turned on.
-[DEBUG] Message scheme: color
-[DEBUG] Message styles: debug info warning error success failure strong mojo project
-[DEBUG] Reading global settings from /opt/apache-maven-3.9.9/conf/settings.xml
-[DEBUG] Reading user settings from /Users/elecharny/.m2/settings.xml
-[DEBUG] Reading global toolchains from /opt/apache-maven-3.9.9/conf/toolchains.xml
-[DEBUG] Reading user toolchains from /Users/elecharny/.m2/toolchains.xml
-[DEBUG] Using local repository at /Users/elecharny/.m2/repository
-[DEBUG] Using manager EnhancedLocalRepositoryManager with priority 10.0 for /Users/elecharny/.m2/repository
-[INFO] Scanning for projects...
-[DEBUG] Creating adapter using nameMapper 'gav' and factory 'rwlock-local'
-[DEBUG] Skipped remote request for org.apache.directory.project:project:50-SNAPSHOT/maven-metadata.xml, locally cached metadata up-to-date
-[DEBUG] Using mirror maven-default-http-blocker (http://0.0.0.0/) for apache.snapshots (http://repository.apache.org/snapshots).
-[DEBUG] Using mirror maven-default-http-blocker (http://0.0.0.0/) for apache.snapshots (http://people.apache.org/repo/m2-snapshot-repository).
-[DEBUG] Using mirror maven-default-http-blocker (http://0.0.0.0/) for codehaus.snapshots (http://snapshots.repository.codehaus.org).
-[DEBUG] Using mirror maven-default-http-blocker (http://0.0.0.0/) for repository.jboss.org (http://repository.jboss.org/maven2).
-[DEBUG] Using mirror maven-default-http-blocker (http://0.0.0.0/) for snapshots.jboss.org (http://snapshots.jboss.org/maven2).
-[DEBUG] Using mirror maven-default-http-blocker (http://0.0.0.0/) for oss.sonatype.org/jboss-snapshots (http://oss.sonatype.org/content/repositories/jboss-snapshots).
-[DEBUG] Using mirror maven-default-http-blocker (http://0.0.0.0/) for apache-snapshots (http://people.apache.org/maven-snapshot-repository).
-[DEBUG] Using mirror maven-default-http-blocker (http://0.0.0.0/) for codehaus-snapshots (http://snapshots.repository.codehaus.org).
-[DEBUG] Dependency collection stats {ConflictMarker.analyzeTime=312084, ConflictMarker.markTime=124458, ConflictMarker.nodeCount=157, ConflictIdSorter.graphTime=192750, ConflictIdSorter.topsortTime=96125, ConflictIdSorter.conflictIdCount=74, ConflictIdSorter.conflictIdCycleCount=0, ConflictResolver.totalTime=3146166, ConflictResolver.conflictItemCount=150, DfDependencyCollector.collectTime=115049416, DfDependencyCollector.transformTime=4491167}
-[DEBUG] org.apache.felix:maven-bundle-plugin:jar:5.1.9
-[DEBUG] org.osgi:org.osgi.core:jar:6.0.0:compile
-[DEBUG] biz.aQute.bnd:biz.aQute.bndlib:jar:6.3.1:compile
-[DEBUG] org.osgi:org.osgi.dto:jar:1.0.0:compile
-[DEBUG] org.osgi:org.osgi.resource:jar:1.0.0:compile
-[DEBUG] org.osgi:org.osgi.framework:jar:1.8.0:compile
-[DEBUG] org.osgi:org.osgi.util.tracker:jar:1.5.4:compile
-[DEBUG] org.osgi:osgi.annotation:jar:8.0.1:compile
-[DEBUG] org.osgi:org.osgi.service.log:jar:1.3.0:compile
-[DEBUG] org.osgi:org.osgi.service.repository:jar:1.1.0:compile
-[DEBUG] org.osgi:org.osgi.util.function:jar:1.2.0:compile
-[DEBUG] org.osgi:org.osgi.util.promise:jar:1.2.0:compile
-[DEBUG] biz.aQute.bnd:biz.aQute.bnd.util:jar:6.3.1:compile
-[DEBUG] org.slf4j:slf4j-api:jar:1.7.25:compile
-[DEBUG] org.apache.felix:org.apache.felix.bundlerepository:jar:1.6.6:compile
-[DEBUG] org.easymock:easymock:jar:2.4:compile
-[DEBUG] org.apache.felix:org.apache.felix.utils:jar:1.6.0:compile
-[DEBUG] org.osgi:org.osgi.compendium:jar:4.2.0:compile
-[DEBUG] org.apache.maven.reporting:maven-reporting-api:jar:3.0:compile
-[DEBUG] org.apache.maven:maven-archiver:jar:3.5.2:compile
-[DEBUG] org.apache.maven:maven-artifact:jar:3.1.1:compile
-[DEBUG] org.apache.maven:maven-model:jar:3.1.1:compile
-[DEBUG] org.apache.maven:maven-core:jar:3.1.1:compile
-[DEBUG] org.apache.maven:maven-settings:jar:3.1.1:compile
-[DEBUG] org.apache.maven:maven-settings-builder:jar:3.1.1:compile
-[DEBUG] org.apache.maven:maven-repository-metadata:jar:3.1.1:compile
-[DEBUG] org.apache.maven:maven-plugin-api:jar:3.1.1:compile
-[DEBUG] org.apache.maven:maven-model-builder:jar:3.1.1:compile
-[DEBUG] org.apache.maven:maven-aether-provider:jar:3.1.1:compile
-[DEBUG] org.eclipse.aether:aether-spi:jar:0.9.0.M2:compile
-[DEBUG] org.eclipse.aether:aether-impl:jar:0.9.0.M2:compile
-[DEBUG] org.eclipse.aether:aether-api:jar:0.9.0.M2:compile
-[DEBUG] org.eclipse.sisu:org.eclipse.sisu.plexus:jar:0.0.0.M5:compile
-[DEBUG] javax.enterprise:cdi-api:jar:1.0:compile
-[DEBUG] javax.annotation:jsr250-api:jar:1.0:compile
-[DEBUG] javax.inject:javax.inject:jar:1:compile
-[DEBUG] com.google.guava:guava:jar:10.0.1:compile
-[DEBUG] com.google.code.findbugs:jsr305:jar:1.3.9:compile
-[DEBUG] org.sonatype.sisu:sisu-guice:jar:no_aop:3.1.0:compile
-[DEBUG] aopalliance:aopalliance:jar:1.0:compile
-[DEBUG] org.eclipse.sisu:org.eclipse.sisu.inject:jar:0.0.0.M5:compile
-[DEBUG] org.codehaus.plexus:plexus-classworlds:jar:2.5.1:compile
-[DEBUG] org.sonatype.plexus:plexus-sec-dispatcher:jar:1.3:compile
-[DEBUG] org.sonatype.plexus:plexus-cipher:jar:1.4:compile
-[DEBUG] org.apache.maven.shared:maven-shared-utils:jar:3.3.3:compile
-[DEBUG] commons-io:commons-io:jar:2.6:compile
-[DEBUG] org.apache.commons:commons-compress:jar:1.20:compile
-[DEBUG] org.codehaus.plexus:plexus-archiver:jar:4.2.7:compile
-[DEBUG] org.codehaus.plexus:plexus-io:jar:3.2.0:compile
-[DEBUG] org.iq80.snappy:snappy:jar:0.4:compile
-[DEBUG] org.tukaani:xz:jar:1.9:runtime
-[DEBUG] org.codehaus.plexus:plexus-interpolation:jar:1.26:compile
-[DEBUG] org.apache.maven.shared:maven-dependency-tree:jar:3.0:compile
-[DEBUG] org.codehaus.plexus:plexus-component-annotations:jar:1.6:compile
-[DEBUG] org.eclipse.aether:aether-util:jar:0.9.0.M2:compile
-[DEBUG] org.codehaus.plexus:plexus-utils:jar:3.3.0:compile
-[DEBUG] org.sonatype.plexus:plexus-build-api:jar:0.0.7:compile
-[DEBUG] org.apache.maven.doxia:doxia-sink-api:jar:1.0:compile
-[DEBUG] org.apache.maven.doxia:doxia-site-renderer:jar:1.0:compile
-[DEBUG] org.apache.maven.doxia:doxia-core:jar:1.0:compile
-[DEBUG] org.codehaus.plexus:plexus-i18n:jar:1.0-beta-7:compile
-[DEBUG] org.codehaus.plexus:plexus-container-default:jar:1.0-alpha-30:compile
-[DEBUG] junit:junit:jar:3.8.1:compile
-[DEBUG] org.codehaus.plexus:plexus-velocity:jar:1.1.7:compile
-[DEBUG] org.apache.velocity:velocity:jar:1.5:compile
-[DEBUG] commons-lang:commons-lang:jar:2.1:compile
-[DEBUG] oro:oro:jar:2.0.8:compile
-[DEBUG] org.apache.maven.doxia:doxia-decoration-model:jar:1.0:compile
-[DEBUG] commons-collections:commons-collections:jar:3.2:compile
-[DEBUG] org.apache.maven.doxia:doxia-module-apt:jar:1.0:compile
-[DEBUG] org.apache.maven.doxia:doxia-module-fml:jar:1.0:compile
-[DEBUG] org.apache.maven.doxia:doxia-module-xdoc:jar:1.0:compile
-[DEBUG] org.apache.maven.doxia:doxia-module-xhtml:jar:1.0:compile
-[DEBUG] org.jdom:jdom:jar:1.1:compile
-[DEBUG] Created new class realm extension>org.apache.felix:maven-bundle-plugin:5.1.9
-[DEBUG] Importing foreign packages into class realm extension>org.apache.felix:maven-bundle-plugin:5.1.9
-[DEBUG] Imported: < maven.api
-[DEBUG] Populating class realm extension>org.apache.felix:maven-bundle-plugin:5.1.9
-[DEBUG] Included: org.apache.felix:maven-bundle-plugin:jar:5.1.9
-[DEBUG] Included: org.osgi:org.osgi.core:jar:6.0.0
-[DEBUG] Included: biz.aQute.bnd:biz.aQute.bndlib:jar:6.3.1
-[DEBUG] Included: org.osgi:org.osgi.dto:jar:1.0.0
-[DEBUG] Included: org.osgi:org.osgi.resource:jar:1.0.0
-[DEBUG] Included: org.osgi:org.osgi.framework:jar:1.8.0
-[DEBUG] Included: org.osgi:org.osgi.util.tracker:jar:1.5.4
-[DEBUG] Included: org.osgi:osgi.annotation:jar:8.0.1
-[DEBUG] Included: org.osgi:org.osgi.service.log:jar:1.3.0
-[DEBUG] Included: org.osgi:org.osgi.service.repository:jar:1.1.0
-[DEBUG] Included: org.osgi:org.osgi.util.function:jar:1.2.0
-[DEBUG] Included: org.osgi:org.osgi.util.promise:jar:1.2.0
-[DEBUG] Included: biz.aQute.bnd:biz.aQute.bnd.util:jar:6.3.1
-[DEBUG] Included: org.apache.felix:org.apache.felix.bundlerepository:jar:1.6.6
-[DEBUG] Included: org.easymock:easymock:jar:2.4
-[DEBUG] Included: org.apache.felix:org.apache.felix.utils:jar:1.6.0
-[DEBUG] Included: org.osgi:org.osgi.compendium:jar:4.2.0
-[DEBUG] Included: org.apache.maven.reporting:maven-reporting-api:jar:3.0
-[DEBUG] Included: org.apache.maven:maven-archiver:jar:3.5.2
-[DEBUG] Included: javax.enterprise:cdi-api:jar:1.0
-[DEBUG] Included: javax.annotation:jsr250-api:jar:1.0
-[DEBUG] Included: com.google.guava:guava:jar:10.0.1
-[DEBUG] Included: com.google.code.findbugs:jsr305:jar:1.3.9
-[DEBUG] Included: org.sonatype.sisu:sisu-guice:jar:no_aop:3.1.0
-[DEBUG] Included: aopalliance:aopalliance:jar:1.0
-[DEBUG] Included: org.eclipse.sisu:org.eclipse.sisu.inject:jar:0.0.0.M5
-[DEBUG] Included: org.sonatype.plexus:plexus-sec-dispatcher:jar:1.3
-[DEBUG] Included: org.sonatype.plexus:plexus-cipher:jar:1.4
-[DEBUG] Included: org.apache.maven.shared:maven-shared-utils:jar:3.3.3
-[DEBUG] Included: commons-io:commons-io:jar:2.6
-[DEBUG] Included: org.apache.commons:commons-compress:jar:1.20
-[DEBUG] Included: org.codehaus.plexus:plexus-archiver:jar:4.2.7
-[DEBUG] Included: org.codehaus.plexus:plexus-io:jar:3.2.0
-[DEBUG] Included: org.iq80.snappy:snappy:jar:0.4
-[DEBUG] Included: org.tukaani:xz:jar:1.9
-[DEBUG] Included: org.codehaus.plexus:plexus-interpolation:jar:1.26
-[DEBUG] Included: org.apache.maven.shared:maven-dependency-tree:jar:3.0
-[DEBUG] Included: org.codehaus.plexus:plexus-component-annotations:jar:1.6
-[DEBUG] Included: org.codehaus.plexus:plexus-utils:jar:3.3.0
-[DEBUG] Included: org.sonatype.plexus:plexus-build-api:jar:0.0.7
-[DEBUG] Included: org.apache.maven.doxia:doxia-sink-api:jar:1.0
-[DEBUG] Included: org.apache.maven.doxia:doxia-site-renderer:jar:1.0
-[DEBUG] Included: org.apache.maven.doxia:doxia-core:jar:1.0
-[DEBUG] Included: org.codehaus.plexus:plexus-i18n:jar:1.0-beta-7
-[DEBUG] Included: junit:junit:jar:3.8.1
-[DEBUG] Included: org.codehaus.plexus:plexus-velocity:jar:1.1.7
-[DEBUG] Included: org.apache.velocity:velocity:jar:1.5
-[DEBUG] Included: commons-lang:commons-lang:jar:2.1
-[DEBUG] Included: oro:oro:jar:2.0.8
-[DEBUG] Included: org.apache.maven.doxia:doxia-decoration-model:jar:1.0
-[DEBUG] Included: commons-collections:commons-collections:jar:3.2
-[DEBUG] Included: org.apache.maven.doxia:doxia-module-apt:jar:1.0
-[DEBUG] Included: org.apache.maven.doxia:doxia-module-fml:jar:1.0
-[DEBUG] Included: org.apache.maven.doxia:doxia-module-xdoc:jar:1.0
-[DEBUG] Included: org.apache.maven.doxia:doxia-module-xhtml:jar:1.0
-[DEBUG] Included: org.jdom:jdom:jar:1.1
-[DEBUG] Extension realms for project org.apache.directory.api:api-ldap-model:bundle:2.1.8-SNAPSHOT: [ClassRealm[extension>org.apache.felix:maven-bundle-plugin:5.1.9, parent: jdk.internal.loader.ClassLoaders$AppClassLoader@63c12fb0]]
-[DEBUG] Created new class realm project>org.apache.directory.api:api-ldap-model:2.1.8-SNAPSHOT
-[DEBUG] Populating class realm project>org.apache.directory.api:api-ldap-model:2.1.8-SNAPSHOT
-[DEBUG] Looking up lifecycle mappings for packaging bundle from ClassRealm[project>org.apache.directory.api:api-ldap-model:2.1.8-SNAPSHOT, parent: ClassRealm[maven.api, parent: null]]
-[DEBUG] Extension realms for project org.apache.directory.api:api-ldap-parent:pom:2.1.8-SNAPSHOT: [ClassRealm[extension>org.apache.felix:maven-bundle-plugin:5.1.9, parent: jdk.internal.loader.ClassLoaders$AppClassLoader@63c12fb0]]
-[DEBUG] Looking up lifecycle mappings for packaging pom from ClassRealm[project>org.apache.directory.api:api-ldap-model:2.1.8-SNAPSHOT, parent: ClassRealm[maven.api, parent: null]]
-[DEBUG] Extension realms for project org.apache.directory.api:api-parent:pom:2.1.8-SNAPSHOT: [ClassRealm[extension>org.apache.felix:maven-bundle-plugin:5.1.9, parent: jdk.internal.loader.ClassLoaders$AppClassLoader@63c12fb0]]
-[DEBUG] Looking up lifecycle mappings for packaging pom from ClassRealm[project>org.apache.directory.api:api-ldap-model:2.1.8-SNAPSHOT, parent: ClassRealm[maven.api, parent: null]]
-[DEBUG] Extension realms for project org.apache.directory.project:project:pom:50-SNAPSHOT: [ClassRealm[extension>org.apache.felix:maven-bundle-plugin:5.1.9, parent: jdk.internal.loader.ClassLoaders$AppClassLoader@63c12fb0]]
-[DEBUG] Looking up lifecycle mappings for packaging pom from ClassRealm[project>org.apache.directory.api:api-ldap-model:2.1.8-SNAPSHOT, parent: ClassRealm[maven.api, parent: null]]
-[DEBUG] Extension realms for project org.apache:apache:pom:33: (none)
-[DEBUG] Looking up lifecycle mappings for packaging pom from ClassRealm[plexus.core, parent: null]
-[DEBUG] Resolving plugin prefix javadoc from [org.apache.rat, org.apache.maven.plugins, org.codehaus.mojo]
-[DEBUG] Using mirror maven-default-http-blocker (http://0.0.0.0/) for codehaus.org (http://snapshots.repository.codehaus.org).
-[DEBUG] Using mirror maven-default-http-blocker (http://0.0.0.0/) for codehaus-snapshots (http://nexus.codehaus.org/snapshots/).
-[DEBUG] Resolved plugin prefix javadoc to org.apache.maven.plugins:maven-javadoc-plugin from POM org.apache.directory.api:api-ldap-model:bundle:2.1.8-SNAPSHOT
-[DEBUG] === REACTOR BUILD PLAN ================================================
-[DEBUG] Project: org.apache.directory.api:api-ldap-model:bundle:2.1.8-SNAPSHOT
-[DEBUG] Tasks: [javadoc:javadoc]
-[DEBUG] Style: Regular
-[DEBUG] =======================================================================
-[INFO]
-[INFO] --------------< org.apache.directory.api:api-ldap-model >---------------
-[INFO] Building Apache Directory LDAP API Model 2.1.8-SNAPSHOT
-[INFO] from pom.xml
-[INFO] -------------------------------[ bundle ]-------------------------------
-[DEBUG] Resolving plugin prefix javadoc from [org.apache.rat, org.apache.maven.plugins, org.codehaus.mojo]
-[DEBUG] Resolved plugin prefix javadoc to org.apache.maven.plugins:maven-javadoc-plugin from POM org.apache.directory.api:api-ldap-model:bundle:2.1.8-SNAPSHOT
-[DEBUG] Lifecycle clean -> [pre-clean, clean, post-clean]
-[DEBUG] Lifecycle default -> [validate, initialize, generate-sources, process-sources, generate-resources, process-resources, compile, process-classes, generate-test-sources, process-test-sources, generate-test-resources, process-test-resources, test-compile, process-test-classes, test, prepare-package, package, pre-integration-test, integration-test, post-integration-test, verify, install, deploy]
-[DEBUG] Lifecycle site -> [pre-site, site, post-site, site-deploy]
-[DEBUG] Lifecycle clean -> [pre-clean, clean, post-clean]
-[DEBUG] Lifecycle default -> [validate, initialize, generate-sources, process-sources, generate-resources, process-resources, compile, process-classes, generate-test-sources, process-test-sources, generate-test-resources, process-test-resources, test-compile, process-test-classes, test, prepare-package, package, pre-integration-test, integration-test, post-integration-test, verify, install, deploy]
-[DEBUG] Lifecycle site -> [pre-site, site, post-site, site-deploy]
-[DEBUG] === PROJECT BUILD PLAN ================================================
-[DEBUG] Project: org.apache.directory.api:api-ldap-model:2.1.8-SNAPSHOT
-[DEBUG] Dependencies (collect): []
-[DEBUG] Dependencies (resolve): [compile]
-[DEBUG] Repositories (dependencies): [apache.snapshots (https://repository.apache.org/content/repositories/snapshots, default, snapshots), central (https://repo.maven.apache.org/maven2, default, releases)]
-[DEBUG] Repositories (plugins) : [apache.snapshots (https://repository.apache.org/snapshots, default, snapshots), central (https://repo.maven.apache.org/maven2, default, releases)]
-[DEBUG] --- init fork of org.apache.directory.api:api-ldap-model:2.1.8-SNAPSHOT for org.apache.maven.plugins:maven-javadoc-plugin:3.11.2:javadoc (default-cli) ---
-[DEBUG] Dependencies (collect): [test]
-[DEBUG] Dependencies (resolve): [compile, test]
-[DEBUG] -----------------------------------------------------------------------
-[DEBUG] Goal: org.apache.maven.plugins:maven-enforcer-plugin:3.5.0:enforce (enforce-maven-version)
-[DEBUG] Style: Regular
-[DEBUG] Configuration: <?xml version="1.0" encoding="UTF-8"?>
-<configuration>
- <commandLineRules>${rules}</commandLineRules>
- <fail default-value="true">${enforcer.fail}</fail>
- <failFast default-value="false">${enforcer.failFast}</failFast>
- <failIfNoRules default-value="true">${enforcer.failIfNoRules}</failIfNoRules>
- <ignoreCache default-value="false">${enforcer.ignoreCache}</ignoreCache>
- <mojoExecution default-value="${mojoExecution}"/>
- <project default-value="${project}"/>
- <rules>
- <requireMavenVersion>
- <version>3.8.0</version>
- </requireMavenVersion>
- </rules>
- <rulesToExecute>${enforcer.rules}</rulesToExecute>
- <rulesToSkip>${enforcer.skipRules}</rulesToSkip>
- <session default-value="${session}"/>
- <skip default-value="false">${enforcer.skip}</skip>
-</configuration>
-[DEBUG] -----------------------------------------------------------------------
-[DEBUG] Goal: org.apache.maven.plugins:maven-enforcer-plugin:3.5.0:enforce (enforce-java-version)
-[DEBUG] Style: Regular
-[DEBUG] Configuration: <?xml version="1.0" encoding="UTF-8"?>
-<configuration>
- <commandLineRules>${rules}</commandLineRules>
- <fail default-value="true">${enforcer.fail}</fail>
- <failFast default-value="false">${enforcer.failFast}</failFast>
- <failIfNoRules default-value="true">${enforcer.failIfNoRules}</failIfNoRules>
- <ignoreCache default-value="false">${enforcer.ignoreCache}</ignoreCache>
- <mojoExecution default-value="${mojoExecution}"/>
- <project default-value="${project}"/>
- <rules>
- <requireJavaVersion>
- <version>1.8</version>
- </requireJavaVersion>
- </rules>
- <rulesToExecute>${enforcer.rules}</rulesToExecute>
- <rulesToSkip>${enforcer.skipRules}</rulesToSkip>
- <session default-value="${session}"/>
- <skip default-value="false">${enforcer.skip}</skip>
-</configuration>
-[DEBUG] -----------------------------------------------------------------------
-[DEBUG] Goal: org.apache.maven.plugins:maven-checkstyle-plugin:3.6.0:check (validate)
-[DEBUG] Style: Regular
-[DEBUG] Configuration: <?xml version="1.0" encoding="UTF-8"?>
-<configuration>
- <cacheFile default-value="${project.build.directory}/checkstyle-cachefile"/>
- <checkstyleRulesHeader default-value="<?xml version="1.0"?> <!DOCTYPE module PUBLIC "-//Checkstyle//DTD Checkstyle Configuration 1.3//EN" "https://checkstyle.org/dtds/configuration_1_3.dtd"> "/>
- <configLocation default-value="sun_checks.xml">directory-checks.xml</configLocation>
- <consoleOutput default-value="false">${checkstyle.consoleOutput}</consoleOutput>
- <excludeGeneratedSources default-value="false">${checkstyle.excludeGeneratedSources}</excludeGeneratedSources>
- <excludes>${checkstyle.excludes}</excludes>
- <failOnViolation default-value="true">true</failOnViolation>
- <failsOnError default-value="false"/>
- <headerLocation default-value="LICENSE.txt">${checkstyle.header.file}</headerLocation>
- <includeResources default-value="true">${checkstyle.includeResources}</includeResources>
- <includeTestResources default-value="true">${checkstyle.includeTestResources}</includeTestResources>
- <includeTestSourceDirectory default-value="false">false</includeTestSourceDirectory>
- <includes default-value="**\/*.java">${checkstyle.includes}</includes>
- <inputEncoding default-value="${project.build.sourceEncoding}">${encoding}</inputEncoding>
- <logViolationCountToConsole default-value="true">${checkstyle.logViolationCount}</logViolationCountToConsole>
- <logViolationsToConsole default-value="true">${checkstyle.console}</logViolationsToConsole>
- <maxAllowedViolations default-value="0">${checkstyle.maxAllowedViolations}</maxAllowedViolations>
- <omitIgnoredModules default-value="false"/>
- <outputFile default-value="${project.build.directory}/checkstyle-result.xml">${checkstyle.output.file}</outputFile>
- <outputFileFormat default-value="xml">${checkstyle.output.format}</outputFileFormat>
- <plugin default-value="${plugin}"/>
- <project default-value="${project}"/>
- <propertiesLocation>${checkstyle.properties.location}</propertiesLocation>
- <resourceExcludes>${checkstyle.resourceExcludes}</resourceExcludes>
- <resourceIncludes default-value="**/*.properties">${checkstyle.resourceIncludes}</resourceIncludes>
- <resources default-value="${project.resources}"/>
- <rulesFiles default-value="${project.build.directory}/checkstyle-rules.xml">${checkstyle.output.rules.file}</rulesFiles>
- <skip default-value="false">${checkstyle.skip}</skip>
- <skipExec default-value="false">${checkstyle.skipExec}</skipExec>
- <suppressionsFileExpression default-value="checkstyle.suppressions.file">${checkstyle.suppression.expression}</suppressionsFileExpression>
- <suppressionsLocation>${checkstyle.suppressions.location}</suppressionsLocation>
- <testResources default-value="${project.testResources}"/>
- <violationIgnore>${checkstyle.violation.ignore}</violationIgnore>
- <violationSeverity default-value="error">${checkstyle.violationSeverity}</violationSeverity>
-</configuration>
-[DEBUG] -----------------------------------------------------------------------
-[DEBUG] Goal: org.apache.maven.plugins:maven-antrun-plugin:3.1.0:run (default)
-[DEBUG] Style: Regular
-[DEBUG] Configuration: <?xml version="1.0" encoding="UTF-8"?>
-<configuration>
- <exportAntProperties default-value="false"/>
- <failOnError default-value="true"/>
- <localRepository>${localRepository}</localRepository>
- <mavenProject default-value="${project}"/>
- <pluginArtifacts>${plugin.artifacts}</pluginArtifacts>
- <session default-value="${session}"/>
- <skip default-value="false">${maven.antrun.skip}</skip>
- <sourceRoot>${sourceRoot}</sourceRoot>
- <testSourceRoot>${testSourceRoot}</testSourceRoot>
- <versionsPropertyName default-value="maven.project.dependencies.versions"/>
-</configuration>
-[DEBUG] -----------------------------------------------------------------------
-[DEBUG] Goal: org.codehaus.mojo:antlr-maven-plugin:2.2:generate (default)
-[DEBUG] Style: Regular
-[DEBUG] Configuration: <?xml version="1.0" encoding="UTF-8"?>
-<configuration>
- <debug default-value="false">${debug}</debug>
- <diagnostic default-value="false">${diagnostic}</diagnostic>
- <grammarDefs>${grammarDefs}</grammarDefs>
- <grammars>*.g</grammars>
- <outputDirectory default-value="${project.build.directory}/generated-sources/antlr"/>
- <project>${project}</project>
- <sourceDirectory default-value="${basedir}/src/main/antlr"/>
- <trace default-value="false">${trace}</trace>
- <traceLexer default-value="false">${traceLexer}</traceLexer>
- <traceParser default-value="false">${traceParser}</traceParser>
- <traceTreeParser default-value="false">${traceTreeParser}</traceTreeParser>
-</configuration>
-[DEBUG] --- exit fork of org.apache.directory.api:api-ldap-model:2.1.8-SNAPSHOT for org.apache.maven.plugins:maven-javadoc-plugin:3.11.2:javadoc (default-cli) ---
-[DEBUG] -----------------------------------------------------------------------
-[DEBUG] Goal: org.apache.maven.plugins:maven-javadoc-plugin:3.11.2:javadoc (default-cli)
-[DEBUG] Style: Regular
-[DEBUG] Configuration: <?xml version="1.0" encoding="UTF-8"?>
-<configuration>
- <additionalJOption>${additionalJOption}</additionalJOption>
- <additionalJOptions>
- <additionalJOption>-J -Xmaxerrs</additionalJOption>
- <additionalJOption>65536</additionalJOption>
- <additionalJOption>-J -Xmaxwarns 65536</additionalJOption>
- </additionalJOptions>
- <applyJavadocSecurityFix default-value="true">${maven.javadoc.applyJavadocSecurityFix}</applyJavadocSecurityFix>
- <author default-value="true">${author}</author>
- <bootclasspath>${bootclasspath}</bootclasspath>
- <bootclasspathArtifacts>${bootclasspathArtifacts}</bootclasspathArtifacts>
- <bottom default-value="Copyright &#169; {inceptionYear}&#x2013;{currentYear} {organizationName}. All rights reserved.">${bottom}</bottom>
- <breakiterator default-value="false">${breakiterator}</breakiterator>
- <charset>${charset}</charset>
- <debug default-value="false">${debug}</debug>
- <description>${description}</description>
- <detectJavaApiLink default-value="true">${detectJavaApiLink}</detectJavaApiLink>
- <detectLinks default-value="false">${detectLinks}</detectLinks>
- <detectOfflineLinks default-value="true">${detectOfflineLinks}</detectOfflineLinks>
- <disableSourcepathUsage>${maven.javadoc.disableSourcepathUsage}</disableSourcepathUsage>
- <docencoding default-value="${project.reporting.outputEncoding}">${docencoding}</docencoding>
- <docfilessubdirs default-value="false">${docfilessubdirs}</docfilessubdirs>
- <doclet>${doclet}</doclet>
- <docletArtifact>${docletArtifact}</docletArtifact>
- <docletArtifacts>${docletArtifacts}</docletArtifacts>
- <docletPath>${docletPath}</docletPath>
- <doclint>${doclint}</doclint>
- <doctitle default-value="${project.name} ${project.version} API">${doctitle}</doctitle>
- <encoding default-value="${project.build.sourceEncoding}">${encoding}</encoding>
- <excludePackageNames>${excludePackageNames}</excludePackageNames>
- <excludedocfilessubdir>${excludedocfilessubdir}</excludedocfilessubdir>
- <extdirs>${extdirs}</extdirs>
- <failOnError default-value="true">${maven.javadoc.failOnError}</failOnError>
- <failOnWarnings default-value="false">${maven.javadoc.failOnWarnings}</failOnWarnings>
- <footer>${footer}</footer>
- <forceRootLocale default-value="true">${forceRootLocale}</forceRootLocale>
- <header>${header}</header>
- <helpfile>${helpfile}</helpfile>
- <includeDependencySources default-value="false"/>
- <includeTransitiveDependencySources default-value="false"/>
- <javaApiLinks>${javaApiLinks}</javaApiLinks>
- <javadocDirectory default-value="${basedir}/src/main/javadoc"/>
- <javadocExecutable>${javadocExecutable}</javadocExecutable>
- <javadocOptionsDir default-value="${project.build.directory}/javadoc-bundle-options"/>
- <javadocVersion>${javadocVersion}</javadocVersion>
- <keywords default-value="false">${keywords}</keywords>
- <legacyMode default-value="false">${legacyMode}</legacyMode>
- <links>${links}</links>
- <linksource default-value="false">${linksource}</linksource>
- <locale>${locale}</locale>
- <maxmemory>${maxmemory}</maxmemory>
- <minmemory>${minmemory}</minmemory>
- <mojoExecution default-value="${mojoExecution}"/>
- <name>${name}</name>
- <nocomment default-value="false">${nocomment}</nocomment>
- <nodeprecated default-value="false">${nodeprecated}</nodeprecated>
- <nodeprecatedlist default-value="false">${nodeprecatedlist}</nodeprecatedlist>
- <nohelp default-value="false">true</nohelp>
- <noindex default-value="false">${noindex}</noindex>
- <nonavbar default-value="false">${nonavbar}</nonavbar>
- <nooverview default-value="false">${nooverview}</nooverview>
- <noqualifier>${noqualifier}</noqualifier>
- <nosince default-value="false">${nosince}</nosince>
- <notimestamp default-value="false">true</notimestamp>
- <notree default-value="false">${notree}</notree>
- <offline default-value="false">${maven.javadoc.offline}</offline>
- <offlineLinks>${offlineLinks}</offlineLinks>
- <old default-value="false">${old}</old>
- <outputDirectory default-value="${project.build.directory}/reports"/>
- <outputTimestamp default-value="${project.build.outputTimestamp}"/>
- <overview default-value="${basedir}/src/main/javadoc/overview.html">${overview}</overview>
- <packagesheader>${packagesheader}</packagesheader>
- <project default-value="${project}"/>
- <quiet default-value="false">${quiet}</quiet>
- <reactorProjects default-value="${reactorProjects}"/>
- <release default-value="${maven.compiler.release}"/>
- <repoSession default-value="${repositorySystemSession}"/>
- <resourcesArtifacts>${resourcesArtifacts}</resourcesArtifacts>
- <serialwarn default-value="false">${serialwarn}</serialwarn>
- <session default-value="${session}"/>
- <settings default-value="${settings}"/>
- <show default-value="protected">private</show>
- <skip default-value="false">${maven.javadoc.skip}</skip>
- <skippedModules>${maven.javadoc.skippedModules}</skippedModules>
- <source default-value="${maven.compiler.source}">${source}</source>
- <sourceDependencyCacheDir default-value="${project.build.directory}/distro-javadoc-sources"/>
- <sourceFileExcludes>
- <sourceFileExclude>**/Antlr*</sourceFileExclude>
- </sourceFileExcludes>
- <sourcepath>${sourcepath}</sourcepath>
- <sourcetab>${sourcetab}</sourcetab>
- <splitindex default-value="false">${splitindex}</splitindex>
- <staleDataPath default-value="${project.build.directory}/maven-javadoc-plugin-stale-data.txt">${staleDataPath}</staleDataPath>
- <stylesheet default-value="java">${stylesheet}</stylesheet>
- <stylesheetfile>${stylesheetfile}</stylesheetfile>
- <subpackages>${subpackages}</subpackages>
- <taglet>${taglet}</taglet>
- <tagletArtifact>${tagletArtifact}</tagletArtifact>
- <tagletArtifacts>${tagletArtifacts}</tagletArtifacts>
- <tagletpath>${tagletpath}</tagletpath>
- <taglets>${taglets}</taglets>
- <tags>${tags}</tags>
- <top>${top}</top>
- <use default-value="true">${use}</use>
- <useStandardDocletOptions default-value="true">${useStandardDocletOptions}</useStandardDocletOptions>
- <validateLinks default-value="false">${validateLinks}</validateLinks>
- <verbose default-value="false">${verbose}</verbose>
- <version default-value="true">${version}</version>
- <windowtitle default-value="${project.name} ${project.version} API">${windowtitle}</windowtitle>
-</configuration>
-[DEBUG] =======================================================================
-[INFO]
-[INFO] >>> javadoc:3.11.2:javadoc (default-cli) > generate-sources @ api-ldap-model >>>
-[DEBUG] Skipped remote request for org.apache.directory.api:api-util:2.1.8-SNAPSHOT/maven-metadata.xml, locally cached metadata up-to-date
-[DEBUG] Skipped remote request for org.apache.directory.api:api-util:2.1.8-SNAPSHOT/maven-metadata.xml, locally cached metadata up-to-date
-[DEBUG] Skipped remote request for org.apache.directory.api:api-parent:2.1.8-SNAPSHOT/maven-metadata.xml, locally cached metadata up-to-date
-[DEBUG] Skipped remote request for org.apache.directory.api:api-i18n:2.1.8-SNAPSHOT/maven-metadata.xml, locally cached metadata up-to-date
-[DEBUG] Skipped remote request for org.apache.directory.api:api-i18n:2.1.8-SNAPSHOT/maven-metadata.xml, locally cached metadata up-to-date
-[DEBUG] Skipped remote request for org.apache.directory.api:api-asn1-api:2.1.8-SNAPSHOT/maven-metadata.xml, locally cached metadata up-to-date
-[DEBUG] Skipped remote request for org.apache.directory.api:api-asn1-api:2.1.8-SNAPSHOT/maven-metadata.xml, locally cached metadata up-to-date
-[DEBUG] Skipped remote request for org.apache.directory.api:api-asn1-parent:2.1.8-SNAPSHOT/maven-metadata.xml, locally cached metadata up-to-date
-[DEBUG] Skipped remote request for org.apache.directory.api:api-asn1-ber:2.1.8-SNAPSHOT/maven-metadata.xml, locally cached metadata up-to-date
-[DEBUG] Skipped remote request for org.apache.directory.api:api-asn1-ber:2.1.8-SNAPSHOT/maven-metadata.xml, locally cached metadata up-to-date
-[DEBUG] Dependency collection stats {ConflictMarker.analyzeTime=46541, ConflictMarker.markTime=29209, ConflictMarker.nodeCount=34, ConflictIdSorter.graphTime=15459, ConflictIdSorter.topsortTime=9791, ConflictIdSorter.conflictIdCount=21, ConflictIdSorter.conflictIdCycleCount=0, ConflictResolver.totalTime=352583, ConflictResolver.conflictItemCount=33, DfDependencyCollector.collectTime=41693500, DfDependencyCollector.transformTime=479333}
-[DEBUG] org.apache.directory.api:api-ldap-model:bundle:2.1.8-SNAPSHOT
-[DEBUG] org.junit.jupiter:junit-jupiter-engine:jar:5.11.4:test
-[DEBUG] org.junit.platform:junit-platform-engine:jar:1.11.4:test
-[DEBUG] org.opentest4j:opentest4j:jar:1.3.0:test
-[DEBUG] org.junit.platform:junit-platform-commons:jar:1.11.4:test
-[DEBUG] org.junit.jupiter:junit-jupiter-api:jar:5.11.4:test
-[DEBUG] org.apiguardian:apiguardian-api:jar:1.1.2:test
-[DEBUG] org.hamcrest:hamcrest-library:jar:3.0:test
-[DEBUG] org.hamcrest:hamcrest-core:jar:3.0:test
-[DEBUG] org.hamcrest:hamcrest:jar:3.0:test
-[DEBUG] org.apache.directory.api:api-util:jar:2.1.8-SNAPSHOT:compile
-[DEBUG] org.slf4j:slf4j-api:jar:1.7.36:compile (version managed from 1.7.36)
-[DEBUG] org.apache.directory.api:api-asn1-api:jar:2.1.8-SNAPSHOT:compile
-[DEBUG] org.apache.directory.api:api-asn1-ber:jar:2.1.8-SNAPSHOT:compile
-[DEBUG] org.apache.directory.api:api-i18n:jar:2.1.8-SNAPSHOT:compile
-[DEBUG] org.apache.mina:mina-core:jar:2.2.4:compile
-[DEBUG] antlr:antlr:jar:2.7.7:provided
-[DEBUG] org.apache.servicemix.bundles:org.apache.servicemix.bundles.antlr:jar:2.7.7_5:compile
-[DEBUG] org.apache.commons:commons-lang3:jar:3.17.0:compile
-[DEBUG] org.apache.commons:commons-collections4:jar:4.5.0-M3:compile
-[DEBUG] commons-codec:commons-codec:jar:1.17.2:compile
-[DEBUG] com.github.ben-manes.caffeine:caffeine:jar:2.9.3:compile (exclusions managed from [com.google.errorprone:error_prone_annotations:*:*, org.checkerframework:checker-qual:*:*])
-[INFO]
-[INFO] --- enforcer:3.5.0:enforce (enforce-maven-version) @ api-ldap-model ---
-[DEBUG] Dependency collection stats {ConflictMarker.analyzeTime=16125, ConflictMarker.markTime=25667, ConflictMarker.nodeCount=14, ConflictIdSorter.graphTime=8083, ConflictIdSorter.topsortTime=6542, ConflictIdSorter.conflictIdCount=11, ConflictIdSorter.conflictIdCycleCount=0, ConflictResolver.totalTime=109292, ConflictResolver.conflictItemCount=14, DfDependencyCollector.collectTime=25179125, DfDependencyCollector.transformTime=175834}
-[DEBUG] org.apache.maven.plugins:maven-enforcer-plugin:jar:3.5.0
-[DEBUG] org.codehaus.plexus:plexus-utils:jar:4.0.1:compile
-[DEBUG] org.codehaus.plexus:plexus-xml:jar:3.0.0:compile
-[DEBUG] org.apache.maven.enforcer:enforcer-api:jar:3.5.0:compile
-[DEBUG] org.apache.maven.enforcer:enforcer-rules:jar:3.5.0:compile
-[DEBUG] org.apache.maven.resolver:maven-resolver-util:jar:1.4.1:compile (version managed from default)
-[DEBUG] org.apache.maven.resolver:maven-resolver-api:jar:1.4.1:provided (scope managed from default) (version managed from default)
-[DEBUG] org.apache.commons:commons-lang3:jar:3.14.0:compile (version managed from default)
-[DEBUG] commons-codec:commons-codec:jar:1.17.0:compile (version managed from default)
-[DEBUG] commons-io:commons-io:jar:2.16.1:compile (version managed from default)
-[DEBUG] org.apache-extras.beanshell:bsh:jar:2.0b6:compile
-[DEBUG] Created new class realm plugin>org.apache.maven.plugins:maven-enforcer-plugin:3.5.0
-[DEBUG] Importing foreign packages into class realm plugin>org.apache.maven.plugins:maven-enforcer-plugin:3.5.0
-[DEBUG] Imported: < project>org.apache.directory.api:api-ldap-model:2.1.8-SNAPSHOT
-[DEBUG] Populating class realm plugin>org.apache.maven.plugins:maven-enforcer-plugin:3.5.0
-[DEBUG] Included: org.apache.maven.plugins:maven-enforcer-plugin:jar:3.5.0
-[DEBUG] Included: org.codehaus.plexus:plexus-utils:jar:4.0.1
-[DEBUG] Included: org.codehaus.plexus:plexus-xml:jar:3.0.0
-[DEBUG] Included: org.apache.maven.enforcer:enforcer-api:jar:3.5.0
-[DEBUG] Included: org.apache.maven.enforcer:enforcer-rules:jar:3.5.0
-[DEBUG] Included: org.apache.commons:commons-lang3:jar:3.14.0
-[DEBUG] Included: commons-codec:commons-codec:jar:1.17.0
-[DEBUG] Included: commons-io:commons-io:jar:2.16.1
-[DEBUG] Included: org.apache-extras.beanshell:bsh:jar:2.0b6
-[DEBUG] Loading mojo org.apache.maven.plugins:maven-enforcer-plugin:3.5.0:enforce from plugin realm ClassRealm[plugin>org.apache.maven.plugins:maven-enforcer-plugin:3.5.0, parent: jdk.internal.loader.ClassLoaders$AppClassLoader@63c12fb0]
-[DEBUG] Configuring mojo execution 'org.apache.maven.plugins:maven-enforcer-plugin:3.5.0:enforce:enforce-maven-version' with basic configurator -->
-[DEBUG] (s) commandLineRules = []
-[DEBUG] (s) fail = true
-[DEBUG] (s) failFast = false
-[DEBUG] (s) failIfNoRules = true
-[DEBUG] (f) ignoreCache = false
-[DEBUG] (f) mojoExecution = org.apache.maven.plugins:maven-enforcer-plugin:3.5.0:enforce {execution: enforce-maven-version}
-[DEBUG] (f) project = MavenProject: org.apache.directory.api:api-ldap-model:2.1.8-SNAPSHOT @ /Users/elecharny/apacheds/directory-ldap-api-2.1.X/ldap/model/pom.xml
-[DEBUG] (f) rules = <rules><requireMavenVersion><version>3.8.0</version>
-</requireMavenVersion>
-</rules>
-
-[DEBUG] (s) rulesToExecute = []
-[DEBUG] (s) rulesToSkip = []
-[DEBUG] (f) session = org.apache.maven.execution.MavenSession@33f2cfda
-[DEBUG] (f) skip = false
-[DEBUG] -- end configuration --
-[DEBUG] Executing Rule 0: EnforcerRuleDesc[name=requireMavenVersion, rule=RequireMavenVersion[message=null, version=3.8.0], level=ERROR]
-[DEBUG] Check cache for class org.apache.maven.enforcer.rules.version.RequireMavenVersion with id 48525247
-[DEBUG] Add cache class org.apache.maven.enforcer.rules.version.RequireMavenVersion with id 48525247
-[DEBUG] Detected Maven Version: 3.9.9
-[DEBUG] Detected Maven Version: 3.9.9 is allowed in the range [3.8.0,).
-[INFO] Rule 0: org.apache.maven.enforcer.rules.version.RequireMavenVersion passed
-[DEBUG] Finish Rule 0: org.apache.maven.enforcer.rules.version.RequireMavenVersion takes 0 ms
-[INFO]
-[INFO] --- enforcer:3.5.0:enforce (enforce-java-version) @ api-ldap-model ---
-[DEBUG] Loading mojo org.apache.maven.plugins:maven-enforcer-plugin:3.5.0:enforce from plugin realm ClassRealm[plugin>org.apache.maven.plugins:maven-enforcer-plugin:3.5.0, parent: jdk.internal.loader.ClassLoaders$AppClassLoader@63c12fb0]
-[DEBUG] Configuring mojo execution 'org.apache.maven.plugins:maven-enforcer-plugin:3.5.0:enforce:enforce-java-version' with basic configurator -->
-[DEBUG] (s) commandLineRules = []
-[DEBUG] (s) fail = true
-[DEBUG] (s) failFast = false
-[DEBUG] (s) failIfNoRules = true
-[DEBUG] (f) ignoreCache = false
-[DEBUG] (f) mojoExecution = org.apache.maven.plugins:maven-enforcer-plugin:3.5.0:enforce {execution: enforce-java-version}
-[DEBUG] (f) project = MavenProject: org.apache.directory.api:api-ldap-model:2.1.8-SNAPSHOT @ /Users/elecharny/apacheds/directory-ldap-api-2.1.X/ldap/model/pom.xml
-[DEBUG] (f) rules = <rules><requireJavaVersion><version>1.8</version>
-</requireJavaVersion>
-</rules>
-
-[DEBUG] (s) rulesToExecute = []
-[DEBUG] (s) rulesToSkip = []
-[DEBUG] (f) session = org.apache.maven.execution.MavenSession@33f2cfda
-[DEBUG] (f) skip = false
-[DEBUG] -- end configuration --
-[DEBUG] Executing Rule 0: EnforcerRuleDesc[name=requireJavaVersion, rule=RequireJavaVersion[message=null, version=1.8, display=false], level=ERROR]
-[DEBUG] Check cache for class org.apache.maven.enforcer.rules.version.RequireJavaVersion with id 48571
-[DEBUG] Add cache class org.apache.maven.enforcer.rules.version.RequireJavaVersion with id 48571
-[DEBUG] Detected Java Version: '21.0.4'
-[DEBUG] Normalized Java Version: '21.0.4'
-[DEBUG] Parsed Version: Major: 21 Minor: 0 Incremental: 4 Build: 0 Qualifier: null
-[DEBUG] Detected JDK Version: 21.0.4 is allowed in the range [1.8,).
-[INFO] Rule 0: org.apache.maven.enforcer.rules.version.RequireJavaVersion passed
-[DEBUG] Finish Rule 0: org.apache.maven.enforcer.rules.version.RequireJavaVersion takes 8 ms
-[INFO]
-[INFO] --- checkstyle:3.6.0:check (validate) @ api-ldap-model ---
-[DEBUG] Dependency collection stats {ConflictMarker.analyzeTime=179417, ConflictMarker.markTime=62083, ConflictMarker.nodeCount=204, ConflictIdSorter.graphTime=112000, ConflictIdSorter.topsortTime=31042, ConflictIdSorter.conflictIdCount=70, ConflictIdSorter.conflictIdCycleCount=0, ConflictResolver.totalTime=1073042, ConflictResolver.conflictItemCount=157, DfDependencyCollector.collectTime=125715041, DfDependencyCollector.transformTime=1474084}
-[DEBUG] org.apache.maven.plugins:maven-checkstyle-plugin:jar:3.6.0
-[DEBUG] com.puppycrawl.tools:checkstyle:jar:10.21.1:runtime
-[DEBUG] info.picocli:picocli:jar:4.7.6:runtime
-[DEBUG] org.antlr:antlr4-runtime:jar:4.13.2:runtime
-[DEBUG] commons-beanutils:commons-beanutils:jar:1.9.4:compile
-[DEBUG] commons-logging:commons-logging:jar:1.2:compile
-[DEBUG] commons-collections:commons-collections:jar:3.2.2:compile
-[DEBUG] com.google.guava:guava:jar:33.4.0-jre:runtime
-[DEBUG] com.google.guava:failureaccess:jar:1.0.2:runtime
-[DEBUG] com.google.guava:listenablefuture:jar:9999.0-empty-to-avoid-conflict-with-guava:runtime
-[DEBUG] com.google.code.findbugs:jsr305:jar:3.0.2:runtime
-[DEBUG] com.google.errorprone:error_prone_annotations:jar:2.36.0:runtime
-[DEBUG] com.google.j2objc:j2objc-annotations:jar:3.0.0:runtime
-[DEBUG] org.reflections:reflections:jar:0.10.2:runtime
-[DEBUG] org.javassist:javassist:jar:3.28.0-GA:runtime
-[DEBUG] net.sf.saxon:Saxon-HE:jar:12.5:runtime
-[DEBUG] org.xmlresolver:xmlresolver:jar:5.2.2:runtime
-[DEBUG] org.apache.httpcomponents.client5:httpclient5:jar:5.1.3:runtime
-[DEBUG] org.apache.httpcomponents.core5:httpcore5-h2:jar:5.1.3:runtime
-[DEBUG] org.apache.httpcomponents.core5:httpcore5:jar:5.1.3:runtime
-[DEBUG] org.xmlresolver:xmlresolver:jar:data:5.2.2:runtime
-[DEBUG] org.checkerframework:checker-qual:jar:3.48.3:runtime
-[DEBUG] org.apache.maven.doxia:doxia-module-xdoc:jar:1.12.0:runtime
-[DEBUG] org.apache.directory.buildtools:checkstyle-configuration:jar:2.0.2:runtime
-[DEBUG] org.apache.maven.reporting:maven-reporting-api:jar:4.0.0:compile
-[DEBUG] org.apache.maven.reporting:maven-reporting-impl:jar:4.0.0:compile
-[DEBUG] org.apache.maven.shared:maven-shared-utils:jar:3.4.2:compile
-[DEBUG] org.apache.maven.doxia:doxia-site-model:jar:2.0.0:compile
-[DEBUG] org.apache.maven.doxia:doxia-site-renderer:jar:2.0.0:compile
-[DEBUG] org.apache.maven.doxia:doxia-skin-model:jar:2.0.0:compile
-[DEBUG] org.apache.maven.doxia:doxia-module-xhtml5:jar:2.0.0:compile
-[DEBUG] org.codehaus.plexus:plexus-velocity:jar:2.2.0:compile
-[DEBUG] org.apache.velocity:velocity-engine-core:jar:2.4:compile
-[DEBUG] org.apache.velocity.tools:velocity-tools-generic:jar:3.1:compile
-[DEBUG] org.apache.commons:commons-digester3:jar:3.2:compile
-[DEBUG] com.github.cliftonlabs:json-simple:jar:3.0.2:compile
-[DEBUG] org.apache.maven.doxia:doxia-module-apt:jar:2.0.0:runtime
-[DEBUG] org.apache.maven:maven-archiver:jar:3.6.2:compile
-[DEBUG] org.codehaus.plexus:plexus-archiver:jar:4.9.2:compile
-[DEBUG] org.codehaus.plexus:plexus-io:jar:3.4.2:compile
-[DEBUG] org.apache.commons:commons-compress:jar:1.26.1:compile
-[DEBUG] commons-codec:commons-codec:jar:1.16.1:compile
-[DEBUG] org.iq80.snappy:snappy:jar:0.4:compile
-[DEBUG] org.tukaani:xz:jar:1.9:runtime
-[DEBUG] com.github.luben:zstd-jni:jar:1.5.5-11:runtime
-[DEBUG] org.apache.maven.resolver:maven-resolver-api:jar:1.4.1:compile
-[DEBUG] org.eclipse.sisu:org.eclipse.sisu.plexus:jar:0.9.0.M3:compile (version managed from default)
-[DEBUG] org.eclipse.sisu:org.eclipse.sisu.inject:jar:0.9.0.M3:compile (version managed from default)
-[DEBUG] org.codehaus.plexus:plexus-classworlds:jar:2.6.0:compile
-[DEBUG] org.apache.maven.doxia:doxia-sink-api:jar:2.0.0:compile
-[DEBUG] org.apache.maven.doxia:doxia-core:jar:2.0.0:compile
-[DEBUG] javax.inject:javax.inject:jar:1:compile
-[DEBUG] commons-io:commons-io:jar:2.17.0:compile
-[DEBUG] org.apache.commons:commons-text:jar:1.12.0:compile
-[DEBUG] org.apache.maven.doxia:doxia-integration-tools:jar:2.0.0:compile
-[DEBUG] org.codehaus.plexus:plexus-interpolation:jar:1.27:compile
-[DEBUG] org.codehaus.plexus:plexus-component-annotations:jar:2.2.0:compile
-[DEBUG] org.codehaus.plexus:plexus-resources:jar:1.3.0:compile
-[DEBUG] org.codehaus.plexus:plexus-utils:jar:4.0.1:compile
-[DEBUG] org.codehaus.plexus:plexus-xml:jar:3.0.1:compile
-[DEBUG] org.codehaus.plexus:plexus-i18n:jar:1.0-beta-10:compile
-[DEBUG] org.slf4j:slf4j-api:jar:1.7.36:compile
-[DEBUG] org.apache.commons:commons-lang3:jar:3.17.0:compile
-[DEBUG] javax.xml.bind:jaxb-api:jar:2.3.1:compile
-[DEBUG] javax.activation:javax.activation-api:jar:1.2.0:compile
-[DEBUG] Created new class realm plugin>org.apache.maven.plugins:maven-checkstyle-plugin:3.6.0
-[DEBUG] Importing foreign packages into class realm plugin>org.apache.maven.plugins:maven-checkstyle-plugin:3.6.0
-[DEBUG] Imported: < project>org.apache.directory.api:api-ldap-model:2.1.8-SNAPSHOT
-[DEBUG] Populating class realm plugin>org.apache.maven.plugins:maven-checkstyle-plugin:3.6.0
-[DEBUG] Included: org.apache.maven.plugins:maven-checkstyle-plugin:jar:3.6.0
-[DEBUG] Included: com.puppycrawl.tools:checkstyle:jar:10.21.1
-[DEBUG] Included: info.picocli:picocli:jar:4.7.6
-[DEBUG] Included: org.antlr:antlr4-runtime:jar:4.13.2
-[DEBUG] Included: commons-beanutils:commons-beanutils:jar:1.9.4
-[DEBUG] Included: commons-logging:commons-logging:jar:1.2
-[DEBUG] Included: commons-collections:commons-collections:jar:3.2.2
-[DEBUG] Included: com.google.guava:guava:jar:33.4.0-jre
-[DEBUG] Included: com.google.guava:failureaccess:jar:1.0.2
-[DEBUG] Included: com.google.guava:listenablefuture:jar:9999.0-empty-to-avoid-conflict-with-guava
-[DEBUG] Included: com.google.code.findbugs:jsr305:jar:3.0.2
-[DEBUG] Included: com.google.errorprone:error_prone_annotations:jar:2.36.0
-[DEBUG] Included: com.google.j2objc:j2objc-annotations:jar:3.0.0
-[DEBUG] Included: org.reflections:reflections:jar:0.10.2
-[DEBUG] Included: org.javassist:javassist:jar:3.28.0-GA
-[DEBUG] Included: net.sf.saxon:Saxon-HE:jar:12.5
-[DEBUG] Included: org.xmlresolver:xmlresolver:jar:5.2.2
-[DEBUG] Included: org.apache.httpcomponents.client5:httpclient5:jar:5.1.3
-[DEBUG] Included: org.apache.httpcomponents.core5:httpcore5-h2:jar:5.1.3
-[DEBUG] Included: org.apache.httpcomponents.core5:httpcore5:jar:5.1.3
-[DEBUG] Included: org.xmlresolver:xmlresolver:jar:data:5.2.2
-[DEBUG] Included: org.checkerframework:checker-qual:jar:3.48.3
-[DEBUG] Included: org.apache.maven.doxia:doxia-module-xdoc:jar:1.12.0
-[DEBUG] Included: org.apache.directory.buildtools:checkstyle-configuration:jar:2.0.2
-[DEBUG] Included: org.apache.maven.reporting:maven-reporting-api:jar:4.0.0
-[DEBUG] Included: org.apache.maven.reporting:maven-reporting-impl:jar:4.0.0
-[DEBUG] Included: org.apache.maven.shared:maven-shared-utils:jar:3.4.2
-[DEBUG] Included: org.apache.maven.doxia:doxia-site-model:jar:2.0.0
-[DEBUG] Included: org.apache.maven.doxia:doxia-site-renderer:jar:2.0.0
-[DEBUG] Included: org.apache.maven.doxia:doxia-skin-model:jar:2.0.0
-[DEBUG] Included: org.apache.maven.doxia:doxia-module-xhtml5:jar:2.0.0
-[DEBUG] Included: org.codehaus.plexus:plexus-velocity:jar:2.2.0
-[DEBUG] Included: org.apache.velocity:velocity-engine-core:jar:2.4
-[DEBUG] Included: org.apache.velocity.tools:velocity-tools-generic:jar:3.1
-[DEBUG] Included: org.apache.commons:commons-digester3:jar:3.2
-[DEBUG] Included: com.github.cliftonlabs:json-simple:jar:3.0.2
-[DEBUG] Included: org.apache.maven.doxia:doxia-module-apt:jar:2.0.0
-[DEBUG] Included: org.apache.maven:maven-archiver:jar:3.6.2
-[DEBUG] Included: org.codehaus.plexus:plexus-archiver:jar:4.9.2
-[DEBUG] Included: org.codehaus.plexus:plexus-io:jar:3.4.2
-[DEBUG] Included: org.apache.commons:commons-compress:jar:1.26.1
-[DEBUG] Included: commons-codec:commons-codec:jar:1.16.1
-[DEBUG] Included: org.iq80.snappy:snappy:jar:0.4
-[DEBUG] Included: org.tukaani:xz:jar:1.9
-[DEBUG] Included: com.github.luben:zstd-jni:jar:1.5.5-11
-[DEBUG] Included: org.eclipse.sisu:org.eclipse.sisu.inject:jar:0.9.0.M3
-[DEBUG] Included: org.apache.maven.doxia:doxia-sink-api:jar:2.0.0
-[DEBUG] Included: org.apache.maven.doxia:doxia-core:jar:2.0.0
-[DEBUG] Included: commons-io:commons-io:jar:2.17.0
-[DEBUG] Included: org.apache.commons:commons-text:jar:1.12.0
-[DEBUG] Included: org.apache.maven.doxia:doxia-integration-tools:jar:2.0.0
-[DEBUG] Included: org.codehaus.plexus:plexus-interpolation:jar:1.27
-[DEBUG] Included: org.codehaus.plexus:plexus-component-annotations:jar:2.2.0
-[DEBUG] Included: org.codehaus.plexus:plexus-resources:jar:1.3.0
-[DEBUG] Included: org.codehaus.plexus:plexus-utils:jar:4.0.1
-[DEBUG] Included: org.codehaus.plexus:plexus-xml:jar:3.0.1
-[DEBUG] Included: org.codehaus.plexus:plexus-i18n:jar:1.0-beta-10
-[DEBUG] Included: org.apache.commons:commons-lang3:jar:3.17.0
-[DEBUG] Included: javax.xml.bind:jaxb-api:jar:2.3.1
-[DEBUG] Included: javax.activation:javax.activation-api:jar:1.2.0
-[DEBUG] Loading mojo org.apache.maven.plugins:maven-checkstyle-plugin:3.6.0:check from plugin realm ClassRealm[plugin>org.apache.maven.plugins:maven-checkstyle-plugin:3.6.0, parent: jdk.internal.loader.ClassLoaders$AppClassLoader@63c12fb0]
-[DEBUG] Configuring mojo execution 'org.apache.maven.plugins:maven-checkstyle-plugin:3.6.0:check:validate' with basic configurator -->
-[DEBUG] (f) cacheFile = /Users/elecharny/apacheds/directory-ldap-api-2.1.X/ldap/model/target/checkstyle-cachefile
-[DEBUG] (f) checkstyleRulesHeader = <?xml version="1.0"?>
-<!DOCTYPE module PUBLIC "-//Checkstyle//DTD Checkstyle Configuration 1.3//EN"
- "https://checkstyle.org/dtds/configuration_1_3.dtd">
-
-[DEBUG] (f) configLocation = directory-checks.xml
-[DEBUG] (f) consoleOutput = false
-[DEBUG] (f) excludeGeneratedSources = false
-[DEBUG] (f) failOnViolation = true
-[DEBUG] (f) failsOnError = false
-[DEBUG] (f) headerLocation = LICENSE.txt
-[DEBUG] (f) includeResources = true
-[DEBUG] (f) includeTestResources = true
-[DEBUG] (f) includeTestSourceDirectory = false
-[DEBUG] (f) includes = **\/*.java
-[DEBUG] (f) inputEncoding = UTF-8
-[DEBUG] (f) logViolationCountToConsole = true
-[DEBUG] (f) logViolationsToConsole = true
-[DEBUG] (f) maxAllowedViolations = 0
-[DEBUG] (f) omitIgnoredModules = false
-[DEBUG] (f) outputFile = /Users/elecharny/apacheds/directory-ldap-api-2.1.X/ldap/model/target/checkstyle-result.xml
-[DEBUG] (f) outputFileFormat = xml
-[DEBUG] (f) plugin = Component Descriptor: role: 'org.apache.maven.plugin.Mojo', implementation: 'org.apache.maven.plugins.checkstyle.CheckstyleViolationCheckMojo', role hint: 'org.apache.maven.plugins:maven-checkstyle-plugin:3.6.0:check'
-role: 'org.apache.maven.plugin.Mojo', implementation: 'org.apache.maven.plugins.checkstyle.CheckstyleReport', role hint: 'org.apache.maven.plugins:maven-checkstyle-plugin:3.6.0:checkstyle'
-role: 'org.apache.maven.plugin.Mojo', implementation: 'org.apache.maven.plugins.checkstyle.CheckstyleAggregateReport', role hint: 'org.apache.maven.plugins:maven-checkstyle-plugin:3.6.0:checkstyle-aggregate'
-role: 'org.apache.maven.plugin.Mojo', implementation: 'org.apache.maven.plugins.maven_checkstyle_plugin.HelpMojo', role hint: 'org.apache.maven.plugins:maven-checkstyle-plugin:3.6.0:help'
----
-[DEBUG] (f) project = MavenProject: org.apache.directory.api:api-ldap-model:2.1.8-SNAPSHOT @ /Users/elecharny/apacheds/directory-ldap-api-2.1.X/ldap/model/pom.xml
-[DEBUG] (f) resourceIncludes = **/*.properties
-[DEBUG] (f) resources = [Resource {targetPath: null, filtering: false, FileSet {directory: /Users/elecharny/apacheds/directory-ldap-api-2.1.X/ldap/model/src/main/resources, PatternSet [includes: {}, excludes: {}]}}]
-[DEBUG] (f) rulesFiles = /Users/elecharny/apacheds/directory-ldap-api-2.1.X/ldap/model/target/checkstyle-rules.xml
-[DEBUG] (f) skip = false
-[DEBUG] (f) skipExec = false
-[DEBUG] (f) suppressionsFileExpression = checkstyle.suppressions.file
-[DEBUG] (f) suppressionsLocation = /Users/elecharny/apacheds/directory-ldap-api-2.1.X/ldap/model/src/checkstyle/suppressions.xml
-[DEBUG] (f) testResources = [Resource {targetPath: null, filtering: false, FileSet {directory: /Users/elecharny/apacheds/directory-ldap-api-2.1.X/ldap/model/src/test/resources, PatternSet [includes: {}, excludes: {}]}}]
-[DEBUG] (f) violationSeverity = error
-[DEBUG] -- end configuration --
-[DEBUG] executeCheckstyle start headerLocation : LICENSE.txt
-[DEBUG] JarResourceLoader : trying to load 'jar:file:/Users/elecharny/.m2/repository/com/puppycrawl/tools/checkstyle/10.21.1/checkstyle-10.21.1.jar'
-[DEBUG] JarResourceLoader : trying to load 'jar:file:/Users/elecharny/.m2/repository/org/apache/directory/buildtools/checkstyle-configuration/2.0.2/checkstyle-configuration-2.0.2.jar'
-[DEBUG] Added 478 source files found in '/Users/elecharny/apacheds/directory-ldap-api-2.1.X/ldap/model/src/main/java'.
-[DEBUG] The resources directory '/Users/elecharny/apacheds/directory-ldap-api-2.1.X/ldap/model/src/main/resources' does not exist or is not a directory.
-[DEBUG] Added 1 resource files found in '/Users/elecharny/apacheds/directory-ldap-api-2.1.X/ldap/model/src/test/resources'.
-[DEBUG] Added 479 files to process.
-[DEBUG] The resource '/Users/elecharny/apacheds/directory-ldap-api-2.1.X/ldap/model/src/checkstyle/suppressions.xml' was found as '/Users/elecharny/apacheds/directory-ldap-api-2.1.X/ldap/model/src/checkstyle/suppressions.xml'
-[DEBUG] request.getConfigLocation() directory-checks.xml
-[DEBUG] The resource 'directory-checks.xml' was not found with resourceLoader 'org.codehaus.plexus.resource.loader.FileResourceLoader'
-[DEBUG] The resource 'directory-checks.xml' was not found with resourceLoader 'org.codehaus.plexus.resource.loader.JarResourceLoader'
-[DEBUG] The resource 'directory-checks.xml' was found as 'jar:file:/Users/elecharny/.m2/repository/org/apache/directory/buildtools/checkstyle-configuration/2.0.2/checkstyle-configuration-2.0.2.jar!/directory-checks.xml'
-[DEBUG] headerLocation LICENSE.txt
-[DEBUG] The resource 'LICENSE.txt' was not found with resourceLoader org.codehaus.plexus.resource.loader.FileResourceLoader.
-[DEBUG] The resource 'LICENSE.txt' was not found with resourceLoader org.codehaus.plexus.resource.loader.JarResourceLoader.
-[DEBUG] URLResourceLoader: No valid URL 'LICENSE.txt'
-[DEBUG] URLResourceLoader: No valid URL 'LICENSE.txt'
-[DEBUG] The resource 'LICENSE.txt' was not found with resourceLoader org.codehaus.plexus.resource.loader.URLResourceLoader.
-[DEBUG] Unable to process header location: LICENSE.txt
-[DEBUG] Checkstyle will throw exception if ${checkstyle.header.file} is used
-[DEBUG] The resource '/Users/elecharny/apacheds/directory-ldap-api-2.1.X/ldap/model/src/checkstyle/suppressions.xml' was found as '/Users/elecharny/apacheds/directory-ldap-api-2.1.X/ldap/model/src/checkstyle/suppressions.xml'
-[INFO] You have 0 Checkstyle violations.
-[INFO]
-[INFO] --- antrun:3.1.0:run (default) @ api-ldap-model ---
-[DEBUG] Dependency collection stats {ConflictMarker.analyzeTime=34542, ConflictMarker.markTime=6083, ConflictMarker.nodeCount=4, ConflictIdSorter.graphTime=5250, ConflictIdSorter.topsortTime=5083, ConflictIdSorter.conflictIdCount=4, ConflictIdSorter.conflictIdCycleCount=0, ConflictResolver.totalTime=64416, ConflictResolver.conflictItemCount=4, DfDependencyCollector.collectTime=5292291, DfDependencyCollector.transformTime=123334}
-[DEBUG] org.apache.maven.plugins:maven-antrun-plugin:jar:3.1.0
-[DEBUG] org.codehaus.plexus:plexus-utils:jar:3.4.1:compile
-[DEBUG] org.apache.ant:ant:jar:1.10.12:compile
-[DEBUG] org.apache.ant:ant-launcher:jar:1.10.12:compile
-[DEBUG] Created new class realm plugin>org.apache.maven.plugins:maven-antrun-plugin:3.1.0
-[DEBUG] Importing foreign packages into class realm plugin>org.apache.maven.plugins:maven-antrun-plugin:3.1.0
-[DEBUG] Imported: < project>org.apache.directory.api:api-ldap-model:2.1.8-SNAPSHOT
-[DEBUG] Populating class realm plugin>org.apache.maven.plugins:maven-antrun-plugin:3.1.0
-[DEBUG] Included: org.apache.maven.plugins:maven-antrun-plugin:jar:3.1.0
-[DEBUG] Included: org.codehaus.plexus:plexus-utils:jar:3.4.1
-[DEBUG] Included: org.apache.ant:ant:jar:1.10.12
-[DEBUG] Included: org.apache.ant:ant-launcher:jar:1.10.12
-[DEBUG] Loading mojo org.apache.maven.plugins:maven-antrun-plugin:3.1.0:run from plugin realm ClassRealm[plugin>org.apache.maven.plugins:maven-antrun-plugin:3.1.0, parent: jdk.internal.loader.ClassLoaders$AppClassLoader@63c12fb0]
-[DEBUG] Configuring mojo execution 'org.apache.maven.plugins:maven-antrun-plugin:3.1.0:run:default' with basic configurator -->
-[DEBUG] (f) exportAntProperties = false
-[DEBUG] (f) failOnError = true
-[DEBUG] (f) localRepository = id: local
- url: file:///Users/elecharny/.m2/repository/
- layout: default
-snapshots: [enabled => true, update => always]
- releases: [enabled => true, update => always]
- blocked: false
-
-[DEBUG] (f) mavenProject = MavenProject: org.apache.directory.api:api-ldap-model:2.1.8-SNAPSHOT @ /Users/elecharny/apacheds/directory-ldap-api-2.1.X/ldap/model/pom.xml
-[DEBUG] (f) pluginArtifacts = [org.apache.maven.plugins:maven-antrun-plugin:maven-plugin:3.1.0:, org.codehaus.plexus:plexus-utils:jar:3.4.1:compile, org.apache.ant:ant:jar:1.10.12:compile, org.apache.ant:ant-launcher:jar:1.10.12:compile]
-[DEBUG] (f) session = org.apache.maven.execution.MavenSession@33f2cfda
-[DEBUG] (f) skip = false
-[DEBUG] (f) versionsPropertyName = maven.project.dependencies.versions
-[DEBUG] -- end configuration --
-[INFO] No Ant target defined - SKIPPED
-[INFO]
-[INFO] --- antlr:2.2:generate (default) @ api-ldap-model ---
-[DEBUG] Using mirror maven-default-http-blocker (http://0.0.0.0/) for snapshots (http://snapshots.maven.codehaus.org/maven2).
-[DEBUG] Using mirror maven-default-http-blocker (http://0.0.0.0/) for apache.snapshots (http://cvs.apache.org/maven-snapshot-repository).
-[DEBUG] Using mirror maven-default-http-blocker (http://0.0.0.0/) for central (http://repo1.maven.org/maven2).
-[DEBUG] Using mirror maven-default-http-blocker (http://0.0.0.0/) for apache.snapshots (http://people.apache.org/maven-snapshot-repository).
-[DEBUG] Dependency collection stats {ConflictMarker.analyzeTime=42333, ConflictMarker.markTime=18334, ConflictMarker.nodeCount=60, ConflictIdSorter.graphTime=27333, ConflictIdSorter.topsortTime=13125, ConflictIdSorter.conflictIdCount=28, ConflictIdSorter.conflictIdCycleCount=0, ConflictResolver.totalTime=238750, ConflictResolver.conflictItemCount=51, DfDependencyCollector.collectTime=23741375, DfDependencyCollector.transformTime=351292}
-[DEBUG] org.codehaus.mojo:antlr-maven-plugin:jar:2.2
-[DEBUG] org.apache.maven:maven-project:jar:2.0.2:compile
-[DEBUG] org.apache.maven:maven-profile:jar:2.0.2:compile
-[DEBUG] org.apache.maven:maven-model:jar:2.0.2:compile
-[DEBUG] org.apache.maven:maven-artifact-manager:jar:2.0.2:compile
-[DEBUG] org.apache.maven:maven-repository-metadata:jar:2.0.2:compile
-[DEBUG] org.apache.maven:maven-artifact:jar:2.0.2:compile
-[DEBUG] org.codehaus.plexus:plexus-container-default:jar:1.0-alpha-9:compile
-[DEBUG] junit:junit:jar:3.8.2:test (scope managed from default) (version managed from default)
-[DEBUG] classworlds:classworlds:jar:1.1-alpha-2:compile
-[DEBUG] org.apache.maven.reporting:maven-reporting-impl:jar:2.0.2:compile
-[DEBUG] commons-validator:commons-validator:jar:1.1.4:compile
-[DEBUG] org.apache.maven.doxia:doxia-core:jar:1.0-alpha-7:compile
-[DEBUG] org.apache.maven.doxia:doxia-sink-api:jar:1.0-alpha-7:compile
-[DEBUG] oro:oro:jar:2.0.7:compile
-[DEBUG] org.apache.maven.reporting:maven-reporting-api:jar:2.0.2:compile
-[DEBUG] org.apache.maven.doxia:doxia-site-renderer:jar:1.0-alpha-7:compile
-[DEBUG] org.codehaus.plexus:plexus-velocity:jar:1.1.2:compile
-[DEBUG] commons-collections:commons-collections:jar:2.0:compile
-[DEBUG] commons-logging:commons-logging-api:jar:1.0.4:compile
-[DEBUG] velocity:velocity:jar:1.4:compile
-[DEBUG] velocity:velocity-dep:jar:1.4:runtime
-[DEBUG] org.apache.maven.doxia:doxia-decoration-model:jar:1.0-alpha-7:compile
-[DEBUG] org.apache.maven:maven-plugin-api:jar:2.0.2:compile
-[DEBUG] org.codehaus.plexus:plexus-i18n:jar:1.0-beta-6:compile
-[DEBUG] org.codehaus.plexus:plexus-utils:jar:1.4.1:compile
-[DEBUG] org.apache.maven.wagon:wagon-provider-api:jar:1.0-beta-1:compile
-[DEBUG] org.apache.commons:commons-exec:jar:1.0:compile
-[DEBUG] Created new class realm plugin>org.codehaus.mojo:antlr-maven-plugin:2.2
-[DEBUG] Importing foreign packages into class realm plugin>org.codehaus.mojo:antlr-maven-plugin:2.2
-[DEBUG] Imported: < project>org.apache.directory.api:api-ldap-model:2.1.8-SNAPSHOT
-[DEBUG] Populating class realm plugin>org.codehaus.mojo:antlr-maven-plugin:2.2
-[DEBUG] Included: org.codehaus.mojo:antlr-maven-plugin:jar:2.2
-[DEBUG] Included: org.apache.maven.reporting:maven-reporting-impl:jar:2.0.2
-[DEBUG] Included: commons-validator:commons-validator:jar:1.1.4
-[DEBUG] Included: org.apache.maven.doxia:doxia-core:jar:1.0-alpha-7
-[DEBUG] Included: org.apache.maven.doxia:doxia-sink-api:jar:1.0-alpha-7
-[DEBUG] Included: oro:oro:jar:2.0.7
-[DEBUG] Included: org.apache.maven.reporting:maven-reporting-api:jar:2.0.2
-[DEBUG] Included: org.apache.maven.doxia:doxia-site-renderer:jar:1.0-alpha-7
-[DEBUG] Included: org.codehaus.plexus:plexus-velocity:jar:1.1.2
-[DEBUG] Included: commons-collections:commons-collections:jar:2.0
-[DEBUG] Included: commons-logging:commons-logging-api:jar:1.0.4
-[DEBUG] Included: velocity:velocity:jar:1.4
-[DEBUG] Included: velocity:velocity-dep:jar:1.4
-[DEBUG] Included: org.apache.maven.doxia:doxia-decoration-model:jar:1.0-alpha-7
-[DEBUG] Included: org.codehaus.plexus:plexus-i18n:jar:1.0-beta-6
-[DEBUG] Included: org.codehaus.plexus:plexus-utils:jar:1.4.1
-[DEBUG] Included: org.apache.commons:commons-exec:jar:1.0
-[DEBUG] Loading mojo org.codehaus.mojo:antlr-maven-plugin:2.2:generate from plugin realm ClassRealm[plugin>org.codehaus.mojo:antlr-maven-plugin:2.2, parent: jdk.internal.loader.ClassLoaders$AppClassLoader@63c12fb0]
-[DEBUG] Configuring mojo execution 'org.codehaus.mojo:antlr-maven-plugin:2.2:generate:default' with basic configurator -->
-[DEBUG] (f) debug = false
-[DEBUG] (f) diagnostic = false
-[DEBUG] (f) grammarDefs = []
-[DEBUG] (f) grammars = *.g
-[DEBUG] (f) outputDirectory = /Users/elecharny/apacheds/directory-ldap-api-2.1.X/ldap/model/target/generated-sources/antlr
-[DEBUG] (f) project = MavenProject: org.apache.directory.api:api-ldap-model:2.1.8-SNAPSHOT @ /Users/elecharny/apacheds/directory-ldap-api-2.1.X/ldap/model/pom.xml
-[DEBUG] (f) sourceDirectory = /Users/elecharny/apacheds/directory-ldap-api-2.1.X/ldap/model/src/main/antlr
-[DEBUG] (f) trace = false
-[DEBUG] (f) traceLexer = false
-[DEBUG] (f) traceParser = false
-[DEBUG] (f) traceTreeParser = false
-[DEBUG] -- end configuration --
-[INFO] performing grammar generation [subtree-specification.g]
-[DEBUG] antlr args=
--o
-/Users/elecharny/apacheds/directory-ldap-api-2.1.X/ldap/model/target/generated-sources/antlr/org/apache/directory/api/ldap/model/subtree
-/Users/elecharny/apacheds/directory-ldap-api-2.1.X/ldap/model/src/main/antlr/subtree-specification.g
-[INFO] performing grammar generation [distinguishedName.g]
-[DEBUG] antlr args=
--o
-/Users/elecharny/apacheds/directory-ldap-api-2.1.X/ldap/model/target/generated-sources/antlr/org/apache/directory/api/ldap/model/name
-/Users/elecharny/apacheds/directory-ldap-api-2.1.X/ldap/model/src/main/antlr/distinguishedName.g
-[INFO] performing grammar generation [SubtreeSpecificationChecker.g]
-[DEBUG] antlr args=
--o
-/Users/elecharny/apacheds/directory-ldap-api-2.1.X/ldap/model/target/generated-sources/antlr/org/apache/directory/api/ldap/model/subtree
-/Users/elecharny/apacheds/directory-ldap-api-2.1.X/ldap/model/src/main/antlr/SubtreeSpecificationChecker.g
-[INFO]
-[INFO] <<< javadoc:3.11.2:javadoc (default-cli) < generate-sources @ api-ldap-model <<<
-[INFO]
-[DEBUG] Dependency collection stats {ConflictMarker.analyzeTime=32208, ConflictMarker.markTime=12917, ConflictMarker.nodeCount=34, ConflictIdSorter.graphTime=15458, ConflictIdSorter.topsortTime=9375, ConflictIdSorter.conflictIdCount=21, ConflictIdSorter.conflictIdCycleCount=0, ConflictResolver.totalTime=160000, ConflictResolver.conflictItemCount=33, DfDependencyCollector.collectTime=509125, DfDependencyCollector.transformTime=244875}
-[DEBUG] org.apache.directory.api:api-ldap-model:bundle:2.1.8-SNAPSHOT
-[DEBUG] org.junit.jupiter:junit-jupiter-engine:jar:5.11.4:test
-[DEBUG] org.junit.platform:junit-platform-engine:jar:1.11.4:test
-[DEBUG] org.opentest4j:opentest4j:jar:1.3.0:test
-[DEBUG] org.junit.platform:junit-platform-commons:jar:1.11.4:test
-[DEBUG] org.junit.jupiter:junit-jupiter-api:jar:5.11.4:test
-[DEBUG] org.apiguardian:apiguardian-api:jar:1.1.2:test
-[DEBUG] org.hamcrest:hamcrest-library:jar:3.0:test
-[DEBUG] org.hamcrest:hamcrest-core:jar:3.0:test
-[DEBUG] org.hamcrest:hamcrest:jar:3.0:test
-[DEBUG] org.apache.directory.api:api-util:jar:2.1.8-SNAPSHOT:compile
-[DEBUG] org.slf4j:slf4j-api:jar:1.7.36:compile (version managed from 1.7.36)
-[DEBUG] org.apache.directory.api:api-asn1-api:jar:2.1.8-SNAPSHOT:compile
-[DEBUG] org.apache.directory.api:api-asn1-ber:jar:2.1.8-SNAPSHOT:compile
-[DEBUG] org.apache.directory.api:api-i18n:jar:2.1.8-SNAPSHOT:compile
-[DEBUG] org.apache.mina:mina-core:jar:2.2.4:compile
-[DEBUG] antlr:antlr:jar:2.7.7:provided
-[DEBUG] org.apache.servicemix.bundles:org.apache.servicemix.bundles.antlr:jar:2.7.7_5:compile
-[DEBUG] org.apache.commons:commons-lang3:jar:3.17.0:compile
-[DEBUG] org.apache.commons:commons-collections4:jar:4.5.0-M3:compile
-[DEBUG] commons-codec:commons-codec:jar:1.17.2:compile
-[DEBUG] com.github.ben-manes.caffeine:caffeine:jar:2.9.3:compile (exclusions managed from [com.google.errorprone:error_prone_annotations:*:*, org.checkerframework:checker-qual:*:*])
-[INFO]
-[INFO] --- javadoc:3.11.2:javadoc (default-cli) @ api-ldap-model ---
-[DEBUG] Dependency collection stats {ConflictMarker.analyzeTime=90750, ConflictMarker.markTime=42916, ConflictMarker.nodeCount=143, ConflictIdSorter.graphTime=56458, ConflictIdSorter.topsortTime=23625, ConflictIdSorter.conflictIdCount=51, ConflictIdSorter.conflictIdCycleCount=0, ConflictResolver.totalTime=496875, ConflictResolver.conflictItemCount=121, DfDependencyCollector.collectTime=26202958, DfDependencyCollector.transformTime=735292}
-[DEBUG] org.apache.maven.plugins:maven-javadoc-plugin:jar:3.11.2
-[DEBUG] org.apache.maven.resolver:maven-resolver-util:jar:1.4.1:compile
-[DEBUG] org.apache.maven.resolver:maven-resolver-api:jar:1.4.1:compile
-[DEBUG] javax.inject:javax.inject:jar:1:compile
-[DEBUG] org.apache.maven.reporting:maven-reporting-api:jar:4.0.0:compile
-[DEBUG] org.apache.maven:maven-archiver:jar:3.6.2:compile
-[DEBUG] org.codehaus.plexus:plexus-interpolation:jar:1.27:compile
-[DEBUG] org.apache.maven.shared:maven-invoker:jar:3.3.0:compile
-[DEBUG] org.apache.maven.shared:maven-shared-utils:jar:3.4.2:compile
-[DEBUG] org.apache.maven.shared:maven-common-artifact-filters:jar:3.4.0:compile
-[DEBUG] org.apache.maven.doxia:doxia-sink-api:jar:2.0.0:compile
-[DEBUG] org.apache.maven.doxia:doxia-site-renderer:jar:2.0.0:compile
-[DEBUG] org.apache.maven.doxia:doxia-core:jar:2.0.0:compile
-[DEBUG] org.apache.maven.doxia:doxia-site-model:jar:2.0.0:compile
-[DEBUG] org.apache.maven.doxia:doxia-skin-model:jar:2.0.0:compile
-[DEBUG] org.apache.maven.doxia:doxia-module-xhtml5:jar:2.0.0:compile
-[DEBUG] org.eclipse.sisu:org.eclipse.sisu.plexus:jar:0.9.0.M3:compile (version managed from default)
-[DEBUG] org.eclipse.sisu:org.eclipse.sisu.inject:jar:0.9.0.M3:compile (version managed from default)
-[DEBUG] org.codehaus.plexus:plexus-component-annotations:jar:2.1.0:compile
-[DEBUG] org.codehaus.plexus:plexus-classworlds:jar:2.6.0:compile
-[DEBUG] org.codehaus.plexus:plexus-velocity:jar:2.2.0:compile
-[DEBUG] org.apache.velocity:velocity-engine-core:jar:2.4:compile
-[DEBUG] org.apache.velocity.tools:velocity-tools-generic:jar:3.1:compile
-[DEBUG] commons-beanutils:commons-beanutils:jar:1.9.4:compile
-[DEBUG] commons-collections:commons-collections:jar:3.2.2:compile
-[DEBUG] org.apache.commons:commons-digester3:jar:3.2:compile
-[DEBUG] com.github.cliftonlabs:json-simple:jar:3.0.2:compile
-[DEBUG] org.apache.maven.doxia:doxia-integration-tools:jar:2.0.0:compile
-[DEBUG] org.codehaus.plexus:plexus-i18n:jar:1.0-beta-10:compile
-[DEBUG] org.apache.maven.wagon:wagon-provider-api:jar:3.5.3:compile
-[DEBUG] org.apache.commons:commons-lang3:jar:3.17.0:compile
-[DEBUG] org.apache.commons:commons-text:jar:1.12.0:compile
-[DEBUG] org.apache.httpcomponents:httpclient:jar:4.5.14:compile
-[DEBUG] commons-logging:commons-logging:jar:1.2:compile
-[DEBUG] commons-codec:commons-codec:jar:1.11:compile
-[DEBUG] org.apache.httpcomponents:httpcore:jar:4.4.16:compile
-[DEBUG] com.thoughtworks.qdox:qdox:jar:2.2.0:compile
-[DEBUG] org.slf4j:slf4j-api:jar:1.7.36:compile
-[DEBUG] org.codehaus.plexus:plexus-java:jar:1.3.0:compile
-[DEBUG] org.ow2.asm:asm:jar:9.7:compile
-[DEBUG] org.codehaus.plexus:plexus-utils:jar:4.0.2:compile
-[DEBUG] org.codehaus.plexus:plexus-xml:jar:3.0.1:compile
-[DEBUG] org.codehaus.plexus:plexus-io:jar:3.5.1:compile
-[DEBUG] org.codehaus.plexus:plexus-archiver:jar:4.10.0:compile
-[DEBUG] org.apache.commons:commons-compress:jar:1.26.2:compile
-[DEBUG] io.airlift:aircompressor:jar:0.27:compile
-[DEBUG] org.tukaani:xz:jar:1.9:runtime
-[DEBUG] com.github.luben:zstd-jni:jar:1.5.6-3:runtime
-[DEBUG] commons-io:commons-io:jar:2.18.0:runtime
-[DEBUG] org.codehaus.plexus:plexus-interactivity-api:jar:1.3:compile
-[DEBUG] Created new class realm plugin>org.apache.maven.plugins:maven-javadoc-plugin:3.11.2
-[DEBUG] Importing foreign packages into class realm plugin>org.apache.maven.plugins:maven-javadoc-plugin:3.11.2
-[DEBUG] Imported: < project>org.apache.directory.api:api-ldap-model:2.1.8-SNAPSHOT
-[DEBUG] Populating class realm plugin>org.apache.maven.plugins:maven-javadoc-plugin:3.11.2
-[DEBUG] Included: org.apache.maven.plugins:maven-javadoc-plugin:jar:3.11.2
-[DEBUG] Included: org.apache.maven.reporting:maven-reporting-api:jar:4.0.0
-[DEBUG] Included: org.apache.maven:maven-archiver:jar:3.6.2
-[DEBUG] Included: org.codehaus.plexus:plexus-interpolation:jar:1.27
-[DEBUG] Included: org.apache.maven.shared:maven-invoker:jar:3.3.0
-[DEBUG] Included: org.apache.maven.shared:maven-shared-utils:jar:3.4.2
-[DEBUG] Included: org.apache.maven.shared:maven-common-artifact-filters:jar:3.4.0
-[DEBUG] Included: org.apache.maven.doxia:doxia-sink-api:jar:2.0.0
-[DEBUG] Included: org.apache.maven.doxia:doxia-site-renderer:jar:2.0.0
-[DEBUG] Included: org.apache.maven.doxia:doxia-core:jar:2.0.0
-[DEBUG] Included: org.apache.maven.doxia:doxia-site-model:jar:2.0.0
-[DEBUG] Included: org.apache.maven.doxia:doxia-skin-model:jar:2.0.0
-[DEBUG] Included: org.apache.maven.doxia:doxia-module-xhtml5:jar:2.0.0
-[DEBUG] Included: org.eclipse.sisu:org.eclipse.sisu.inject:jar:0.9.0.M3
-[DEBUG] Included: org.codehaus.plexus:plexus-component-annotations:jar:2.1.0
-[DEBUG] Included: org.codehaus.plexus:plexus-velocity:jar:2.2.0
-[DEBUG] Included: org.apache.velocity:velocity-engine-core:jar:2.4
-[DEBUG] Included: org.apache.velocity.tools:velocity-tools-generic:jar:3.1
-[DEBUG] Included: commons-beanutils:commons-beanutils:jar:1.9.4
-[DEBUG] Included: commons-collections:commons-collections:jar:3.2.2
-[DEBUG] Included: org.apache.commons:commons-digester3:jar:3.2
-[DEBUG] Included: com.github.cliftonlabs:json-simple:jar:3.0.2
-[DEBUG] Included: org.apache.maven.doxia:doxia-integration-tools:jar:2.0.0
-[DEBUG] Included: org.codehaus.plexus:plexus-i18n:jar:1.0-beta-10
-[DEBUG] Included: org.apache.commons:commons-lang3:jar:3.17.0
-[DEBUG] Included: org.apache.commons:commons-text:jar:1.12.0
-[DEBUG] Included: org.apache.httpcomponents:httpclient:jar:4.5.14
-[DEBUG] Included: commons-logging:commons-logging:jar:1.2
-[DEBUG] Included: commons-codec:commons-codec:jar:1.11
-[DEBUG] Included: org.apache.httpcomponents:httpcore:jar:4.4.16
-[DEBUG] Included: com.thoughtworks.qdox:qdox:jar:2.2.0
-[DEBUG] Included: org.codehaus.plexus:plexus-java:jar:1.3.0
-[DEBUG] Included: org.ow2.asm:asm:jar:9.7
-[DEBUG] Included: org.codehaus.plexus:plexus-utils:jar:4.0.2
-[DEBUG] Included: org.codehaus.plexus:plexus-xml:jar:3.0.1
-[DEBUG] Included: org.codehaus.plexus:plexus-io:jar:3.5.1
-[DEBUG] Included: org.codehaus.plexus:plexus-archiver:jar:4.10.0
-[DEBUG] Included: org.apache.commons:commons-compress:jar:1.26.2
-[DEBUG] Included: io.airlift:aircompressor:jar:0.27
-[DEBUG] Included: org.tukaani:xz:jar:1.9
-[DEBUG] Included: com.github.luben:zstd-jni:jar:1.5.6-3
-[DEBUG] Included: commons-io:commons-io:jar:2.18.0
-[DEBUG] Included: org.codehaus.plexus:plexus-interactivity-api:jar:1.3
-[DEBUG] Loading mojo org.apache.maven.plugins:maven-javadoc-plugin:3.11.2:javadoc from plugin realm ClassRealm[plugin>org.apache.maven.plugins:maven-javadoc-plugin:3.11.2, parent: jdk.internal.loader.ClassLoaders$AppClassLoader@63c12fb0]
-[DEBUG] Configuring mojo execution 'org.apache.maven.plugins:maven-javadoc-plugin:3.11.2:javadoc:default-cli' with basic configurator -->
-[DEBUG] (f) additionalJOptions = [-J -Xmaxerrs, 65536, -J -Xmaxwarns 65536]
-[DEBUG] (f) applyJavadocSecurityFix = true
-[DEBUG] (f) author = true
-[DEBUG] (f) bootclasspathArtifacts = []
-[DEBUG] (f) bottom = Copyright © {inceptionYear}–{currentYear} {organizationName}. All rights reserved.
-[DEBUG] (f) breakiterator = false
-[DEBUG] (f) debug = false
-[DEBUG] (f) detectJavaApiLink = true
-[DEBUG] (f) detectLinks = false
-[DEBUG] (f) detectOfflineLinks = true
-[DEBUG] (f) docencoding = UTF-8
-[DEBUG] (f) docfilessubdirs = false
-[DEBUG] (f) docletArtifact = groupId = 'null'
-artifactId = 'null'
-version = 'null'
-classifier = 'null'
-[DEBUG] (f) docletArtifacts = []
-[DEBUG] (f) doctitle = Apache Directory LDAP API Model 2.1.8-SNAPSHOT API
-[DEBUG] (f) encoding = UTF-8
-[DEBUG] (f) failOnError = true
-[DEBUG] (f) failOnWarnings = false
-[DEBUG] (f) forceRootLocale = true
-[DEBUG] (f) includeDependencySources = false
-[DEBUG] (f) includeTransitiveDependencySources = false
-[DEBUG] (f) javaApiLinks = {}
-[DEBUG] (f) javadocDirectory = /Users/elecharny/apacheds/directory-ldap-api-2.1.X/ldap/model/src/main/javadoc
-[DEBUG] (f) javadocOptionsDir = /Users/elecharny/apacheds/directory-ldap-api-2.1.X/ldap/model/target/javadoc-bundle-options
-[DEBUG] (f) keywords = false
-[DEBUG] (f) legacyMode = false
-[DEBUG] (f) links = []
-[DEBUG] (f) linksource = false
-[DEBUG] (f) mojoExecution = org.apache.maven.plugins:maven-javadoc-plugin:3.11.2:javadoc {execution: default-cli}
-[DEBUG] (f) nocomment = false
-[DEBUG] (f) nodeprecated = false
-[DEBUG] (f) nodeprecatedlist = false
-[DEBUG] (f) nohelp = true
-[DEBUG] (f) noindex = false
-[DEBUG] (f) nonavbar = false
-[DEBUG] (f) nooverview = false
-[DEBUG] (f) nosince = false
-[DEBUG] (f) notimestamp = true
-[DEBUG] (f) notree = false
-[DEBUG] (f) offline = false
-[DEBUG] (f) offlineLinks = []
-[DEBUG] (f) old = false
-[DEBUG] (f) outputDirectory = /Users/elecharny/apacheds/directory-ldap-api-2.1.X/ldap/model/target/reports
-[DEBUG] (f) outputTimestamp = 1722609791
-[DEBUG] (f) overview = /Users/elecharny/apacheds/directory-ldap-api-2.1.X/ldap/model/src/main/javadoc/overview.html
-[DEBUG] (f) project = MavenProject: org.apache.directory.api:api-ldap-model:2.1.8-SNAPSHOT @ /Users/elecharny/apacheds/directory-ldap-api-2.1.X/ldap/model/pom.xml
-[DEBUG] (f) quiet = false
-[DEBUG] (f) reactorProjects = [MavenProject: org.apache.directory.api:api-ldap-model:2.1.8-SNAPSHOT @ /Users/elecharny/apacheds/directory-ldap-api-2.1.X/ldap/model/pom.xml]
-[DEBUG] (f) release = 8
-[DEBUG] (f) repoSession = org.eclipse.aether.DefaultRepositorySystemSession@530dfb43
-[DEBUG] (f) resourcesArtifacts = []
-[DEBUG] (f) serialwarn = false
-[DEBUG] (f) session = org.apache.maven.execution.MavenSession@33f2cfda
-[DEBUG] (f) settings = org.apache.maven.execution.SettingsAdapter@4e5b94e1
-[DEBUG] (f) show = private
-[DEBUG] (f) skip = false
-[DEBUG] (f) source = 1.8
-[DEBUG] (f) sourceDependencyCacheDir = /Users/elecharny/apacheds/directory-ldap-api-2.1.X/ldap/model/target/distro-javadoc-sources
-[DEBUG] (f) sourceFileExcludes = [**/Antlr*]
-[DEBUG] (f) splitindex = false
-[DEBUG] (f) staleDataPath = /Users/elecharny/apacheds/directory-ldap-api-2.1.X/ldap/model/target/maven-javadoc-plugin-stale-data.txt
-[DEBUG] (f) stylesheet = java
-[DEBUG] (f) tagletArtifact = groupId = 'null'
-artifactId = 'null'
-version = 'null'
-classifier = 'null'
-[DEBUG] (f) tagletArtifacts = []
-[DEBUG] (f) taglets = []
-[DEBUG] (f) tags = []
-[DEBUG] (f) use = true
-[DEBUG] (f) useStandardDocletOptions = true
-[DEBUG] (f) validateLinks = false
-[DEBUG] (f) verbose = false
-[DEBUG] (f) version = true
-[DEBUG] (f) windowtitle = Apache Directory LDAP API Model 2.1.8-SNAPSHOT API
-[DEBUG] -- end configuration --
-[DEBUG] Found Java API link: https://docs.oracle.com/javase/8/docs/api/
-[DEBUG] Trying to add links for modules...
-[INFO] No previous run data found, generating javadoc.
-[DEBUG] /Library/Java/JavaVirtualMachines/temurin-21.jdk/Contents/Home/bin/javadoc -J-Duser.language= -J-Duser.country= "-J -Xmaxerrs" 65536 "-J -Xmaxwarns 65536" @options @argfile
-[INFO] ------------------------------------------------------------------------
-[INFO] BUILD FAILURE
-[INFO] ------------------------------------------------------------------------
-[INFO] Total time: 3.264 s
-[INFO] Finished at: 2025-01-09T16:38:20+01:00
-[INFO] ------------------------------------------------------------------------
-[ERROR] Failed to execute goal org.apache.maven.plugins:maven-javadoc-plugin:3.11.2:javadoc (default-cli) on project api-ldap-model: An error has occurred in Javadoc report generation:
-[ERROR] Exit code: 1
-[ERROR] Error: Could not find or load main class -Xmaxerrs
-[ERROR] Caused by: java.lang.ClassNotFoundException: -Xmaxerrs
-[ERROR] Command line was: /Library/Java/JavaVirtualMachines/temurin-21.jdk/Contents/Home/bin/javadoc -J-Duser.language= -J-Duser.country= "-J -Xmaxerrs" 65536 "-J -Xmaxwarns 65536" @options @argfile
-[ERROR]
-[ERROR] Refer to the generated Javadoc files in '/Users/elecharny/apacheds/directory-ldap-api-2.1.X/ldap/model/target/reports/apidocs' dir.
-[ERROR]
-[ERROR] -> [Help 1]
-org.apache.maven.lifecycle.LifecycleExecutionException: Failed to execute goal org.apache.maven.plugins:maven-javadoc-plugin:3.11.2:javadoc (default-cli) on project api-ldap-model: An error has occurred in Javadoc report generation:
-Exit code: 1
-Error: Could not find or load main class -Xmaxerrs
-Caused by: java.lang.ClassNotFoundException: -Xmaxerrs
-Command line was: /Library/Java/JavaVirtualMachines/temurin-21.jdk/Contents/Home/bin/javadoc -J-Duser.language= -J-Duser.country= "-J -Xmaxerrs" 65536 "-J -Xmaxwarns 65536" @options @argfile
-
-Refer to the generated Javadoc files in '/Users/elecharny/apacheds/directory-ldap-api-2.1.X/ldap/model/target/reports/apidocs' dir.
-
- at org.apache.maven.lifecycle.internal.MojoExecutor.doExecute2 (MojoExecutor.java:333)
- at org.apache.maven.lifecycle.internal.MojoExecutor.doExecute (MojoExecutor.java:316)
- at org.apache.maven.lifecycle.internal.MojoExecutor.execute (MojoExecutor.java:212)
- at org.apache.maven.lifecycle.internal.MojoExecutor.execute (MojoExecutor.java:174)
- at org.apache.maven.lifecycle.internal.MojoExecutor.access$000 (MojoExecutor.java:75)
- at org.apache.maven.lifecycle.internal.MojoExecutor$1.run (MojoExecutor.java:162)
- at org.apache.maven.plugin.DefaultMojosExecutionStrategy.execute (DefaultMojosExecutionStrategy.java:39)
- at org.apache.maven.lifecycle.internal.MojoExecutor.execute (MojoExecutor.java:159)
- at org.apache.maven.lifecycle.internal.LifecycleModuleBuilder.buildProject (LifecycleModuleBuilder.java:105)
- at org.apache.maven.lifecycle.internal.LifecycleModuleBuilder.buildProject (LifecycleModuleBuilder.java:73)
- at org.apache.maven.lifecycle.internal.builder.singlethreaded.SingleThreadedBuilder.build (SingleThreadedBuilder.java:53)
- at org.apache.maven.lifecycle.internal.LifecycleStarter.execute (LifecycleStarter.java:118)
- at org.apache.maven.DefaultMaven.doExecute (DefaultMaven.java:261)
- at org.apache.maven.DefaultMaven.doExecute (DefaultMaven.java:173)
- at org.apache.maven.DefaultMaven.execute (DefaultMaven.java:101)
- at org.apache.maven.cli.MavenCli.execute (MavenCli.java:906)
- at org.apache.maven.cli.MavenCli.doMain (MavenCli.java:283)
- at org.apache.maven.cli.MavenCli.main (MavenCli.java:206)
- at jdk.internal.reflect.DirectMethodHandleAccessor.invoke (DirectMethodHandleAccessor.java:103)
- at java.lang.reflect.Method.invoke (Method.java:580)
- at org.codehaus.plexus.classworlds.launcher.Launcher.launchEnhanced (Launcher.java:255)
- at org.codehaus.plexus.classworlds.launcher.Launcher.launch (Launcher.java:201)
- at org.codehaus.plexus.classworlds.launcher.Launcher.mainWithExitCode (Launcher.java:361)
- at org.codehaus.plexus.classworlds.launcher.Launcher.main (Launcher.java:314)
-Caused by: org.apache.maven.plugin.MojoExecutionException: An error has occurred in Javadoc report generation:
-Exit code: 1
-Error: Could not find or load main class -Xmaxerrs
-Caused by: java.lang.ClassNotFoundException: -Xmaxerrs
-Command line was: /Library/Java/JavaVirtualMachines/temurin-21.jdk/Contents/Home/bin/javadoc -J-Duser.language= -J-Duser.country= "-J -Xmaxerrs" 65536 "-J -Xmaxwarns 65536" @options @argfile
-
-Refer to the generated Javadoc files in '/Users/elecharny/apacheds/directory-ldap-api-2.1.X/ldap/model/target/reports/apidocs' dir.
-
- at org.apache.maven.plugins.javadoc.AbstractJavadocMojo.failOnError (AbstractJavadocMojo.java:6048)
- at org.apache.maven.plugins.javadoc.JavadocReport.doExecute (JavadocReport.java:300)
- at org.apache.maven.plugins.javadoc.AbstractJavadocMojo.execute (AbstractJavadocMojo.java:1878)
- at org.apache.maven.plugin.DefaultBuildPluginManager.executeMojo (DefaultBuildPluginManager.java:126)
- at org.apache.maven.lifecycle.internal.MojoExecutor.doExecute2 (MojoExecutor.java:328)
- at org.apache.maven.lifecycle.internal.MojoExecutor.doExecute (MojoExecutor.java:316)
- at org.apache.maven.lifecycle.internal.MojoExecutor.execute (MojoExecutor.java:212)
- at org.apache.maven.lifecycle.internal.MojoExecutor.execute (MojoExecutor.java:174)
- at org.apache.maven.lifecycle.internal.MojoExecutor.access$000 (MojoExecutor.java:75)
- at org.apache.maven.lifecycle.internal.MojoExecutor$1.run (MojoExecutor.java:162)
- at org.apache.maven.plugin.DefaultMojosExecutionStrategy.execute (DefaultMojosExecutionStrategy.java:39)
- at org.apache.maven.lifecycle.internal.MojoExecutor.execute (MojoExecutor.java:159)
- at org.apache.maven.lifecycle.internal.LifecycleModuleBuilder.buildProject (LifecycleModuleBuilder.java:105)
- at org.apache.maven.lifecycle.internal.LifecycleModuleBuilder.buildProject (LifecycleModuleBuilder.java:73)
- at org.apache.maven.lifecycle.internal.builder.singlethreaded.SingleThreadedBuilder.build (SingleThreadedBuilder.java:53)
- at org.apache.maven.lifecycle.internal.LifecycleStarter.execute (LifecycleStarter.java:118)
- at org.apache.maven.DefaultMaven.doExecute (DefaultMaven.java:261)
- at org.apache.maven.DefaultMaven.doExecute (DefaultMaven.java:173)
- at org.apache.maven.DefaultMaven.execute (DefaultMaven.java:101)
- at org.apache.maven.cli.MavenCli.execute (MavenCli.java:906)
- at org.apache.maven.cli.MavenCli.doMain (MavenCli.java:283)
- at org.apache.maven.cli.MavenCli.main (MavenCli.java:206)
- at jdk.internal.reflect.DirectMethodHandleAccessor.invoke (DirectMethodHandleAccessor.java:103)
- at java.lang.reflect.Method.invoke (Method.java:580)
- at org.codehaus.plexus.classworlds.launcher.Launcher.launchEnhanced (Launcher.java:255)
- at org.codehaus.plexus.classworlds.launcher.Launcher.launch (Launcher.java:201)
- at org.codehaus.plexus.classworlds.launcher.Launcher.mainWithExitCode (Launcher.java:361)
- at org.codehaus.plexus.classworlds.launcher.Launcher.main (Launcher.java:314)
-Caused by: org.apache.maven.reporting.MavenReportException:
-Exit code: 1
-Error: Could not find or load main class -Xmaxerrs
-Caused by: java.lang.ClassNotFoundException: -Xmaxerrs
-Command line was: /Library/Java/JavaVirtualMachines/temurin-21.jdk/Contents/Home/bin/javadoc -J-Duser.language= -J-Duser.country= "-J -Xmaxerrs" 65536 "-J -Xmaxwarns 65536" @options @argfile
-
-Refer to the generated Javadoc files in '/Users/elecharny/apacheds/directory-ldap-api-2.1.X/ldap/model/target/reports/apidocs' dir.
-
- at org.apache.maven.plugins.javadoc.AbstractJavadocMojo.doExecuteJavadocCommandLine (AbstractJavadocMojo.java:5185)
- at org.apache.maven.plugins.javadoc.AbstractJavadocMojo.executeJavadocCommandLine (AbstractJavadocMojo.java:5058)
- at org.apache.maven.plugins.javadoc.AbstractJavadocMojo.executeReport (AbstractJavadocMojo.java:2082)
- at org.apache.maven.plugins.javadoc.JavadocReport.generate (JavadocReport.java:142)
- at org.apache.maven.plugins.javadoc.JavadocReport.doExecute (JavadocReport.java:298)
- at org.apache.maven.plugins.javadoc.AbstractJavadocMojo.execute (AbstractJavadocMojo.java:1878)
- at org.apache.maven.plugin.DefaultBuildPluginManager.executeMojo (DefaultBuildPluginManager.java:126)
- at org.apache.maven.lifecycle.internal.MojoExecutor.doExecute2 (MojoExecutor.java:328)
- at org.apache.maven.lifecycle.internal.MojoExecutor.doExecute (MojoExecutor.java:316)
- at org.apache.maven.lifecycle.internal.MojoExecutor.execute (MojoExecutor.java:212)
- at org.apache.maven.lifecycle.internal.MojoExecutor.execute (MojoExecutor.java:174)
- at org.apache.maven.lifecycle.internal.MojoExecutor.access$000 (MojoExecutor.java:75)
- at org.apache.maven.lifecycle.internal.MojoExecutor$1.run (MojoExecutor.java:162)
- at org.apache.maven.plugin.DefaultMojosExecutionStrategy.execute (DefaultMojosExecutionStrategy.java:39)
- at org.apache.maven.lifecycle.internal.MojoExecutor.execute (MojoExecutor.java:159)
- at org.apache.maven.lifecycle.internal.LifecycleModuleBuilder.buildProject (LifecycleModuleBuilder.java:105)
- at org.apache.maven.lifecycle.internal.LifecycleModuleBuilder.buildProject (LifecycleModuleBuilder.java:73)
- at org.apache.maven.lifecycle.internal.builder.singlethreaded.SingleThreadedBuilder.build (SingleThreadedBuilder.java:53)
- at org.apache.maven.lifecycle.internal.LifecycleStarter.execute (LifecycleStarter.java:118)
- at org.apache.maven.DefaultMaven.doExecute (DefaultMaven.java:261)
- at org.apache.maven.DefaultMaven.doExecute (DefaultMaven.java:173)
- at org.apache.maven.DefaultMaven.execute (DefaultMaven.java:101)
- at org.apache.maven.cli.MavenCli.execute (MavenCli.java:906)
- at org.apache.maven.cli.MavenCli.doMain (MavenCli.java:283)
- at org.apache.maven.cli.MavenCli.main (MavenCli.java:206)
- at jdk.internal.reflect.DirectMethodHandleAccessor.invoke (DirectMethodHandleAccessor.java:103)
- at java.lang.reflect.Method.invoke (Method.java:580)
- at org.codehaus.plexus.classworlds.launcher.Launcher.launchEnhanced (Launcher.java:255)
- at org.codehaus.plexus.classworlds.launcher.Launcher.launch (Launcher.java:201)
- at org.codehaus.plexus.classworlds.launcher.Launcher.mainWithExitCode (Launcher.java:361)
- at org.codehaus.plexus.classworlds.launcher.Launcher.main (Launcher.java:314)
-[ERROR]
-[ERROR]
-[ERROR] For more information about the errors and possible solutions, please read the following articles:
-[ERROR] [Help 1] http://cwiki.apache.org/confluence/display/MAVEN/MojoExecutionException
-[DEBUG] Shutting down adapter factory; available factories [file-lock, rwlock-local, semaphore-local, noop]; available name mappers [discriminating, file-gav, file-hgav, file-static, gav, static]
-[DEBUG] Shutting down 'file-lock' factory
-[DEBUG] Shutting down 'rwlock-local' factory
-[DEBUG] Shutting down 'semaphore-local' factory
-[DEBUG] Shutting down 'noop' factory