You are viewing a plain text version of this content. The canonical link for it is here.
Posted to commits@beam.apache.org by Apache Jenkins Server <je...@builds.apache.org> on 2017/05/17 17:58:31 UTC

Build failed in Jenkins: beam_PostCommit_Java_MavenInstall #3835

See <https://builds.apache.org/job/beam_PostCommit_Java_MavenInstall/3835/display/redirect?page=changes>

Changes:

[tgroh] Translate a Pipeline in SdkComponents

------------------------------------------
[...truncated 721.16 KB...]
2017-05-17T17:56:31.164 [INFO] Downloading: https://repo.maven.apache.org/maven2/com/google/appengine/appengine/1.9.34/appengine-1.9.34.pom
2017-05-17T17:56:31.193 [INFO] Downloaded: https://repo.maven.apache.org/maven2/com/google/appengine/appengine/1.9.34/appengine-1.9.34.pom (845 B at 27.5 KB/sec)
2017-05-17T17:56:31.195 [INFO] Downloading: https://repo.maven.apache.org/maven2/org/sonatype/oss/oss-parent/4/oss-parent-4.pom
2017-05-17T17:56:31.222 [INFO] Downloaded: https://repo.maven.apache.org/maven2/org/sonatype/oss/oss-parent/4/oss-parent-4.pom (4 KB at 144.7 KB/sec)
2017-05-17T17:56:31.226 [INFO] Downloading: https://repository.apache.org/content/repositories/snapshots/io/netty/netty-codec-http2/maven-metadata.xml
2017-05-17T17:56:31.227 [INFO] Downloading: https://oss.sonatype.org/content/repositories/snapshots/io/netty/netty-codec-http2/maven-metadata.xml
2017-05-17T17:56:31.503 [INFO] Downloaded: https://oss.sonatype.org/content/repositories/snapshots/io/netty/netty-codec-http2/maven-metadata.xml (500 B at 1.8 KB/sec)
2017-05-17T17:56:31.505 [INFO] Downloading: https://repo.maven.apache.org/maven2/io/dropwizard/metrics/metrics-core/3.1.2/metrics-core-3.1.2.pom
2017-05-17T17:56:31.532 [INFO] Downloaded: https://repo.maven.apache.org/maven2/io/dropwizard/metrics/metrics-core/3.1.2/metrics-core-3.1.2.pom (846 B at 30.6 KB/sec)
2017-05-17T17:56:31.533 [INFO] Downloading: https://repo.maven.apache.org/maven2/io/dropwizard/metrics/metrics-parent/3.1.2/metrics-parent-3.1.2.pom
2017-05-17T17:56:31.560 [INFO] Downloaded: https://repo.maven.apache.org/maven2/io/dropwizard/metrics/metrics-parent/3.1.2/metrics-parent-3.1.2.pom (12 KB at 434.1 KB/sec)
2017-05-17T17:56:31.562 [INFO] Downloading: https://repo.maven.apache.org/maven2/io/netty/netty-tcnative-boringssl-static/1.1.33.Fork26/netty-tcnative-boringssl-static-1.1.33.Fork26.pom
2017-05-17T17:56:31.591 [INFO] Downloaded: https://repo.maven.apache.org/maven2/io/netty/netty-tcnative-boringssl-static/1.1.33.Fork26/netty-tcnative-boringssl-static-1.1.33.Fork26.pom (17 KB at 581.4 KB/sec)
2017-05-17T17:56:31.593 [INFO] Downloading: https://repo.maven.apache.org/maven2/io/netty/netty-tcnative-parent/1.1.33.Fork26/netty-tcnative-parent-1.1.33.Fork26.pom
2017-05-17T17:56:31.624 [INFO] Downloaded: https://repo.maven.apache.org/maven2/io/netty/netty-tcnative-parent/1.1.33.Fork26/netty-tcnative-parent-1.1.33.Fork26.pom (20 KB at 636.8 KB/sec)
2017-05-17T17:56:31.626 [INFO] Downloading: https://repo.maven.apache.org/maven2/io/netty/netty-parent/4.0.18.Final/netty-parent-4.0.18.Final.pom
2017-05-17T17:56:31.655 [INFO] Downloaded: https://repo.maven.apache.org/maven2/io/netty/netty-parent/4.0.18.Final/netty-parent-4.0.18.Final.pom (31 KB at 1061.2 KB/sec)
[JENKINS] Archiving disabled
2017-05-17T17:56:35.441 [INFO]                                                                         
2017-05-17T17:56:35.441 [INFO] ------------------------------------------------------------------------
2017-05-17T17:56:35.441 [INFO] Skipping Apache Beam :: Parent
2017-05-17T17:56:35.441 [INFO] This project has been banned from the build due to previous failures.
2017-05-17T17:56:35.441 [INFO] ------------------------------------------------------------------------
[JENKINS] Archiving disabled
[JENKINS] Archiving disabled
[JENKINS] Archiving disabled
[JENKINS] Archiving disabled
[JENKINS] Archiving disabled
[JENKINS] Archiving disabled
[JENKINS] Archiving disabled
[JENKINS] Archiving disabled
[JENKINS] Archiving disabled
[JENKINS] Archiving disabled
[JENKINS] Archiving disabled
[JENKINS] Archiving disabled
[JENKINS] Archiving disabled
[JENKINS] Archiving disabled
[JENKINS] Archiving disabled
[JENKINS] Archiving disabled
[JENKINS] Archiving disabled
[JENKINS] Archiving disabled
[JENKINS] Archiving disabled
[JENKINS] Archiving disabled
[JENKINS] Archiving disabled
[JENKINS] Archiving disabled
[JENKINS] Archiving disabled
[JENKINS] Archiving disabled
[JENKINS] Archiving disabled
[JENKINS] Archiving disabled
[JENKINS] Archiving disabled
[JENKINS] Archiving disabled
[JENKINS] Archiving disabled
[JENKINS] Archiving disabled
[JENKINS] Archiving disabled
[JENKINS] Archiving disabled
[JENKINS] Archiving disabled
[JENKINS] Archiving disabled
[JENKINS] Archiving disabled
[JENKINS] Archiving disabled
[JENKINS] Archiving disabled
[JENKINS] Archiving disabled
[JENKINS] Archiving disabled
[JENKINS] Archiving disabled
[JENKINS] Archiving disabled
[JENKINS] Archiving disabled
[JENKINS] Archiving disabled
[JENKINS] Archiving disabled
[JENKINS] Archiving disabled
[JENKINS] Archiving disabled2017-05-17T17:56:51.882 [INFO] ------------------------------------------------------------------------

2017-05-17T17:56:51.882 [INFO] Reactor Summary:
2017-05-17T17:56:51.882 [INFO] 
2017-05-17T17:56:51.882 [INFO] Apache Beam :: Parent .............................. SUCCESS [ 23.288 s]
2017-05-17T17:56:51.882 [INFO] Apache Beam :: SDKs :: Java :: Build Tools ......... SUCCESS [  9.784 s]
2017-05-17T17:56:51.883 [INFO] Apache Beam :: SDKs ................................ SUCCESS [  5.218 s]
2017-05-17T17:56:51.883 [INFO] Apache Beam :: SDKs :: Common ...................... SUCCESS [  1.866 s]
2017-05-17T17:56:51.883 [INFO] Apache Beam :: SDKs :: Common :: Fn API ............ SUCCESS [ 18.615 s]
2017-05-17T17:56:51.883 [INFO] Apache Beam :: SDKs :: Common :: Runner API ........ SUCCESS [ 14.605 s]
2017-05-17T17:56:51.883 [INFO] Apache Beam :: SDKs :: Java ........................ SUCCESS [  2.165 s]
2017-05-17T17:56:51.883 [INFO] Apache Beam :: SDKs :: Java :: Core ................ SUCCESS [02:28 min]
2017-05-17T17:56:51.883 [INFO] Apache Beam :: SDKs :: Java :: IO .................. SUCCESS [  2.414 s]
2017-05-17T17:56:51.883 [INFO] Apache Beam :: SDKs :: Java :: IO :: Common ........ SUCCESS [  5.993 s]
2017-05-17T17:56:51.883 [INFO] Apache Beam :: Runners ............................. SUCCESS [  2.235 s]
2017-05-17T17:56:51.883 [INFO] Apache Beam :: Runners :: Core Construction Java ... SUCCESS [ 27.300 s]
2017-05-17T17:56:51.883 [INFO] Apache Beam :: Runners :: Core Java ................ SUCCESS [01:01 min]
2017-05-17T17:56:51.883 [INFO] Apache Beam :: Runners :: Direct Java .............. SUCCESS [03:25 min]
2017-05-17T17:56:51.883 [INFO] Apache Beam :: SDKs :: Java :: IO :: Elasticsearch . SUCCESS [ 57.906 s]
2017-05-17T17:56:51.883 [INFO] Apache Beam :: SDKs :: Java :: Extensions .......... SUCCESS [  2.645 s]
2017-05-17T17:56:51.883 [INFO] Apache Beam :: SDKs :: Java :: Extensions :: Google Cloud Platform Core SUCCESS [ 34.668 s]
2017-05-17T17:56:51.883 [INFO] Apache Beam :: SDKs :: Java :: Extensions :: Protobuf SUCCESS [ 20.634 s]
2017-05-17T17:56:51.883 [INFO] Apache Beam :: SDKs :: Java :: IO :: Google Cloud Platform FAILURE [  4.549 s]
2017-05-17T17:56:51.883 [INFO] Apache Beam :: SDKs :: Java :: IO :: Hadoop Common . SKIPPED
2017-05-17T17:56:51.883 [INFO] Apache Beam :: SDKs :: Java :: IO :: Hadoop File System SKIPPED
2017-05-17T17:56:51.883 [INFO] Apache Beam :: SDKs :: Java :: IO :: Hadoop ........ SKIPPED
2017-05-17T17:56:51.883 [INFO] Apache Beam :: SDKs :: Java :: IO :: Hadoop :: input-format SKIPPED
2017-05-17T17:56:51.883 [INFO] Apache Beam :: Runners :: Google Cloud Dataflow .... SKIPPED
2017-05-17T17:56:51.883 [INFO] Apache Beam :: SDKs :: Java :: IO :: Hadoop :: jdk1.8-tests SKIPPED
2017-05-17T17:56:51.883 [INFO] Apache Beam :: SDKs :: Java :: IO :: HBase ......... SKIPPED
2017-05-17T17:56:51.883 [INFO] Apache Beam :: SDKs :: Java :: IO :: JDBC .......... SKIPPED
2017-05-17T17:56:51.883 [INFO] Apache Beam :: SDKs :: Java :: IO :: JMS ........... SKIPPED
2017-05-17T17:56:51.883 [INFO] Apache Beam :: SDKs :: Java :: IO :: Kafka ......... SKIPPED
2017-05-17T17:56:51.883 [INFO] Apache Beam :: SDKs :: Java :: IO :: Kinesis ....... SKIPPED
2017-05-17T17:56:51.883 [INFO] Apache Beam :: SDKs :: Java :: IO :: MongoDB ....... SKIPPED
2017-05-17T17:56:51.883 [INFO] Apache Beam :: SDKs :: Java :: IO :: MQTT .......... SKIPPED
2017-05-17T17:56:51.883 [INFO] Apache Beam :: SDKs :: Java :: IO :: XML ........... SKIPPED
2017-05-17T17:56:51.883 [INFO] Apache Beam :: SDKs :: Java :: Maven Archetypes .... SKIPPED
2017-05-17T17:56:51.883 [INFO] Apache Beam :: SDKs :: Java :: Maven Archetypes :: Starter SKIPPED
2017-05-17T17:56:51.883 [INFO] Apache Beam :: Examples ............................ SKIPPED
2017-05-17T17:56:51.883 [INFO] Apache Beam :: Examples :: Java .................... SKIPPED
2017-05-17T17:56:51.883 [INFO] Apache Beam :: SDKs :: Java :: Maven Archetypes :: Examples SKIPPED
2017-05-17T17:56:51.883 [INFO] Apache Beam :: Examples :: Java 8 .................. SKIPPED
2017-05-17T17:56:51.883 [INFO] Apache Beam :: SDKs :: Java :: Maven Archetypes :: Examples - Java 8 SKIPPED
2017-05-17T17:56:51.883 [INFO] Apache Beam :: SDKs :: Java :: Extensions :: Jackson SKIPPED
2017-05-17T17:56:51.883 [INFO] Apache Beam :: SDKs :: Java :: Extensions :: Join library SKIPPED
2017-05-17T17:56:51.883 [INFO] Apache Beam :: SDKs :: Java :: Extensions :: Sorter  SKIPPED
2017-05-17T17:56:51.883 [INFO] Apache Beam :: SDKs :: Java :: Harness ............. SKIPPED
2017-05-17T17:56:51.883 [INFO] Apache Beam :: SDKs :: Java :: Java 8 Tests ........ SKIPPED
2017-05-17T17:56:51.883 [INFO] Apache Beam :: SDKs :: Python ...................... SKIPPED
2017-05-17T17:56:51.883 [INFO] Apache Beam :: Runners :: Flink .................... SKIPPED
2017-05-17T17:56:51.883 [INFO] Apache Beam :: Runners :: Spark .................... SKIPPED
2017-05-17T17:56:51.883 [INFO] Apache Beam :: Runners :: Apex ..................... SKIPPED
2017-05-17T17:56:51.883 [INFO] Apache Beam :: SDKs :: Java :: Aggregated Javadoc .. SKIPPED
2017-05-17T17:56:51.883 [INFO] ------------------------------------------------------------------------
2017-05-17T17:56:51.883 [INFO] BUILD FAILURE
2017-05-17T17:56:51.883 [INFO] ------------------------------------------------------------------------
2017-05-17T17:56:51.883 [INFO] Total time: 11:36 min
2017-05-17T17:56:51.884 [INFO] Finished at: 2017-05-17T17:56:51+00:00
2017-05-17T17:56:52.621 [INFO] Final Memory: 143M/1631M
2017-05-17T17:56:52.621 [INFO] ------------------------------------------------------------------------
Waiting for Jenkins to finish collecting data
2017-05-17T17:57:47.572 [ERROR] Failed to execute goal on project beam-sdks-java-io-google-cloud-platform: Could not resolve dependencies for project org.apache.beam:beam-sdks-java-io-google-cloud-platform:jar:2.1.0-SNAPSHOT: Failed to collect dependencies at com.google.apis:google-api-services-bigquery:jar:v2-rev295-1.22.0: Failed to read artifact descriptor for com.google.apis:google-api-services-bigquery:jar:v2-rev295-1.22.0: Could not transfer artifact com.google.apis:google-api-services-bigquery:pom:v2-rev295-1.22.0 from/to central (https://repo.maven.apache.org/maven2): Connection reset -> [Help 1]
org.apache.maven.lifecycle.LifecycleExecutionException: Failed to execute goal on project beam-sdks-java-io-google-cloud-platform: Could not resolve dependencies for project org.apache.beam:beam-sdks-java-io-google-cloud-platform:jar:2.1.0-SNAPSHOT: Failed to collect dependencies at com.google.apis:google-api-services-bigquery:jar:v2-rev295-1.22.0
	at org.apache.maven.lifecycle.internal.LifecycleDependencyResolver.getDependencies(LifecycleDependencyResolver.java:221)
	at org.apache.maven.lifecycle.internal.LifecycleDependencyResolver.resolveProjectDependencies(LifecycleDependencyResolver.java:127)
	at org.apache.maven.lifecycle.internal.MojoExecutor.ensureDependenciesAreResolved(MojoExecutor.java:257)
	at org.apache.maven.lifecycle.internal.MojoExecutor.execute(MojoExecutor.java:200)
	at org.apache.maven.lifecycle.internal.MojoExecutor.execute(MojoExecutor.java:153)
	at org.apache.maven.lifecycle.internal.MojoExecutor.execute(MojoExecutor.java:145)
	at org.apache.maven.lifecycle.internal.LifecycleModuleBuilder.buildProject(LifecycleModuleBuilder.java:116)
	at org.apache.maven.lifecycle.internal.LifecycleModuleBuilder.buildProject(LifecycleModuleBuilder.java:80)
	at org.apache.maven.lifecycle.internal.builder.singlethreaded.SingleThreadedBuilder.build(SingleThreadedBuilder.java:51)
	at org.apache.maven.lifecycle.internal.LifecycleStarter.execute(LifecycleStarter.java:128)
	at org.apache.maven.DefaultMaven.doExecute(DefaultMaven.java:307)
	at org.apache.maven.DefaultMaven.doExecute(DefaultMaven.java:193)
	at org.apache.maven.DefaultMaven.execute(DefaultMaven.java:106)
	at org.jvnet.hudson.maven3.launcher.Maven33Launcher.main(Maven33Launcher.java:129)
	at sun.reflect.NativeMethodAccessorImpl.invoke0(Native Method)
	at sun.reflect.NativeMethodAccessorImpl.invoke(NativeMethodAccessorImpl.java:62)
	at sun.reflect.DelegatingMethodAccessorImpl.invoke(DelegatingMethodAccessorImpl.java:43)
	at java.lang.reflect.Method.invoke(Method.java:498)
	at org.codehaus.plexus.classworlds.launcher.Launcher.launchStandard(Launcher.java:330)
	at org.codehaus.plexus.classworlds.launcher.Launcher.launch(Launcher.java:238)
	at jenkins.maven3.agent.Maven33Main.launch(Maven33Main.java:176)
	at sun.reflect.NativeMethodAccessorImpl.invoke0(Native Method)
	at sun.reflect.NativeMethodAccessorImpl.invoke(NativeMethodAccessorImpl.java:62)
	at sun.reflect.DelegatingMethodAccessorImpl.invoke(DelegatingMethodAccessorImpl.java:43)
	at java.lang.reflect.Method.invoke(Method.java:498)
	at hudson.maven.Maven3Builder.call(Maven3Builder.java:139)
	at hudson.maven.Maven3Builder.call(Maven3Builder.java:70)
	at hudson.remoting.UserRequest.perform(UserRequest.java:153)
	at hudson.remoting.UserRequest.perform(UserRequest.java:50)
	at hudson.remoting.Request$2.run(Request.java:336)
	at hudson.remoting.InterceptingExecutorService$1.call(InterceptingExecutorService.java:68)
	at java.util.concurrent.FutureTask.run(FutureTask.java:266)
	at java.util.concurrent.ThreadPoolExecutor.runWorker(ThreadPoolExecutor.java:1142)
	at java.util.concurrent.ThreadPoolExecutor$Worker.run(ThreadPoolExecutor.java:617)
	at java.lang.Thread.run(Thread.java:745)
Caused by: org.apache.maven.project.DependencyResolutionException: Could not resolve dependencies for project org.apache.beam:beam-sdks-java-io-google-cloud-platform:jar:2.1.0-SNAPSHOT: Failed to collect dependencies at com.google.apis:google-api-services-bigquery:jar:v2-rev295-1.22.0
	at org.apache.maven.project.DefaultProjectDependenciesResolver.resolve(DefaultProjectDependenciesResolver.java:180)
	at org.apache.maven.lifecycle.internal.LifecycleDependencyResolver.getDependencies(LifecycleDependencyResolver.java:195)
	... 34 more
Caused by: org.eclipse.aether.collection.DependencyCollectionException: Failed to collect dependencies at com.google.apis:google-api-services-bigquery:jar:v2-rev295-1.22.0
	at org.eclipse.aether.internal.impl.DefaultDependencyCollector.collectDependencies(DefaultDependencyCollector.java:291)
	at org.eclipse.aether.internal.impl.DefaultRepositorySystem.collectDependencies(DefaultRepositorySystem.java:316)
	at org.apache.maven.project.DefaultProjectDependenciesResolver.resolve(DefaultProjectDependenciesResolver.java:172)
	... 35 more
Caused by: org.eclipse.aether.resolution.ArtifactDescriptorException: Failed to read artifact descriptor for com.google.apis:google-api-services-bigquery:jar:v2-rev295-1.22.0
	at org.apache.maven.repository.internal.DefaultArtifactDescriptorReader.loadPom(DefaultArtifactDescriptorReader.java:302)
	at org.apache.maven.repository.internal.DefaultArtifactDescriptorReader.readArtifactDescriptor(DefaultArtifactDescriptorReader.java:218)
	at org.eclipse.aether.internal.impl.DefaultDependencyCollector.resolveCachedArtifactDescriptor(DefaultDependencyCollector.java:535)
	at org.eclipse.aether.internal.impl.DefaultDependencyCollector.getArtifactDescriptorResult(DefaultDependencyCollector.java:519)
	at org.eclipse.aether.internal.impl.DefaultDependencyCollector.processDependency(DefaultDependencyCollector.java:409)
	at org.eclipse.aether.internal.impl.DefaultDependencyCollector.processDependency(DefaultDependencyCollector.java:363)
	at org.eclipse.aether.internal.impl.DefaultDependencyCollector.process(DefaultDependencyCollector.java:351)
	at org.eclipse.aether.internal.impl.DefaultDependencyCollector.collectDependencies(DefaultDependencyCollector.java:254)
	... 37 more
Caused by: org.eclipse.aether.resolution.ArtifactResolutionException: Could not transfer artifact com.google.apis:google-api-services-bigquery:pom:v2-rev295-1.22.0 from/to central (https://repo.maven.apache.org/maven2): Connection reset
	at org.eclipse.aether.internal.impl.DefaultArtifactResolver.resolve(DefaultArtifactResolver.java:444)
	at org.eclipse.aether.internal.impl.DefaultArtifactResolver.resolveArtifacts(DefaultArtifactResolver.java:246)
	at org.eclipse.aether.internal.impl.DefaultArtifactResolver.resolveArtifact(DefaultArtifactResolver.java:223)
	at org.apache.maven.repository.internal.DefaultArtifactDescriptorReader.loadPom(DefaultArtifactDescriptorReader.java:287)
	... 44 more
Caused by: org.eclipse.aether.transfer.ArtifactTransferException: Could not transfer artifact com.google.apis:google-api-services-bigquery:pom:v2-rev295-1.22.0 from/to central (https://repo.maven.apache.org/maven2): Connection reset
	at org.eclipse.aether.connector.basic.ArtifactTransportListener.transferFailed(ArtifactTransportListener.java:43)
	at org.eclipse.aether.connector.basic.BasicRepositoryConnector$TaskRunner.run(BasicRepositoryConnector.java:355)
	at org.eclipse.aether.util.concurrency.RunnableErrorForwarder$1.run(RunnableErrorForwarder.java:67)
	at org.eclipse.aether.connector.basic.BasicRepositoryConnector$DirectExecutor.execute(BasicRepositoryConnector.java:581)
	at org.eclipse.aether.connector.basic.BasicRepositoryConnector.get(BasicRepositoryConnector.java:249)
	at org.eclipse.aether.internal.impl.DefaultArtifactResolver.performDownloads(DefaultArtifactResolver.java:520)
	at org.eclipse.aether.internal.impl.DefaultArtifactResolver.resolve(DefaultArtifactResolver.java:421)
	... 47 more
Caused by: org.apache.maven.wagon.TransferFailedException: Connection reset
	at org.apache.maven.wagon.providers.http.AbstractHttpClientWagon.fillInputData(AbstractHttpClientWagon.java:1066)
	at org.apache.maven.wagon.providers.http.AbstractHttpClientWagon.fillInputData(AbstractHttpClientWagon.java:960)
	at org.apache.maven.wagon.StreamWagon.getInputStream(StreamWagon.java:116)
	at org.apache.maven.wagon.StreamWagon.getIfNewer(StreamWagon.java:88)
	at org.apache.maven.wagon.StreamWagon.get(StreamWagon.java:61)
	at org.eclipse.aether.transport.wagon.WagonTransporter$GetTaskRunner.run(WagonTransporter.java:560)
	at org.eclipse.aether.transport.wagon.WagonTransporter.execute(WagonTransporter.java:427)
	at org.eclipse.aether.transport.wagon.WagonTransporter.get(WagonTransporter.java:404)
	at org.eclipse.aether.connector.basic.BasicRepositoryConnector$GetTaskRunner.runTask(BasicRepositoryConnector.java:447)
	at org.eclipse.aether.connector.basic.BasicRepositoryConnector$TaskRunner.run(BasicRepositoryConnector.java:350)
	... 52 more
Caused by: java.net.SocketException: Connection reset
	at java.net.SocketInputStream.read(SocketInputStream.java:210)
	at java.net.SocketInputStream.read(SocketInputStream.java:141)
	at sun.security.ssl.InputRecord.readFully(InputRecord.java:465)
	at sun.security.ssl.InputRecord.read(InputRecord.java:503)
	at sun.security.ssl.SSLSocketImpl.readRecord(SSLSocketImpl.java:973)
	at sun.security.ssl.SSLSocketImpl.readDataRecord(SSLSocketImpl.java:930)
	at sun.security.ssl.AppInputStream.read(AppInputStream.java:105)
	at org.apache.maven.wagon.providers.http.httpclient.impl.io.SessionInputBufferImpl.streamRead(SessionInputBufferImpl.java:136)
	at org.apache.maven.wagon.providers.http.httpclient.impl.io.SessionInputBufferImpl.fillBuffer(SessionInputBufferImpl.java:152)
	at org.apache.maven.wagon.providers.http.httpclient.impl.io.SessionInputBufferImpl.readLine(SessionInputBufferImpl.java:270)
	at org.apache.maven.wagon.providers.http.httpclient.impl.conn.DefaultHttpResponseParser.parseHead(DefaultHttpResponseParser.java:140)
	at org.apache.maven.wagon.providers.http.httpclient.impl.conn.DefaultHttpResponseParser.parseHead(DefaultHttpResponseParser.java:57)
	at org.apache.maven.wagon.providers.http.httpclient.impl.io.AbstractMessageParser.parse(AbstractMessageParser.java:260)
	at org.apache.maven.wagon.providers.http.httpclient.impl.DefaultBHttpClientConnection.receiveResponseHeader(DefaultBHttpClientConnection.java:161)
	at org.apache.maven.wagon.providers.http.httpclient.impl.conn.CPoolProxy.receiveResponseHeader(CPoolProxy.java:153)
	at org.apache.maven.wagon.providers.http.httpclient.protocol.HttpRequestExecutor.doReceiveResponse(HttpRequestExecutor.java:271)
	at org.apache.maven.wagon.providers.http.httpclient.protocol.HttpRequestExecutor.execute(HttpRequestExecutor.java:123)
	at org.apache.maven.wagon.providers.http.httpclient.impl.execchain.MainClientExec.execute(MainClientExec.java:254)
	at org.apache.maven.wagon.providers.http.httpclient.impl.execchain.ProtocolExec.execute(ProtocolExec.java:195)
	at org.apache.maven.wagon.providers.http.httpclient.impl.execchain.RetryExec.execute(RetryExec.java:86)
	at org.apache.maven.wagon.providers.http.httpclient.impl.execchain.RedirectExec.execute(RedirectExec.java:108)
	at org.apache.maven.wagon.providers.http.httpclient.impl.client.InternalHttpClient.doExecute(InternalHttpClient.java:184)
	at org.apache.maven.wagon.providers.http.httpclient.impl.client.CloseableHttpClient.execute(CloseableHttpClient.java:82)
	at org.apache.maven.wagon.providers.http.AbstractHttpClientWagon.execute(AbstractHttpClientWagon.java:832)
	at org.apache.maven.wagon.providers.http.AbstractHttpClientWagon.fillInputData(AbstractHttpClientWagon.java:983)
	... 61 more
2017-05-17T17:57:47.574 [ERROR] 
2017-05-17T17:57:47.574 [ERROR] Re-run Maven using the -X switch to enable full debug logging.
2017-05-17T17:57:47.574 [ERROR] 
2017-05-17T17:57:47.574 [ERROR] For more information about the errors and possible solutions, please read the following articles:
2017-05-17T17:57:47.574 [ERROR] [Help 1] http://cwiki.apache.org/confluence/display/MAVEN/DependencyResolutionException
2017-05-17T17:57:47.575 [ERROR] 
2017-05-17T17:57:47.575 [ERROR] After correcting the problems, you can resume the build with the command
2017-05-17T17:57:47.575 [ERROR]   mvn <goals> -rf :beam-sdks-java-io-google-cloud-platform
channel stopped

Jenkins build is back to normal : beam_PostCommit_Java_MavenInstall #3836

Posted by Apache Jenkins Server <je...@builds.apache.org>.
See <https://builds.apache.org/job/beam_PostCommit_Java_MavenInstall/3836/display/redirect>