You are viewing a plain text version of this content. The canonical link for it is here.
Posted to dev@jmeter.apache.org by Apache Jenkins Server <je...@builds.apache.org> on 2023/12/27 14:23:41 UTC

Build failed in Jenkins: JMeter » JMeter s390x #152

See <https://ci-builds.apache.org/job/JMeter/job/JMeter%20s390x/152/display/redirect?page=changes>

Changes:

[Vladimir Sitnikov] test: add DisabledIfHeadless annotation to selectively disabling tests in headless mode

[Vladimir Sitnikov] test: ensure all Gui elements initialize non-empty TestElement names

[Vladimir Sitnikov] test: remove AssertionGuiSpec as it duplicates existing org.apache.jmeter.junit.JMeterTest

[Vladimir Sitnikov] fix: allow setting empty strings with TestElement.set(...) API, and remove properties only in case the value is null

[Vladimir Sitnikov] fix: add property bindings to reduce code duplication in UI classes and make "configure and modifyTestElement" simple in most cases

[Vladimir Sitnikov] refactor: use property bindings in BeanShellSamplerGui

[Vladimir Sitnikov] refactor: use property bindings in ThreadGroupGui, OpenModelThreadGroupGui

[Vladimir Sitnikov] refactor: use property bindings in TestPlanGui

[Vladimir Sitnikov] test: verify that GuiComponent.configure+modifyTestElement does not modify element after creation


------------------------------------------
[...truncated 215.68 KB...]
+  969648 plot-stem-jvm-4.1.0.jar
- 1297243 rsyntaxtextarea-3.3.3.jar
+ 1297525 rsyntaxtextarea-3.3.4.jar
- 5098540 Saxon-HE-11.5.jar
+ 5104657 Saxon-HE-11.6.jar
-  183438 vis-svg-portable-jvm-3.2.0.jar
-  676840 xmlgraphics-commons-2.8.jar
+  678189 xmlgraphics-commons-2.9.jar
- 1027769 xmlresolver-4.6.4-data.jar
-  157695 xmlresolver-4.6.4.jar
+ 1027769 xmlresolver-5.2.1-data.jar
+  165689 xmlresolver-5.2.1.jar

> Task :src:dist:check
> Task :src:dist-check:compileTestJava
> Task :src:dist-check:copyExtraTestLibs

> Task :src:functions:test
WARNING   8.2sec,  259 completed,   0 failed,   5 skipped, Gradle Test Run :src:functions:test

> Task :src:functions:check

> Task :src:core:test
FAILURE   0.0sec, org.apache.jmeter.util.CalculatorTest > bytesPerSecond()
    org.opentest4j.AssertionFailedError: bytesPerSecond({50bytes, 10ms..40ms}, {70bytes, 40ms..60ms}) ==> expected: <2400.0> but was: <3000.0>
        at app//org.junit.jupiter.api.AssertionFailureBuilder.build(AssertionFailureBuilder.java:151)
        at app//org.junit.jupiter.api.AssertionFailureBuilder.buildAndThrow(AssertionFailureBuilder.java:132)
        at app//org.junit.jupiter.api.AssertEquals.failNotEqual(AssertEquals.java:197)
        at app//org.junit.jupiter.api.AssertEquals.assertEquals(AssertEquals.java:86)
        at app//org.junit.jupiter.api.Assertions.assertEquals(Assertions.java:1024)
        at app//org.apache.jmeter.util.CalculatorTest.bytesPerSecond(CalculatorTest.kt:123)

FAILURE   0.0sec, org.apache.jmeter.util.CalculatorTest > sentBytesPerSecond()
    org.opentest4j.AssertionFailedError: sentBytesPerSecond({sent=50bytes, 10ms..40ms}, {sent=70bytes, 40ms..60ms}) ==> expected: <2400.0> but was: <3000.0>
        at app//org.junit.jupiter.api.AssertionFailureBuilder.build(AssertionFailureBuilder.java:151)
        at app//org.junit.jupiter.api.AssertionFailureBuilder.buildAndThrow(AssertionFailureBuilder.java:132)
        at app//org.junit.jupiter.api.AssertEquals.failNotEqual(AssertEquals.java:197)
        at app//org.junit.jupiter.api.AssertEquals.assertEquals(AssertEquals.java:86)
        at app//org.junit.jupiter.api.Assertions.assertEquals(Assertions.java:1024)
        at app//org.apache.jmeter.util.CalculatorTest.sentBytesPerSecond(CalculatorTest.kt:142)

FAILURE   0.1sec,    8 completed,   2 failed,   0 skipped, org.apache.jmeter.util.CalculatorTest

JMeterTest > testSuccessWhenJmxExists() STANDARD_OUT
    Creating summariser <summary>
    Created the tree successfully using /tmp/testPlan12175000141088270573.jmx
    Starting standalone test @ 2023 Dec 27 14:22:17 UTC (1703686937988)

JMeterTest > testFailureWithMissingPlugin() STANDARD_OUT
    Waiting for possible Shutdown/StopTestNow/HeapDump/ThreadDump message on port 4445
    Error in NonGUIDriver java.lang.IllegalArgumentException: Problem loading XML from:'/tmp/testPlan6661912375671032932.jmx'. 
    Cause:
    CannotResolveClassException: kg.apc.jmeter.samplers.DummySampler

     Detail:com.thoughtworks.xstream.converters.ConversionException: 
    ---- Debugging information ----
    cause-exception     : com.thoughtworks.xstream.converters.ConversionException
    cause-message       : 
    first-jmeter-class  : org.apache.jmeter.save.converters.HashTreeConverter.unmarshal(HashTreeConverter.java:66)
    class               : org.apache.jmeter.save.ScriptWrapper
    required-type       : org.apache.jmeter.save.ScriptWrapper
    converter-type      : org.apache.jmeter.save.ScriptWrapperConverter
    path                : /jmeterTestPlan/hashTree/hashTree/hashTree/kg.apc.jmeter.samplers.DummySampler
    line number         : 16
    version             : not available
    -------------------------------

ArgumentTest > setName(String, String) STANDARD_OUT
    summary =      0 in 00:00:00 = ******/s Avg:     0 Min: 9223372036854775807 Max: -9223372036854775808 Err:     0 (0.00%)
    Tidying up ...    @ 2023 Dec 27 14:22:18 UTC (1703686938237)
    ... end of run

LocalHostTest > testLocalHost() STANDARD_ERROR
    java.rmi.server.hostname=null
    jenkins-s390x-1/148.100.85.246
    isSiteLocalAddress:false
    isAnyLocalAddress:false
    isLinkLocalAddress:false
    isLoopbackAddress:false
    isMulticastAddress:false
    localhost/127.0.0.1
    isSiteLocalAddress:false
    isAnyLocalAddress:false
    isLinkLocalAddress:false
    isLoopbackAddress:true
    isMulticastAddress:false
    ====================
    jenkins-s390x-1/148.100.85.246
    isSiteLocalAddress:false
    isAnyLocalAddress:false
    isLinkLocalAddress:false
    isLoopbackAddress:false
    isMulticastAddress:false

LocalHostTest > testInterfaces() STANDARD_ERROR
    Interfaces: {name:docker0 (docker0) => [/fe80:0:0:0:42:8cff:fecd:6609%docker0/64 [null], /172.17.0.1/16 [/172.17.255.255]], name:enc1000 (enc1000) => [/fe80:0:0:0:c1:21ff:fea5:7cf3%enc1000/64 [null], /2620:91:0:649:c1:21ff:fea5:7cf3%enc1000/64 [null], /148.100.85.246/23 [/148.100.85.255]], name:lo (lo) => [/0:0:0:0:0:0:0:1%lo/128 [null], /127.0.0.1/8 [null]]}
    Choose 172.17.0.1 to talk to external services
    java.rmi.server.hostname=null

> Task :src:protocol:http:compileTestKotlin
w: file:///home/jenkins/jenkins-home/712657a4/workspace/JMeter/JMeter%20s390x/src/protocol/http/src/test/kotlin/org/apache/jmeter/protocol/http/sampler/HttpSamplerPrintDslTest.kt:152:17 Variable 'abc' is never used

> Task :src:components:test
WARNING   3.8sec,    9 completed,   0 failed,   1 skipped, org.apache.jmeter.extractor.json.render.RenderAsJmesPathRendererSpec

> Task :src:protocol:http:compileTestJava

> Task :src:dist-check:batchBUG_62847
WARN StatusConsoleListener The use of package scanning to locate plugins is deprecated and will be removed in a future release
WARN StatusConsoleListener The use of package scanning to locate plugins is deprecated and will be removed in a future release
WARN StatusConsoleListener The use of package scanning to locate plugins is deprecated and will be removed in a future release
WARN StatusConsoleListener The use of package scanning to locate plugins is deprecated and will be removed in a future release
Creating summariser <summary>
Created the tree successfully using <https://ci-builds.apache.org/job/JMeter/job/JMeter%20s390x/ws/bin/testfiles/BUG_62847.jmx>
Starting standalone test @ 2023 Dec 27 14:22:20 UTC (1703686940439)
Waiting for possible Shutdown/StopTestNow/HeapDump/ThreadDump message on port 4446

> Task :src:protocol:http:compileTestGroovy
> Task :src:protocol:http:testClasses
> Task :rat
> Task :check

> Task :src:dist-check:batchBUG_62847
summary =      6 in 00:00:01 =   10.9/s Avg:     0 Min:     0 Max:     3 Err:     0 (0.00%)
Tidying up ...    @ 2023 Dec 27 14:22:21 UTC (1703686941263)
... end of run
No errors present in the logfile <https://ci-builds.apache.org/job/JMeter/job/JMeter%20s390x/ws/bin/BUG_62847.log> (the file is empty)

> Task :src:core:test
          4.1sec,   18 completed,   0 failed,   0 skipped, org.apache.jmeter.samplers.TestSampleResult

SecurityProviderLoaderTest > addInvalidProviderClassTest(String) > [2] java.lang.Object STANDARD_ERROR
    Security Provider 'java.lang.Object' could not be installed. - see the log for more information.

SecurityProviderLoaderTest > addInvalidProviderClassTest(String) > [3] org.apache.jmeter.util.SecurityProviderLoaderTest.UnknownProvider STANDARD_ERROR
    Security Provider 'org.apache.jmeter.util.SecurityProviderLoaderTest.UnknownProvider' could not be installed. - see the log for more information.
          1.1sec, org.apache.jmeter.threads.openmodel.ThreadsInterruptAtFinishTest > openmodel interrupts sleep()
FAILURE  12.6sec,  378 completed,   2 failed,   3 skipped, Gradle Test Run :src:core:test

378 tests completed, 2 failed, 3 skipped

> Task :src:core:test FAILED

> Task :src:protocol:http:test

Gradle Test Executor 25 STANDARD_OUT
    WARN StatusConsoleListener The use of package scanning to locate plugins is deprecated and will be removed in a future release
    WARN StatusConsoleListener The use of package scanning to locate plugins is deprecated and will be removed in a future release
    WARN StatusConsoleListener The use of package scanning to locate plugins is deprecated and will be removed in a future release
    WARN StatusConsoleListener The use of package scanning to locate plugins is deprecated and will be removed in a future release
    Setting JMeterHome: <https://ci-builds.apache.org/job/JMeter/job/JMeter%20s390x/ws/src/protocol/http/../../../.>
    Initializing Properties: ../../.././bin/jmeter.properties
    JMeterVersion=5.6.3-SNAPSHOT c3457ff
    java.version=17.0.7
    java.vm.name=OpenJDK 64-Bit Server VM
    java.vendor=Eclipse Adoptium
    java.home=/usr/local/asfpackages/java/adoptium-jdk-17.0.7+7
    file.encoding=UTF-8
    default encoding=UTF-8
    user.home=/home/jenkins
    user.dir=<https://ci-builds.apache.org/job/JMeter/job/JMeter%20s390x/ws/src/protocol/http>
    user.language=en
    user.region=null
    user.country=US
    user.variant=
    Locale=en_US
    java.class.version=61.0
    java.awt.headless=true
    os.name=Linux
    os.version=5.4.0-159-generic
    os.arch=s390x

> Task :src:components:test
          2.1sec, org.apache.jmeter.threads.openmodel.OpenModelThreadGroupConfigElementJavaTest > ensure_thread_group_initializes_counter_only_once_for_each_thread()
          2.1sec,    1 completed,   0 failed,   0 skipped, org.apache.jmeter.threads.openmodel.OpenModelThreadGroupConfigElementJavaTest
          2.1sec, org.apache.jmeter.threads.openmodel.OpenModelThreadGroupConfigElementTest > ensure thread group initializes counter only once for each thread()
          2.1sec,    1 completed,   0 failed,   0 skipped, org.apache.jmeter.threads.openmodel.OpenModelThreadGroupConfigElementTest
WARNING  20.0sec,  545 completed,   0 failed,   5 skipped, Gradle Test Run :src:components:test

> Task :src:dist-check:batchBatchTestLocal
WARN StatusConsoleListener The use of package scanning to locate plugins is deprecated and will be removed in a future release
WARN StatusConsoleListener The use of package scanning to locate plugins is deprecated and will be removed in a future release
WARN StatusConsoleListener The use of package scanning to locate plugins is deprecated and will be removed in a future release
WARN StatusConsoleListener The use of package scanning to locate plugins is deprecated and will be removed in a future release
Creating summariser <summary>
Created the tree successfully using <https://ci-builds.apache.org/job/JMeter/job/JMeter%20s390x/ws/bin/testfiles/BatchTestLocal.jmx>
Starting standalone test @ 2023 Dec 27 14:22:24 UTC (1703686944431)
Waiting for possible Shutdown/StopTestNow/HeapDump/ThreadDump message on port 4446
summary +     72 in 00:00:05 =   14.1/s Avg:     3 Min:     1 Max:    17 Err:     8 (11.11%) Active: 1 Started: 2 Finished: 1
WARN StatusConsoleListener The use of package scanning to locate plugins is deprecated and will be removed in a future release
WARN StatusConsoleListener The use of package scanning to locate plugins is deprecated and will be removed in a future release
WARN StatusConsoleListener The use of package scanning to locate plugins is deprecated and will be removed in a future release
WARN StatusConsoleListener The use of package scanning to locate plugins is deprecated and will be removed in a future release
summary +     60 in 00:00:00 =  179.1/s Avg:     4 Min:     0 Max:    33 Err:     8 (13.33%) Active: 0 Started: 1 Finished: 1
summary =    132 in 00:00:05 =   24.2/s Avg:     4 Min:     0 Max:    33 Err:    16 (12.12%)
Tidying up ...    @ 2023 Dec 27 14:22:30 UTC (1703686950340)
... end of run
No errors present in the logfile <https://ci-builds.apache.org/job/JMeter/job/JMeter%20s390x/ws/bin/BatchTestLocal.log> (the file is empty)

> Task :src:protocol:http:test
          6.1sec, org.apache.jmeter.protocol.http.control.DnsManagerTest > badDnsInCustomResolverShouldFailHttpSampler(String, WireMockServer)[1], [1] HttpClient4
WARNING   6.1sec,    2 completed,   0 failed,   1 skipped, org.apache.jmeter.protocol.http.control.DnsManagerTest > badDnsInCustomResolverShouldFailHttpSampler(String, WireMockServer)
WARNING   6.6sec,    2 completed,   0 failed,   1 skipped, org.apache.jmeter.protocol.http.control.DnsManagerTest
          3.0sec, org.apache.jmeter.protocol.http.control.TestCacheManagerUrlConnection > testCacheHttpClientBug51932()
          3.0sec, org.apache.jmeter.protocol.http.control.TestCacheManagerUrlConnection > testExpires()
          3.0sec, org.apache.jmeter.protocol.http.control.TestCacheManagerUrlConnection > testExpiresBug59962()
          3.0sec, org.apache.jmeter.protocol.http.control.TestCacheManagerUrlConnection > testCacheControl()
          5.0sec, org.apache.jmeter.protocol.http.control.TestCacheManagerUrlConnection > testNoCacheControlNoMaxAgeNoExpire()
          3.0sec, org.apache.jmeter.protocol.http.control.TestCacheManagerUrlConnection > testPrivateCacheExpireNoMaxAge()
          5.0sec, org.apache.jmeter.protocol.http.control.TestCacheManagerUrlConnection > testPrivateCacheNoMaxAgeNoExpire()
          3.0sec, org.apache.jmeter.protocol.http.control.TestCacheManagerUrlConnection > testPrivateCache()
         28.1sec,   25 completed,   0 failed,   0 skipped, org.apache.jmeter.protocol.http.control.TestCacheManagerUrlConnection
          3.0sec, org.apache.jmeter.protocol.http.control.TestCacheManagerHC4 > testCacheHttpClientBug51932()
          3.0sec, org.apache.jmeter.protocol.http.control.TestCacheManagerHC4 > testExpires()
          3.0sec, org.apache.jmeter.protocol.http.control.TestCacheManagerHC4 > testExpiresBug59962()
          3.0sec, org.apache.jmeter.protocol.http.control.TestCacheManagerHC4 > testCacheControl()
          4.9sec, org.apache.jmeter.protocol.http.control.TestCacheManagerHC4 > testNoCacheControlNoMaxAgeNoExpire()
          3.0sec, org.apache.jmeter.protocol.http.control.TestCacheManagerHC4 > testPrivateCacheExpireNoMaxAge()
          5.0sec, org.apache.jmeter.protocol.http.control.TestCacheManagerHC4 > testPrivateCacheNoMaxAgeNoExpire()
          3.0sec, org.apache.jmeter.protocol.http.control.TestCacheManagerHC4 > testPrivateCache()
         28.0sec,   26 completed,   0 failed,   0 skipped, org.apache.jmeter.protocol.http.control.TestCacheManagerHC4
          1.1sec, org.apache.jmeter.protocol.http.HttpRequestInterruptTest > http request interrupts(String, WireMockRuntimeInfo)[1], [1] HttpClient4
          1.1sec, org.apache.jmeter.protocol.http.HttpRequestInterruptTest > http request interrupts(String, WireMockRuntimeInfo)[2], [2] HTTPSampler
          2.2sec,    2 completed,   0 failed,   0 skipped, org.apache.jmeter.protocol.http.HttpRequestInterruptTest > http request interrupts(String, WireMockRuntimeInfo)
          2.7sec,    2 completed,   0 failed,   0 skipped, org.apache.jmeter.protocol.http.HttpRequestInterruptTest
WARNING  74.5sec,  800 completed,   0 failed,   1 skipped, Gradle Test Run :src:protocol:http:test
checksum-dependency elapsed time: 2789ms, configurations processed: 69 (add -PchecksumTimingsPrint to print detailed timings)
checksum-dependency elapsed time: 10557ms, configurations processed: 625 (add -PchecksumTimingsPrint to print detailed timings)

FAILURE: Build failed with an exception.

* What went wrong:
Execution failed for task ':src:core:test'.
> There were failing tests. See the report at: file:///home/jenkins/jenkins-home/712657a4/workspace/JMeter/JMeter%20s390x/src/core/build/reports/tests/test/index.html

Deprecated Gradle features were used in this build, making it incompatible with Gradle 9.0.

You can use '--warning-mode all' to show the individual deprecation warnings and determine if they come from your own scripts or plugins.

For more on this, please refer to https://docs.gradle.org/8.5/userguide/command_line_interface.html#sec:command_line_warnings in the Gradle documentation.

BUILD FAILED in 2m 36s
383 actionable tasks: 153 executed, 230 up-to-date

Publishing build scan...
https://ge.apache.org/s/rrzw7dbdu6mtg

Build step 'Invoke Gradle script' changed build result to FAILURE
Build step 'Invoke Gradle script' marked build as failure

Jenkins build is back to normal : JMeter » JMeter s390x #154

Posted by Apache Jenkins Server <je...@builds.apache.org>.
See <https://ci-builds.apache.org/job/JMeter/job/JMeter%20s390x/154/display/redirect?page=changes>


Build failed in Jenkins: JMeter » JMeter s390x #153

Posted by Apache Jenkins Server <je...@builds.apache.org>.
See <https://ci-builds.apache.org/job/JMeter/job/JMeter%20s390x/153/display/redirect?page=changes>

Changes:

[Bruno Demion] Next major release will be for Java 17+

[Vladimir Sitnikov] fix(deps): update org.apache.logging.log4j to v2.22.1


------------------------------------------
[...truncated 205.49 KB...]
    WARN StatusConsoleListener The use of package scanning to locate plugins is deprecated and will be removed in a future release
    WARN StatusConsoleListener The use of package scanning to locate plugins is deprecated and will be removed in a future release
          2.6sec,    2 completed,   0 failed,   0 skipped, Gradle Test Run :src:protocol:mail:test

> Task :src:protocol:jdbc:check
> Task :src:protocol:mail:check

> Task :src:functions:test

Gradle Test Executor 14 STANDARD_OUT
    WARN StatusConsoleListener The use of package scanning to locate plugins is deprecated and will be removed in a future release
    WARN StatusConsoleListener The use of package scanning to locate plugins is deprecated and will be removed in a future release
    WARN StatusConsoleListener The use of package scanning to locate plugins is deprecated and will be removed in a future release
    WARN StatusConsoleListener The use of package scanning to locate plugins is deprecated and will be removed in a future release
    Setting JMeterHome: <https://ci-builds.apache.org/job/JMeter/job/JMeter%20s390x/ws/src/functions/../../.>
    Initializing Properties: ../.././bin/jmeter.properties
    JMeterVersion=5.6.3-SNAPSHOT c7a41e0
    java.version=17.0.7
    java.vm.name=OpenJDK 64-Bit Server VM
    java.vendor=Eclipse Adoptium
    java.home=/usr/local/asfpackages/java/adoptium-jdk-17.0.7+7
    file.encoding=UTF-8
    default encoding=UTF-8
    user.home=/home/jenkins
    user.dir=<https://ci-builds.apache.org/job/JMeter/job/JMeter%20s390x/ws/src/functions>
    user.language=en
    user.region=null
    user.country=US
    user.variant=
    Locale=en_US
    java.class.version=61.0
    java.awt.headless=true
    os.name=Linux
    os.version=5.4.0-159-generic
    os.arch=s390x

> Task :src:protocol:mongodb:compileTestJava
> Task :src:protocol:mongodb:testClasses

> Task :src:protocol:ldap:test

PackageTest > testLDAPArgumentCreation() STANDARD_OUT
    WARN StatusConsoleListener The use of package scanning to locate plugins is deprecated and will be removed in a future release
    WARN StatusConsoleListener The use of package scanning to locate plugins is deprecated and will be removed in a future release
    WARN StatusConsoleListener The use of package scanning to locate plugins is deprecated and will be removed in a future release
    WARN StatusConsoleListener The use of package scanning to locate plugins is deprecated and will be removed in a future release
          1.1sec, org.apache.jmeter.protocol.ldap.config.gui.PackageTest > testLDAPArgumentCreation()
          3.0sec,    2 completed,   0 failed,   0 skipped, Gradle Test Run :src:protocol:ldap:test

> Task :src:protocol:ldap:check

> Task :src:dist-check:batchBUG_62847
WARN StatusConsoleListener The use of package scanning to locate plugins is deprecated and will be removed in a future release
WARN StatusConsoleListener The use of package scanning to locate plugins is deprecated and will be removed in a future release
WARN StatusConsoleListener The use of package scanning to locate plugins is deprecated and will be removed in a future release
WARN StatusConsoleListener The use of package scanning to locate plugins is deprecated and will be removed in a future release
Creating summariser <summary>
Created the tree successfully using <https://ci-builds.apache.org/job/JMeter/job/JMeter%20s390x/ws/bin/testfiles/BUG_62847.jmx>
Starting standalone test @ 2023 Dec 27 15:21:53 UTC (1703690513705)
Waiting for possible Shutdown/StopTestNow/HeapDump/ThreadDump message on port 4446
summary =      6 in 00:00:00 =   16.2/s Avg:     1 Min:     0 Max:     6 Err:     0 (0.00%)
Tidying up ...    @ 2023 Dec 27 15:21:54 UTC (1703690514231)
... end of run

> Task :src:protocol:native:compileTestJava
> Task :src:protocol:native:testClasses

> Task :src:components:test

Gradle Test Executor 17 STANDARD_OUT
    WARN StatusConsoleListener The use of package scanning to locate plugins is deprecated and will be removed in a future release
    WARN StatusConsoleListener The use of package scanning to locate plugins is deprecated and will be removed in a future release
    WARN StatusConsoleListener The use of package scanning to locate plugins is deprecated and will be removed in a future release
    WARN StatusConsoleListener The use of package scanning to locate plugins is deprecated and will be removed in a future release
    Setting JMeterHome: <https://ci-builds.apache.org/job/JMeter/job/JMeter%20s390x/ws/src/components/../../.>
    Initializing Properties: ../.././bin/jmeter.properties
    JMeterVersion=5.6.3-SNAPSHOT c7a41e0
    java.version=17.0.7
    java.vm.name=OpenJDK 64-Bit Server VM
    java.vendor=Eclipse Adoptium
    java.home=/usr/local/asfpackages/java/adoptium-jdk-17.0.7+7
    file.encoding=UTF-8
    default encoding=UTF-8
    user.home=/home/jenkins
    user.dir=<https://ci-builds.apache.org/job/JMeter/job/JMeter%20s390x/ws/src/components>
    user.language=en
    user.region=null
    user.country=US
    user.variant=
    Locale=en_US
    java.class.version=61.0
    java.awt.headless=true
    os.name=Linux
    os.version=5.4.0-159-generic
    os.arch=s390x

> Task :rat
> Task :check
> Task :src:protocol:tcp:compileTestJava
> Task :src:protocol:tcp:testClasses
> Task :src:protocol:mongodb:test
> Task :src:protocol:mongodb:check

> Task :src:dist-check:batchBUG_62847
No errors present in the logfile <https://ci-builds.apache.org/job/JMeter/job/JMeter%20s390x/ws/bin/BUG_62847.log> (the file is empty)

> Task :src:protocol:native:test
> Task :src:protocol:native:check

> Task :src:protocol:http:test

Gradle Test Executor 19 STANDARD_OUT
    WARN StatusConsoleListener The use of package scanning to locate plugins is deprecated and will be removed in a future release
    WARN StatusConsoleListener The use of package scanning to locate plugins is deprecated and will be removed in a future release
    WARN StatusConsoleListener The use of package scanning to locate plugins is deprecated and will be removed in a future release
    WARN StatusConsoleListener The use of package scanning to locate plugins is deprecated and will be removed in a future release
    Setting JMeterHome: <https://ci-builds.apache.org/job/JMeter/job/JMeter%20s390x/ws/src/protocol/http/../../../.>
    Initializing Properties: ../../.././bin/jmeter.properties
    JMeterVersion=5.6.3-SNAPSHOT c7a41e0
    java.version=17.0.7
    java.vm.name=OpenJDK 64-Bit Server VM
    java.vendor=Eclipse Adoptium
    java.home=/usr/local/asfpackages/java/adoptium-jdk-17.0.7+7
    file.encoding=UTF-8
    default encoding=UTF-8
    user.home=/home/jenkins
    user.dir=<https://ci-builds.apache.org/job/JMeter/job/JMeter%20s390x/ws/src/protocol/http>
    user.language=en
    user.region=null
    user.country=US
    user.variant=
    Locale=en_US
    java.class.version=61.0
    java.awt.headless=true
    os.name=Linux
    os.version=5.4.0-159-generic
    os.arch=s390x

> Task :src:protocol:tcp:test

BinaryTCPClientImplTest > testLoopBack() STANDARD_OUT
    WARN StatusConsoleListener The use of package scanning to locate plugins is deprecated and will be removed in a future release
    WARN StatusConsoleListener The use of package scanning to locate plugins is deprecated and will be removed in a future release
    WARN StatusConsoleListener The use of package scanning to locate plugins is deprecated and will be removed in a future release
    WARN StatusConsoleListener The use of package scanning to locate plugins is deprecated and will be removed in a future release

> Task :src:protocol:tcp:check

> Task :src:functions:test
WARNING   6.8sec,  259 completed,   0 failed,   5 skipped, Gradle Test Run :src:functions:test

> Task :src:functions:check

> Task :src:dist-check:batchBatchTestLocal
WARN StatusConsoleListener The use of package scanning to locate plugins is deprecated and will be removed in a future release
WARN StatusConsoleListener The use of package scanning to locate plugins is deprecated and will be removed in a future release
WARN StatusConsoleListener The use of package scanning to locate plugins is deprecated and will be removed in a future release
WARN StatusConsoleListener The use of package scanning to locate plugins is deprecated and will be removed in a future release
Creating summariser <summary>
Created the tree successfully using <https://ci-builds.apache.org/job/JMeter/job/JMeter%20s390x/ws/bin/testfiles/BatchTestLocal.jmx>
Starting standalone test @ 2023 Dec 27 15:21:57 UTC (1703690517144)
Waiting for possible Shutdown/StopTestNow/HeapDump/ThreadDump message on port 4446

> Task :src:core:test FAILED
          3.8sec,   18 completed,   0 failed,   0 skipped, org.apache.jmeter.samplers.TestSampleResult

SecurityProviderLoaderTest > addInvalidProviderClassTest(String) > [2] java.lang.Object STANDARD_ERROR
    Security Provider 'java.lang.Object' could not be installed. - see the log for more information.

SecurityProviderLoaderTest > addInvalidProviderClassTest(String) > [3] org.apache.jmeter.util.SecurityProviderLoaderTest.UnknownProvider STANDARD_ERROR
    Security Provider 'org.apache.jmeter.util.SecurityProviderLoaderTest.UnknownProvider' could not be installed. - see the log for more information.
          1.1sec, org.apache.jmeter.threads.openmodel.ThreadsInterruptAtFinishTest > openmodel interrupts sleep()
FAILURE  12.2sec,  378 completed,   2 failed,   3 skipped, Gradle Test Run :src:core:test

378 tests completed, 2 failed, 3 skipped

> Task :src:components:test
          2.1sec, org.apache.jmeter.threads.openmodel.OpenModelThreadGroupConfigElementJavaTest > ensure_thread_group_initializes_counter_only_once_for_each_thread()
          2.1sec,    1 completed,   0 failed,   0 skipped, org.apache.jmeter.threads.openmodel.OpenModelThreadGroupConfigElementJavaTest

> Task :src:dist-check:batchBatchTestLocal
summary +     55 in 00:00:05 =   10.9/s Avg:     4 Min:     1 Max:     9 Err:     8 (14.55%) Active: 1 Started: 2 Finished: 1
WARN StatusConsoleListener The use of package scanning to locate plugins is deprecated and will be removed in a future release
WARN StatusConsoleListener The use of package scanning to locate plugins is deprecated and will be removed in a future release
WARN StatusConsoleListener The use of package scanning to locate plugins is deprecated and will be removed in a future release
WARN StatusConsoleListener The use of package scanning to locate plugins is deprecated and will be removed in a future release
summary +     77 in 00:00:00 =  192.5/s Avg:     4 Min:     0 Max:    24 Err:     8 (10.39%) Active: 0 Started: 1 Finished: 1
summary =    132 in 00:00:05 =   24.2/s Avg:     4 Min:     0 Max:    24 Err:    16 (12.12%)
Tidying up ...    @ 2023 Dec 27 15:22:02 UTC (1703690522832)
... end of run
No errors present in the logfile <https://ci-builds.apache.org/job/JMeter/job/JMeter%20s390x/ws/bin/BatchTestLocal.log> (the file is empty)

> Task :src:protocol:http:test
          6.1sec, org.apache.jmeter.protocol.http.control.DnsManagerTest > badDnsInCustomResolverShouldFailHttpSampler(String, WireMockServer)[1], [1] HttpClient4
WARNING   6.1sec,    2 completed,   0 failed,   1 skipped, org.apache.jmeter.protocol.http.control.DnsManagerTest > badDnsInCustomResolverShouldFailHttpSampler(String, WireMockServer)
WARNING   6.5sec,    2 completed,   0 failed,   1 skipped, org.apache.jmeter.protocol.http.control.DnsManagerTest

> Task :src:components:test
          2.1sec, org.apache.jmeter.threads.openmodel.OpenModelThreadGroupConfigElementTest > ensure thread group initializes counter only once for each thread()
          2.1sec,    1 completed,   0 failed,   0 skipped, org.apache.jmeter.threads.openmodel.OpenModelThreadGroupConfigElementTest
WARNING  13.8sec,  545 completed,   0 failed,   5 skipped, Gradle Test Run :src:components:test

> Task :src:protocol:http:test
          2.1sec, org.apache.jmeter.protocol.http.control.TestCacheManagerHC4 > testCacheHttpClientBug51932()
          3.0sec, org.apache.jmeter.protocol.http.control.TestCacheManagerHC4 > testExpires()
          2.9sec, org.apache.jmeter.protocol.http.control.TestCacheManagerHC4 > testExpiresBug59962()
          3.0sec, org.apache.jmeter.protocol.http.control.TestCacheManagerHC4 > testCacheControl()
          5.0sec, org.apache.jmeter.protocol.http.control.TestCacheManagerHC4 > testNoCacheControlNoMaxAgeNoExpire()
          3.0sec, org.apache.jmeter.protocol.http.control.TestCacheManagerHC4 > testPrivateCacheExpireNoMaxAge()
          5.0sec, org.apache.jmeter.protocol.http.control.TestCacheManagerHC4 > testPrivateCacheNoMaxAgeNoExpire()
          3.0sec, org.apache.jmeter.protocol.http.control.TestCacheManagerHC4 > testPrivateCache()
         27.1sec,   26 completed,   0 failed,   0 skipped, org.apache.jmeter.protocol.http.control.TestCacheManagerHC4
          3.0sec, org.apache.jmeter.protocol.http.control.TestCacheManagerUrlConnection > testCacheHttpClientBug51932()
          3.0sec, org.apache.jmeter.protocol.http.control.TestCacheManagerUrlConnection > testExpires()
          3.0sec, org.apache.jmeter.protocol.http.control.TestCacheManagerUrlConnection > testExpiresBug59962()
          3.0sec, org.apache.jmeter.protocol.http.control.TestCacheManagerUrlConnection > testCacheControl()
          5.0sec, org.apache.jmeter.protocol.http.control.TestCacheManagerUrlConnection > testNoCacheControlNoMaxAgeNoExpire()
          3.0sec, org.apache.jmeter.protocol.http.control.TestCacheManagerUrlConnection > testPrivateCacheExpireNoMaxAge()
          5.0sec, org.apache.jmeter.protocol.http.control.TestCacheManagerUrlConnection > testPrivateCacheNoMaxAgeNoExpire()
          2.9sec, org.apache.jmeter.protocol.http.control.TestCacheManagerUrlConnection > testPrivateCache()
         28.0sec,   25 completed,   0 failed,   0 skipped, org.apache.jmeter.protocol.http.control.TestCacheManagerUrlConnection
          1.1sec, org.apache.jmeter.protocol.http.HttpRequestInterruptTest > http request interrupts(String, WireMockRuntimeInfo)[1], [1] HttpClient4
          1.1sec, org.apache.jmeter.protocol.http.HttpRequestInterruptTest > http request interrupts(String, WireMockRuntimeInfo)[2], [2] HTTPSampler
          2.2sec,    2 completed,   0 failed,   0 skipped, org.apache.jmeter.protocol.http.HttpRequestInterruptTest > http request interrupts(String, WireMockRuntimeInfo)
          2.7sec,    2 completed,   0 failed,   0 skipped, org.apache.jmeter.protocol.http.HttpRequestInterruptTest
WARNING  73.4sec,  800 completed,   0 failed,   1 skipped, Gradle Test Run :src:protocol:http:test
checksum-dependency elapsed time: 1505ms, configurations processed: 69 (add -PchecksumTimingsPrint to print detailed timings)
checksum-dependency elapsed time: 12243ms, configurations processed: 621 (add -PchecksumTimingsPrint to print detailed timings)

FAILURE: Build failed with an exception.

* What went wrong:
Execution failed for task ':src:core:test'.
> There were failing tests. See the report at: file:///home/jenkins/jenkins-home/712657a4/workspace/JMeter/JMeter%20s390x/src/core/build/reports/tests/test/index.html

Deprecated Gradle features were used in this build, making it incompatible with Gradle 9.0.

You can use '--warning-mode all' to show the individual deprecation warnings and determine if they come from your own scripts or plugins.

For more on this, please refer to https://docs.gradle.org/8.5/userguide/command_line_interface.html#sec:command_line_warnings in the Gradle documentation.

BUILD FAILED in 1m 55s
375 actionable tasks: 127 executed, 248 up-to-date

Publishing build scan...
https://ge.apache.org/s/6ps4awlyud5xe

Build step 'Invoke Gradle script' changed build result to FAILURE
Build step 'Invoke Gradle script' marked build as failure