You are viewing a plain text version of this content. The canonical link for it is here.
Posted to builds@beam.apache.org by Apache Jenkins Server <je...@builds.apache.org> on 2019/09/05 01:23:08 UTC
Build failed in Jenkins: beam_PostCommit_Python2 #388
See <https://builds.apache.org/job/beam_PostCommit_Python2/388/display/redirect>
------------------------------------------
[...truncated 783.63 KB...]
],
"is_pair_like": true,
"pipeline_proto_coder_id": "ref_Coder_FastPrimitivesCoder_3"
},
{
"@type": "kind:global_window"
}
],
"is_wrapper": true
},
"output_name": "out",
"user_name": "add_attribute.out"
}
],
"parallel_input": {
"@type": "OutputReference",
"output_name": "out",
"step_name": "s2"
},
"serialized_fn": "ref_AppliedPTransform_add_attribute_5",
"user_name": "add_attribute"
}
},
{
"kind": "ParallelDo",
"name": "s4",
"properties": {
"display_data": [
{
"key": "fn",
"label": "Transform Function",
"namespace": "apache_beam.transforms.core.CallableWrapperDoFn",
"type": "STRING",
"value": "to_proto_str"
},
{
"key": "fn",
"label": "Transform Function",
"namespace": "apache_beam.transforms.core.ParDo",
"shortValue": "CallableWrapperDoFn",
"type": "STRING",
"value": "apache_beam.transforms.core.CallableWrapperDoFn"
}
],
"non_parallel_inputs": {},
"output_info": [
{
"encoding": {
"@type": "kind:windowed_value",
"component_encodings": [
{
"@type": "kind:bytes"
},
{
"@type": "kind:global_window"
}
],
"is_wrapper": true
},
"output_name": "out",
"user_name": "WriteToPubSub/ToProtobuf.out"
}
],
"parallel_input": {
"@type": "OutputReference",
"output_name": "out",
"step_name": "s3"
},
"serialized_fn": "ref_AppliedPTransform_WriteToPubSub/ToProtobuf_7",
"user_name": "WriteToPubSub/ToProtobuf"
}
},
{
"kind": "ParallelWrite",
"name": "s5",
"properties": {
"display_data": [],
"encoding": {
"@type": "kind:windowed_value",
"component_encodings": [
{
"@type": "kind:bytes"
},
{
"@type": "kind:global_window"
}
],
"is_wrapper": true
},
"format": "pubsub",
"parallel_input": {
"@type": "OutputReference",
"output_name": "out",
"step_name": "s4"
},
"pubsub_id_label": "id",
"pubsub_serialized_attributes_fn": "",
"pubsub_timestamp_label": "timestamp",
"pubsub_topic": "projects/apache-beam-testing/topics/psit_topic_output6b591cef-0c04-4202-a9f1-101931d91752",
"user_name": "WriteToPubSub/Write/NativeWrite"
}
}
],
"type": "JOB_TYPE_STREAMING"
}
root: INFO: Create job: <Job
createTime: u'2019-09-05T00:51:25.319750Z'
currentStateTime: u'1970-01-01T00:00:00Z'
id: u'2019-09-04_17_51_24-8784866042576783301'
location: u'us-central1'
name: u'beamapp-jenkins-0905005115-180293'
projectId: u'apache-beam-testing'
stageStates: []
startTime: u'2019-09-05T00:51:25.319750Z'
steps: []
tempFiles: []
type: TypeValueValuesEnum(JOB_TYPE_STREAMING, 2)>
root: INFO: Created job with id: [2019-09-04_17_51_24-8784866042576783301]
root: INFO: To access the Dataflow monitoring console, please navigate to https://console.cloud.google.com/dataflow/jobsDetail/locations/us-central1/jobs/2019-09-04_17_51_24-8784866042576783301?project=apache-beam-testing
root: INFO: Job 2019-09-04_17_51_24-8784866042576783301 is in state JOB_STATE_RUNNING
root: INFO: 2019-09-05T00:51:27.852Z: JOB_MESSAGE_DETAILED: Checking permissions granted to controller Service Account.
root: INFO: 2019-09-05T00:51:28.683Z: JOB_MESSAGE_BASIC: Worker configuration: n1-standard-4 in us-central1-a.
root: INFO: 2019-09-05T00:51:30.472Z: JOB_MESSAGE_DETAILED: Expanding SplittableParDo operations into optimizable parts.
root: INFO: 2019-09-05T00:51:30.475Z: JOB_MESSAGE_DETAILED: Expanding CollectionToSingleton operations into optimizable parts.
root: INFO: 2019-09-05T00:51:30.483Z: JOB_MESSAGE_DETAILED: Expanding CoGroupByKey operations into optimizable parts.
root: INFO: 2019-09-05T00:51:30.491Z: JOB_MESSAGE_DETAILED: Expanding SplittableProcessKeyed operations into optimizable parts.
root: INFO: 2019-09-05T00:51:30.493Z: JOB_MESSAGE_DETAILED: Expanding GroupByKey operations into streaming Read/Write steps
root: INFO: 2019-09-05T00:51:30.496Z: JOB_MESSAGE_DEBUG: Annotating graph with Autotuner information.
root: INFO: 2019-09-05T00:51:30.511Z: JOB_MESSAGE_DETAILED: Fusing adjacent ParDo, Read, Write, and Flatten operations
root: INFO: 2019-09-05T00:51:30.513Z: JOB_MESSAGE_DETAILED: Fusing consumer ReadFromPubSub/Map(_from_proto_str) into ReadFromPubSub/Read
root: INFO: 2019-09-05T00:51:30.515Z: JOB_MESSAGE_DETAILED: Fusing consumer add_attribute into ReadFromPubSub/Map(_from_proto_str)
root: INFO: 2019-09-05T00:51:30.517Z: JOB_MESSAGE_DETAILED: Fusing consumer WriteToPubSub/ToProtobuf into add_attribute
root: INFO: 2019-09-05T00:51:30.519Z: JOB_MESSAGE_DETAILED: Fusing consumer WriteToPubSub/Write/NativeWrite into WriteToPubSub/ToProtobuf
root: INFO: 2019-09-05T00:51:30.527Z: JOB_MESSAGE_BASIC: The pubsub read for: projects/apache-beam-testing/subscriptions/psit_subscription_input6b591cef-0c04-4202-a9f1-101931d91752 is configured to compute input data watermarks based on custom timestamp attribute timestamp. Cloud Dataflow has created an additional tracking subscription to do this, which will be cleaned up automatically. For details, see: https://cloud.google.com/dataflow/model/pubsub-io#timestamps-ids
root: INFO: 2019-09-05T00:51:30.530Z: JOB_MESSAGE_DEBUG: Adding StepResource setup and teardown to workflow graph.
root: INFO: 2019-09-05T00:51:30.552Z: JOB_MESSAGE_DEBUG: Adding workflow start and stop steps.
root: INFO: 2019-09-05T00:51:30.564Z: JOB_MESSAGE_DEBUG: Assigning stage ids.
root: INFO: 2019-09-05T00:51:30.712Z: JOB_MESSAGE_DEBUG: Executing wait step start2
root: INFO: 2019-09-05T00:51:30.724Z: JOB_MESSAGE_DEBUG: Starting worker pool setup.
root: INFO: 2019-09-05T00:51:30.729Z: JOB_MESSAGE_BASIC: Starting 1 workers...
root: INFO: 2019-09-05T00:51:32.829Z: JOB_MESSAGE_DETAILED: Pub/Sub resources set up for topic 'projects/apache-beam-testing/topics/psit_topic_input6b591cef-0c04-4202-a9f1-101931d91752'.
root: INFO: 2019-09-05T00:51:34.903Z: JOB_MESSAGE_BASIC: Executing operation ReadFromPubSub/Read+ReadFromPubSub/Map(_from_proto_str)+add_attribute+WriteToPubSub/ToProtobuf+WriteToPubSub/Write/NativeWrite
root: INFO: 2019-09-05T00:52:11.906Z: JOB_MESSAGE_DEBUG: Executing input step topology_init_attach_disk_input_step
root: INFO: 2019-09-05T00:52:12.269Z: JOB_MESSAGE_DETAILED: Checking permissions granted to controller Service Account.
root: INFO: 2019-09-05T00:52:13.071Z: JOB_MESSAGE_BASIC: Worker configuration: n1-standard-4 in us-central1-a.
root: INFO: 2019-09-05T00:52:25.994Z: JOB_MESSAGE_DETAILED: Workers have started successfully.
root: WARNING: Timing out on waiting for job 2019-09-04_17_51_24-8784866042576783301 after 183 seconds
google.auth.transport._http_client: DEBUG: Making request: GET http://169.254.169.254
google.auth.transport._http_client: DEBUG: Making request: GET http://metadata.google.internal/computeMetadata/v1/project/project-id
google.auth.transport.requests: DEBUG: Making request: GET http://metadata.google.internal/computeMetadata/v1/instance/service-accounts/default/?recursive=true
urllib3.connectionpool: DEBUG: Starting new HTTP connection (1): metadata.google.internal:80
urllib3.connectionpool: DEBUG: http://metadata.google.internal:80 "GET /computeMetadata/v1/instance/service-accounts/default/?recursive=true HTTP/1.1" 200 144
google.auth.transport.requests: DEBUG: Making request: GET http://metadata.google.internal/computeMetadata/v1/instance/service-accounts/844138762903-compute@developer.gserviceaccount.com/token
urllib3.connectionpool: DEBUG: http://metadata.google.internal:80 "GET /computeMetadata/v1/instance/service-accounts/844138762903-compute@developer.gserviceaccount.com/token HTTP/1.1" 200 176
--------------------- >> end captured logging << ---------------------
----------------------------------------------------------------------
XML: nosetests-postCommitIT-df.xml
----------------------------------------------------------------------
XML: <https://builds.apache.org/job/beam_PostCommit_Python2/ws/src/sdks/python/nosetests.xml>
----------------------------------------------------------------------
Ran 45 tests in 4078.135s
FAILED (SKIP=4, errors=1)
Worker logs: https://console.cloud.google.com/dataflow/jobsDetail/locations/us-central1/jobs/2019-09-04_17_15_43-6331287720274786043?project=apache-beam-testing
Worker logs: https://console.cloud.google.com/dataflow/jobsDetail/locations/us-central1/jobs/2019-09-04_17_33_15-16858589652080252371?project=apache-beam-testing
Worker logs: https://console.cloud.google.com/dataflow/jobsDetail/locations/us-central1/jobs/2019-09-04_17_41_51-3496751855912371375?project=apache-beam-testing
Worker logs: https://console.cloud.google.com/dataflow/jobsDetail/locations/us-central1/jobs/2019-09-04_17_50_23-13248711123284789635?project=apache-beam-testing
Worker logs: https://console.cloud.google.com/dataflow/jobsDetail/locations/us-central1/jobs/2019-09-04_17_58_24-7352324194048803460?project=apache-beam-testing
Worker logs: https://console.cloud.google.com/dataflow/jobsDetail/locations/us-central1/jobs/2019-09-04_18_06_46-3315675116803895106?project=apache-beam-testing
Worker logs: https://console.cloud.google.com/dataflow/jobsDetail/locations/us-central1/jobs/2019-09-04_18_15_03-15454755974648135916?project=apache-beam-testing
Worker logs: https://console.cloud.google.com/dataflow/jobsDetail/locations/us-central1/jobs/2019-09-04_17_15_50-6632005114307762131?project=apache-beam-testing
Worker logs: https://console.cloud.google.com/dataflow/jobsDetail/locations/us-central1/jobs/2019-09-04_17_32_17-10237507649402500429?project=apache-beam-testing
Worker logs: https://console.cloud.google.com/dataflow/jobsDetail/locations/us-central1/jobs/2019-09-04_17_43_05-15981996346965689987?project=apache-beam-testing
Worker logs: https://console.cloud.google.com/dataflow/jobsDetail/locations/us-central1/jobs/2019-09-04_17_52_35-5007563174705849386?project=apache-beam-testing
Worker logs: https://console.cloud.google.com/dataflow/jobsDetail/locations/us-central1/jobs/2019-09-04_17_15_40-1565724336138427689?project=apache-beam-testing
Worker logs: https://console.cloud.google.com/dataflow/jobsDetail/locations/us-central1/jobs/2019-09-04_17_35_40-4888899148864824329?project=apache-beam-testing
Worker logs: https://console.cloud.google.com/dataflow/jobsDetail/locations/us-central1/jobs/2019-09-04_17_54_54-13934868670282037041?project=apache-beam-testing
Worker logs: https://console.cloud.google.com/dataflow/jobsDetail/locations/us-central1/jobs/2019-09-04_17_15_47-10270242230015627031?project=apache-beam-testing
Worker logs: https://console.cloud.google.com/dataflow/jobsDetail/locations/us-central1/jobs/2019-09-04_17_31_12-2610215578300449015?project=apache-beam-testing
Worker logs: https://console.cloud.google.com/dataflow/jobsDetail/locations/us-central1/jobs/2019-09-04_17_40_06-12642337849870890277?project=apache-beam-testing
Worker logs: https://console.cloud.google.com/dataflow/jobsDetail/locations/us-central1/jobs/2019-09-04_17_47_39-17989183405679412386?project=apache-beam-testing
Worker logs: https://console.cloud.google.com/dataflow/jobsDetail/locations/us-central1/jobs/2019-09-04_17_56_43-8017574778480625974?project=apache-beam-testing
Worker logs: https://console.cloud.google.com/dataflow/jobsDetail/locations/us-central1/jobs/2019-09-04_17_15_42-793378313864167441?project=apache-beam-testing
Worker logs: https://console.cloud.google.com/dataflow/jobsDetail/locations/us-central1/jobs/2019-09-04_17_24_39-6552508922865546401?project=apache-beam-testing
Worker logs: https://console.cloud.google.com/dataflow/jobsDetail/locations/us-central1/jobs/2019-09-04_17_35_29-2356245554028270718?project=apache-beam-testing
Worker logs: https://console.cloud.google.com/dataflow/jobsDetail/locations/us-central1/jobs/2019-09-04_17_44_10-7966716600112368734?project=apache-beam-testing
Worker logs: https://console.cloud.google.com/dataflow/jobsDetail/locations/us-central1/jobs/2019-09-04_17_52_17-4156831367060924680?project=apache-beam-testing
Worker logs: https://console.cloud.google.com/dataflow/jobsDetail/locations/us-central1/jobs/2019-09-04_18_00_44-17216310405887782945?project=apache-beam-testing
Worker logs: https://console.cloud.google.com/dataflow/jobsDetail/locations/us-central1/jobs/2019-09-04_17_15_44-15773144513295055596?project=apache-beam-testing
Worker logs: https://console.cloud.google.com/dataflow/jobsDetail/locations/us-central1/jobs/2019-09-04_17_24_33-8359558779578928356?project=apache-beam-testing
Worker logs: https://console.cloud.google.com/dataflow/jobsDetail/locations/us-central1/jobs/2019-09-04_17_33_46-17764872527564243382?project=apache-beam-testing
Worker logs: https://console.cloud.google.com/dataflow/jobsDetail/locations/us-central1/jobs/2019-09-04_17_42_33-13613369875461940165?project=apache-beam-testing
Worker logs: https://console.cloud.google.com/dataflow/jobsDetail/locations/us-central1/jobs/2019-09-04_17_50_25-11068740058703607731?project=apache-beam-testing
Worker logs: https://console.cloud.google.com/dataflow/jobsDetail/locations/us-central1/jobs/2019-09-04_17_15_47-17850745625017193431?project=apache-beam-testing
Worker logs: https://console.cloud.google.com/dataflow/jobsDetail/locations/us-central1/jobs/2019-09-04_17_24_47-14369103654714877676?project=apache-beam-testing
Worker logs: https://console.cloud.google.com/dataflow/jobsDetail/locations/us-central1/jobs/2019-09-04_17_33_47-5689197639828037191?project=apache-beam-testing
Worker logs: https://console.cloud.google.com/dataflow/jobsDetail/locations/us-central1/jobs/2019-09-04_17_42_32-9341546885350390593?project=apache-beam-testing
Worker logs: https://console.cloud.google.com/dataflow/jobsDetail/locations/us-central1/jobs/2019-09-04_17_51_24-8784866042576783301?project=apache-beam-testing
Worker logs: https://console.cloud.google.com/dataflow/jobsDetail/locations/us-central1/jobs/2019-09-04_17_15_46-2804991893355474235?project=apache-beam-testing
Worker logs: https://console.cloud.google.com/dataflow/jobsDetail/locations/us-central1/jobs/2019-09-04_17_26_43-17075020302551430187?project=apache-beam-testing
Worker logs: https://console.cloud.google.com/dataflow/jobsDetail/locations/us-central1/jobs/2019-09-04_17_36_54-8657309704339962418?project=apache-beam-testing
Worker logs: https://console.cloud.google.com/dataflow/jobsDetail/locations/us-central1/jobs/2019-09-04_17_46_18-6160636633585301299?project=apache-beam-testing
Worker logs: https://console.cloud.google.com/dataflow/jobsDetail/locations/us-central1/jobs/2019-09-04_17_54_53-215529485716812124?project=apache-beam-testing
> Task :sdks:python:test-suites:dataflow:py2:postCommitIT FAILED
FAILURE: Build completed with 2 failures.
1: Task failed with an exception.
-----------
* Where:
Build file '<https://builds.apache.org/job/beam_PostCommit_Python2/ws/src/sdks/python/test-suites/direct/py2/build.gradle'> line: 48
* What went wrong:
Execution failed for task ':sdks:python:test-suites:direct:py2:directRunnerIT'.
> Process 'command 'sh'' finished with non-zero exit value 1
* Try:
Run with --stacktrace option to get the stack trace. Run with --info or --debug option to get more log output. Run with --scan to get full insights.
==============================================================================
2: Task failed with an exception.
-----------
* Where:
Build file '<https://builds.apache.org/job/beam_PostCommit_Python2/ws/src/sdks/python/test-suites/dataflow/py2/build.gradle'> line: 85
* What went wrong:
Execution failed for task ':sdks:python:test-suites:dataflow:py2:postCommitIT'.
> Process 'command 'sh'' finished with non-zero exit value 1
* Try:
Run with --stacktrace option to get the stack trace. Run with --info or --debug option to get more log output. Run with --scan to get full insights.
==============================================================================
* Get more help at https://help.gradle.org
Deprecated Gradle features were used in this build, making it incompatible with Gradle 6.0.
Use '--warning-mode all' to show the individual deprecation warnings.
See https://docs.gradle.org/5.2.1/userguide/command_line_interface.html#sec:command_line_warnings
BUILD FAILED in 1h 12m 23s
111 actionable tasks: 87 executed, 21 from cache, 3 up-to-date
Publishing build scan...
https://gradle.com/s/ydy6v6er5jodw
Build step 'Invoke Gradle script' changed build result to FAILURE
Build step 'Invoke Gradle script' marked build as failure
---------------------------------------------------------------------
To unsubscribe, e-mail: builds-unsubscribe@beam.apache.org
For additional commands, e-mail: builds-help@beam.apache.org
Jenkins build is back to normal : beam_PostCommit_Python2 #389
Posted by Apache Jenkins Server <je...@builds.apache.org>.
See <https://builds.apache.org/job/beam_PostCommit_Python2/389/display/redirect?page=changes>
---------------------------------------------------------------------
To unsubscribe, e-mail: builds-unsubscribe@beam.apache.org
For additional commands, e-mail: builds-help@beam.apache.org