You are viewing a plain text version of this content. The canonical link for it is here.
Posted to dev@lucene.apache.org by Policeman Jenkins Server <je...@thetaphi.de> on 2018/12/23 14:53:39 UTC

[JENKINS] Lucene-Solr-master-Windows (32bit/jdk1.8.0_172) - Build # 7656 - Unstable!

Build: https://jenkins.thetaphi.de/job/Lucene-Solr-master-Windows/7656/
Java: 32bit/jdk1.8.0_172 -client -XX:+UseG1GC

1 tests failed.
FAILED:  org.apache.solr.util.UtilsToolTest.testRelativePath

Error Message:
expected:<14> but was:<16>

Stack Trace:
java.lang.AssertionError: expected:<14> but was:<16>
	at __randomizedtesting.SeedInfo.seed([B535153582498961:41A9720A9DB57850]:0)
	at org.junit.Assert.fail(Assert.java:88)
	at org.junit.Assert.failNotEquals(Assert.java:834)
	at org.junit.Assert.assertEquals(Assert.java:645)
	at org.junit.Assert.assertEquals(Assert.java:631)
	at org.apache.solr.util.UtilsToolTest.testRelativePath(UtilsToolTest.java:124)
	at sun.reflect.NativeMethodAccessorImpl.invoke0(Native Method)
	at sun.reflect.NativeMethodAccessorImpl.invoke(NativeMethodAccessorImpl.java:62)
	at sun.reflect.DelegatingMethodAccessorImpl.invoke(DelegatingMethodAccessorImpl.java:43)
	at java.lang.reflect.Method.invoke(Method.java:498)
	at com.carrotsearch.randomizedtesting.RandomizedRunner.invoke(RandomizedRunner.java:1750)
	at com.carrotsearch.randomizedtesting.RandomizedRunner$8.evaluate(RandomizedRunner.java:938)
	at com.carrotsearch.randomizedtesting.RandomizedRunner$9.evaluate(RandomizedRunner.java:974)
	at com.carrotsearch.randomizedtesting.RandomizedRunner$10.evaluate(RandomizedRunner.java:988)
	at com.carrotsearch.randomizedtesting.rules.SystemPropertiesRestoreRule$1.evaluate(SystemPropertiesRestoreRule.java:57)
	at org.apache.lucene.util.TestRuleSetupTeardownChained$1.evaluate(TestRuleSetupTeardownChained.java:49)
	at org.apache.lucene.util.AbstractBeforeAfterRule$1.evaluate(AbstractBeforeAfterRule.java:45)
	at org.apache.lucene.util.TestRuleThreadAndTestName$1.evaluate(TestRuleThreadAndTestName.java:48)
	at org.apache.lucene.util.TestRuleIgnoreAfterMaxFailures$1.evaluate(TestRuleIgnoreAfterMaxFailures.java:64)
	at org.apache.lucene.util.TestRuleMarkFailure$1.evaluate(TestRuleMarkFailure.java:47)
	at com.carrotsearch.randomizedtesting.rules.StatementAdapter.evaluate(StatementAdapter.java:36)
	at com.carrotsearch.randomizedtesting.ThreadLeakControl$StatementRunner.run(ThreadLeakControl.java:368)
	at com.carrotsearch.randomizedtesting.ThreadLeakControl.forkTimeoutingTask(ThreadLeakControl.java:817)
	at com.carrotsearch.randomizedtesting.ThreadLeakControl$3.evaluate(ThreadLeakControl.java:468)
	at com.carrotsearch.randomizedtesting.RandomizedRunner.runSingleTest(RandomizedRunner.java:947)
	at com.carrotsearch.randomizedtesting.RandomizedRunner$5.evaluate(RandomizedRunner.java:832)
	at com.carrotsearch.randomizedtesting.RandomizedRunner$6.evaluate(RandomizedRunner.java:883)
	at com.carrotsearch.randomizedtesting.RandomizedRunner$7.evaluate(RandomizedRunner.java:894)
	at com.carrotsearch.randomizedtesting.rules.StatementAdapter.evaluate(StatementAdapter.java:36)
	at com.carrotsearch.randomizedtesting.rules.SystemPropertiesRestoreRule$1.evaluate(SystemPropertiesRestoreRule.java:57)
	at org.apache.lucene.util.AbstractBeforeAfterRule$1.evaluate(AbstractBeforeAfterRule.java:45)
	at com.carrotsearch.randomizedtesting.rules.StatementAdapter.evaluate(StatementAdapter.java:36)
	at org.apache.lucene.util.TestRuleStoreClassName$1.evaluate(TestRuleStoreClassName.java:41)
	at com.carrotsearch.randomizedtesting.rules.NoShadowingOrOverridesOnMethodsRule$1.evaluate(NoShadowingOrOverridesOnMethodsRule.java:40)
	at com.carrotsearch.randomizedtesting.rules.NoShadowingOrOverridesOnMethodsRule$1.evaluate(NoShadowingOrOverridesOnMethodsRule.java:40)
	at com.carrotsearch.randomizedtesting.rules.StatementAdapter.evaluate(StatementAdapter.java:36)
	at com.carrotsearch.randomizedtesting.rules.StatementAdapter.evaluate(StatementAdapter.java:36)
	at com.carrotsearch.randomizedtesting.rules.StatementAdapter.evaluate(StatementAdapter.java:36)
	at org.apache.lucene.util.TestRuleAssertionsRequired$1.evaluate(TestRuleAssertionsRequired.java:53)
	at org.apache.lucene.util.TestRuleMarkFailure$1.evaluate(TestRuleMarkFailure.java:47)
	at org.apache.lucene.util.TestRuleIgnoreAfterMaxFailures$1.evaluate(TestRuleIgnoreAfterMaxFailures.java:64)
	at org.apache.lucene.util.TestRuleIgnoreTestSuites$1.evaluate(TestRuleIgnoreTestSuites.java:54)
	at com.carrotsearch.randomizedtesting.rules.StatementAdapter.evaluate(StatementAdapter.java:36)
	at com.carrotsearch.randomizedtesting.ThreadLeakControl$StatementRunner.run(ThreadLeakControl.java:368)
	at java.lang.Thread.run(Thread.java:748)




Build Log:
[...truncated 15679 lines...]
   [junit4] Suite: org.apache.solr.util.UtilsToolTest
   [junit4]   2> Creating dataDir: C:\Users\jenkins\workspace\Lucene-Solr-master-Windows\solr\build\solr-core\test\J0\temp\solr.util.UtilsToolTest_B535153582498961-001\init-core-data-001
   [junit4]   1> Deleting 1 solr_log_* files older than 1 days.
   [junit4]   1> Deleting 1 solr_log_* files older than 1 days.
   [junit4]   1> Archiving 1 console log files to C:\Users\jenkins\workspace\Lucene-Solr-master-Windows\solr\build\solr-core\test\J0\temp\solr.util.UtilsToolTest_B535153582498961-001\Utils Tool Test-001\archived
   [junit4]   1> Archiving 5 old GC log files to C:\Users\jenkins\workspace\Lucene-Solr-master-Windows\solr\build\solr-core\test\J0\temp\solr.util.UtilsToolTest_B535153582498961-001\Utils Tool Test-001\archived
   [junit4]   2> NOTE: reproduce with: ant test  -Dtestcase=UtilsToolTest -Dtests.method=testRelativePath -Dtests.seed=B535153582498961 -Dtests.slow=true -Dtests.locale=es-AR -Dtests.timezone=Europe/Sarajevo -Dtests.asserts=true -Dtests.file.encoding=Cp1252
   [junit4] FAILURE 0.03s J0 | UtilsToolTest.testRelativePath <<<
   [junit4]    > Throwable #1: java.lang.AssertionError: expected:<14> but was:<16>
   [junit4]    > 	at __randomizedtesting.SeedInfo.seed([B535153582498961:41A9720A9DB57850]:0)
   [junit4]    > 	at org.apache.solr.util.UtilsToolTest.testRelativePath(UtilsToolTest.java:124)
   [junit4]    > 	at java.lang.Thread.run(Thread.java:748)
   [junit4]   1> Rotating solr logs, keeping a max of 9 generations
   [junit4]   2> NOTE: leaving temporary files on disk at: C:\Users\jenkins\workspace\Lucene-Solr-master-Windows\solr\build\solr-core\test\J0\temp\solr.util.UtilsToolTest_B535153582498961-001
   [junit4]   2> NOTE: test params are: codec=Asserting(Lucene80): {}, docValues:{}, maxPointsInLeafNode=723, maxMBSortInHeap=7.5072587974255, sim=Asserting(org.apache.lucene.search.similarities.AssertingSimilarity@bbb14d), locale=es-AR, timezone=Europe/Sarajevo
   [junit4]   2> NOTE: Windows 10 10.0 x86/Oracle Corporation 1.8.0_172 (32-bit)/cpus=3,threads=1,free=195931272,total=536870912
   [junit4]   2> NOTE: All tests run in this JVM: [TestSimpleQParserPlugin, SolrGraphiteReporterTest, SplitShardTest, LeaderElectionIntegrationTest, AnalysisAfterCoreReloadTest, DistributedExpandComponentTest, TokenizerChainTest, DistribCursorPagingTest, TestJavabinTupleStreamParser, TestHighFrequencyDictionaryFactory, WrapperMergePolicyFactoryTest, ZkCLITest, TestComponentsName, TestSolrJ, DistribJoinFromCollectionTest, TestMaxTokenLenTokenizer, TestPivotHelperCode, PhrasesIdentificationComponentTest, TestReRankQParserPlugin, TestReplicationHandlerBackup, HdfsRecoveryZkTest, ReplicaListTransformerTest, TestSolrCLIRunExample, TestNumericRangeQuery64, TestMultiValuedNumericRangeQuery, SuggesterFSTTest, IndexSchemaTest, TestStressLucene, TestUseDocValuesAsStored, TolerantUpdateProcessorTest, TestJsonFacets, LeaderTragicEventTest, BlockJoinFacetDistribTest, SolrJmxReporterTest, UUIDFieldTest, DocValuesMissingTest, SolrPluginUtilsTest, AutoAddReplicasIntegrationTest, SpellCheckCollatorTest, TestCloudRecovery2, TestCoreAdminApis, TestSlowCompositeReaderWrapper, MergeStrategyTest, TestSimExtremeIndexing, TestCryptoKeys, SimpleFacetsTest, TestBadConfig, RuleEngineTest, TestDocTermOrdsUninvertLimit, TestFieldResource, UpdateRequestProcessorFactoryTest, TestFacetMethods, EmbeddedSolrNoSerializeTest, UnloadDistributedZkTest, TestRandomRequestDistribution, TestIntervalFaceting, TestPointFields, TestLegacyBM25SimilarityFactory, TestSQLHandlerNonCloud, TestSolrCloudSnapshots, BooleanFieldTest, TestTestInjection, TestDistribDocBasedVersion, Tagger2Test, RecoveryZkTest, OutputWriterTest, TestImplicitCoreProperties, BasicDistributedZk2Test, TestShardHandlerFactory, ZkShardTermsTest, TestClusterStateMutator, DistributedVersionInfoTest, TestPostingsSolrHighlighter, AssignTest, SuggesterTest, TestRuleBasedAuthorizationPlugin, TestSort, TestCloudPhrasesIdentificationComponent, DebugComponentTest, ShowFileRequestHandlerTest, SortSpecParsingTest, CollectionPropsTest, TestFieldSortValues, LeaderFailoverAfterPartitionTest, DistributedFacetSimpleRefinementLongTailTest, TestDefaultStatsCache, TestFreeTextSuggestions, TestCloudPseudoReturnFields, TestCloudDeleteByQuery, TestSolrQueryResponse, TestSolrConfigHandler, TestManagedSynonymFilterFactory, DistributedUpdateProcessorTest, TestGraphTermsQParserPlugin, TestUniqueKeyFieldResource, TestCloudSchemaless, TemplateUpdateProcessorTest, CollectionsAPIDistributedZkTest, TestCoreDiscovery, CleanupOldIndexTest, TestMinHashQParser, TestDownShardTolerantSearch, DistributedFacetPivotWhiteBoxTest, TestTrieFacet, PingRequestHandlerTest, SolrCoreTest, PreAnalyzedUpdateProcessorTest, TestSimLargeCluster, CopyFieldTest, PeerSyncTest, ExitableDirectoryReaderTest, DOMUtilTest, TestCloudNestedDocsSort, AlternateDirectoryTest, CustomCollectionTest, SpellCheckComponentTest, TestDelegationWithHadoopAuth, TestIndexSearcher, DeleteNodeTest, SolrIndexConfigTest, MoveReplicaHDFSFailoverTest, TestSegmentSorting, ShardSplitTest, TestConfigReload, LoggingHandlerTest, LegacyCloudClusterPropTest, SolrInfoBeanTest, TestManagedResource, ResponseBuilderTest, TestConfigSets, TestAnalyzeInfixSuggestions, DistanceUnitsTest, AutoScalingHandlerTest, HttpSolrCallGetCoreTest, TestTolerantUpdateProcessorRandomCloud, TestSolrCloudWithDelegationTokens, BasicZkTest, TermsComponentTest, BadComponentTest, TestQuerySenderNoQuery, PrimUtilsTest, ZkFailoverTest, OpenExchangeRatesOrgProviderTest, TestPerFieldSimilarity, AssignBackwardCompatibilityTest, TestEmbeddedSolrServerSchemaAPI, DocValuesTest, TestLegacyNumericRangeQueryBuilder, SolrCloudReportersTest, TestRTGBase, TestConfigSetImmutable, ReplaceNodeNoTargetTest, TestSolrCloudWithHadoopAuthPlugin, TestPartialUpdateDeduplication, NumberUtilsTest, ForceLeaderTest, TestTlogReplica, TestCopyFieldCollectionResource, SolrMetricsIntegrationTest, TestSolrCoreParser, CollectionTooManyReplicasTest, TestManagedSchema, MultiThreadedOCPTest, ShardRoutingTest, ConnectionReuseTest, SolrIndexSplitterTest, TermVectorComponentDistributedTest, TestDynamicFieldResource, TestFieldCacheSortRandom, TaggingAttributeTest, TestGeoJSONResponseWriter, TestRestManager, TransactionLogTest, HttpTriggerListenerTest, TestComplexPhraseLeadingWildcard, QueryResultKeyTest, TriggerEventQueueTest, TestSolrCloudWithSecureImpersonation, BasicAuthStandaloneTest, TestCollectionAPIs, PrimitiveFieldTypeTest, TestBlobHandler, TestConfig, AdminHandlersProxyTest, TestTrie, DeleteShardTest, TestPushWriter, SparseHLLTest, TestManagedSchemaThreadSafety, TestCollectionAPI, TestQueryTypes, SaslZkACLProviderTest, TestSolrXml, NodeMarkersRegistrationTest, TestReversedWildcardFilterFactory, TestStressVersions, ScriptEngineTest, ScheduledMaintenanceTriggerTest, HttpPartitionTest, DeleteInactiveReplicaTest, AnalysisErrorHandlingTest, TriggerSetPropertiesIntegrationTest, TestLRUStatsCache, MetricsConfigTest, ChaosMonkeyNothingIsSafeWithPullReplicasTest, ChaosMonkeySafeLeaderWithPullReplicasTest, ConcurrentCreateRoutedAliasTest, ConfigSetsAPITest, ConnectionManagerTest, CreateCollectionCleanupTest, CreateRoutedAliasTest, HealthCheckHandlerTest, HttpPartitionOnCommitTest, MigrateRouteKeyTest, MultiSolrCloudTestCaseTest, OutOfBoxZkACLAndCredentialsProvidersTest, OverriddenZkACLAndCredentialsProvidersTest, OverseerCollectionConfigSetProcessorTest, OverseerRolesTest, OverseerStatusTest, OverseerTest, RecoveryAfterSoftCommitTest, ReplicationFactorTest, RestartWhileUpdatingTest, RollingRestartTest, SSLMigrationTest, SliceStateTest, SolrCLIZkUtilsTest, SolrCloudExampleTest, TestCloudConsistency, TestClusterProperties, TestConfigSetsAPIExclusivity, TestConfigSetsAPIZkFailure, TestHashPartitioner, TestLeaderElectionWithEmptyReplica, TestLockTree, TestOnReconnectListenerSupport, TestPrepRecovery, TestRandomFlRTGCloud, TestRequestForwarding, TestSSLRandomization, TestStressInPlaceUpdates, TestStressLiveNodes, TestWithCollection, HdfsAutoAddReplicasIntegrationTest, MetricTriggerIntegrationTest, MetricTriggerTest, NodeAddedTriggerIntegrationTest, NodeLostTriggerIntegrationTest, NodeLostTriggerTest, TestPolicyCloud, TestSimComputePlanAction, TestSimDistribStateManager, TestSimDistributedQueue, TestSimExecutePlanAction, TestSimNodeLostTrigger, TestSimPolicyCloud, TestSimTriggerIntegration, BaseCdcrDistributedZkTest, CdcrBidirectionalTest, CdcrBootstrapTest, CdcrWithNodesRestartsTest, HDFSCollectionsAPITest, HdfsBasicDistributedZk2Test, HdfsBasicDistributedZkTest, HdfsChaosMonkeyNothingIsSafeTest, HdfsChaosMonkeySafeLeaderTest, HdfsNNFailoverTest, HdfsRecoverLeaseTest, HdfsSyncSliceTest, HdfsThreadLeakTest, HdfsTlogReplayBufferedWhileIndexingTest, HdfsUnloadDistributedZkTest, HdfsWriteToMultipleCollectionsTest, StressHdfsTest, ZkStateWriterTest, ConfigureRecoveryStrategyTest, CoreSorterTest, DirectoryFactoryTest, OpenCloseCoreStressTest, SOLR749Test, TestCustomStream, TestDynamicURP, TestInitParams, TestJmxIntegration, TestMergePolicyConfig, TestNRTOpen, TestQuerySenderListener, TestSolrDeletionPolicy2, BinaryUpdateRequestHandlerTest, FieldAnalysisRequestHandlerTest, MoreLikeThisHandlerTest, TestSQLHandler, V2ApiIntegrationTest, V2StandaloneTest, XsltUpdateRequestHandlerTest, CoreAdminOperationTest, CoreAdminRequestStatusTest, InfoHandlerTest, MBeansHandlerTest, DistributedFacetPivotLongTailTest, DistributedQueryComponentCustomSortTest, DistributedQueryComponentOptimizationTest, DistributedSpellCheckComponentTest, DistributedTermsComponentTest, ShufflingReplicaListTransformerTest, SuggestComponentContextFilterQueryTest, SuggestComponentTest, TestHttpShardHandlerFactory, JavabinLoaderTest, HighlighterConfigTest, HighlighterMaxOffsetTest, TestLegacyField, TestLegacyFieldReuse, TestLegacyTerms, SolrMetricManagerTest, SolrMetricReporterTest, SolrRrdBackendFactoryTest, RegexBytesRefFilterTest, TestStreamBody, JSONWriterTest, TestBinaryResponseWriter, TestCustomDocTransformer, TestRetrieveFieldsOptimizer, TestSubQueryTransformer, TestSubQueryTransformerDistrib, TestSchemaVersionResource, BadCopyFieldTest, BadIndexSchemaTest, NumericFieldsTest, PreAnalyzedFieldTest, SchemaVersionSpecificBehaviorTest, SynonymTokenizerTest, TestBinaryField, TestBulkSchemaConcurrent, TestCollationFieldDocValues, TestHalfAndHalfDocValues, TestSchemalessBufferedUpdates, TestSortableTextField, AnalyticsQueryTest, CurrencyRangeFacetCloudTest, RankQueryTest, SignificantTermsQParserPluginTest, TestAddFieldRealTimeGet, TestExtendedDismaxParser, TestFoldingMultitermQuery, TestLFUCache, TestPayloadScoreQParserPlugin, TestRangeQuery, TestRecoveryHdfs, TestReload, TestReloadDeadlock, TestSearchPerf, TestSearcherReuse, TestSolr4Spatial, TestSolr4Spatial2, TestStressReorder, TestStressUserVersions, TestXmlQParser, TestXmlQParserPlugin, SpatialHeatmapFacetsTest, TestMinMaxOnMultiValuedField, BJQParserTest, TestJsonRequest, SimpleMLTQParserTest, TestBM25SimilarityFactory, TestClassicSimilarityFactory, TestDFISimilarityFactory, TestDFRSimilarityFactory, TestIBSimilarityFactory, TestLMDirichletSimilarityFactory, TestLMJelinekMercerSimilarityFactory, TestSweetSpotSimilarityFactory, TestExactSharedStatsCache, TestAuthorizationFramework, TestPKIAuthenticationPlugin, CacheHeaderTest, SolrRequestParserTest, DirectSolrSpellCheckerTest, IndexBasedSpellCheckerTest, TestBlendedInfixSuggestions, BlockCacheTest, BlockDirectoryTest, BufferStoreTest, HdfsDirectoryTest, HdfsLockFactoryTest, TestDocTermOrds, TestFieldCacheReopen, TestFieldCacheWithThreads, TestLegacyFieldCache, TestNumericTerms64, DataDrivenBlockJoinTest, DirectUpdateHandlerTest, PeerSyncWithIndexFingerprintCachingTest, RootFieldTest, SoftAutoCommitTest, SolrCmdDistributorTest, TestHdfsUpdateLog, TestInPlaceUpdatesDistrib, AddSchemaFieldsUpdateProcessorFactoryTest, DefaultValueUpdateProcessorTest, IgnoreCommitOptimizeUpdateProcessorFactoryTest, ParsingFieldUpdateProcessorsTest, UniqFieldsUpdateProcessorFactoryTest, TestRTimerTree, UtilsToolTest]
   [junit4] Completed [832/838 (1!)] on J0 in 0.54s, 8 tests, 1 failure <<< FAILURES!

[...truncated 45143 lines...]
[repro] Jenkins log URL: https://jenkins.thetaphi.de/job/Lucene-Solr-master-Windows/7656/consoleText

[repro] Revision: 1d0a08621708dde4220f9b45886a2c147d7fefd1

[repro] Ant options: "-Dargs=-client -XX:+UseG1GC"

[repro] ant clean

[...truncated 6 lines...]
[repro] Test suites by module:
[repro]    solr\core
[repro]       UtilsToolTest
[repro] ant compile-test

[...truncated 3614 lines...]
[repro] ant test-nocompile -Dtests.dups=5 -Dtests.maxfailures=5 -Dtests.class="*.UtilsToolTest" -Dtests.showOutput=onerror "-Dargs=-client -XX:+UseG1GC" -Dtests.seed=B535153582498961 -Dtests.slow=true -Dtests.locale=es-AR -Dtests.timezone=Europe/Sarajevo -Dtests.asserts=true -Dtests.file.encoding=Cp1252

[...truncated 103 lines...]
[repro] Failures:
[repro]   0/5 failed: org.apache.solr.util.UtilsToolTest
[repro] Exiting with code 0

[...truncated 75 lines...]