You are viewing a plain text version of this content. The canonical link for it is here.
Posted to commits@karaf.apache.org by Apache Jenkins Server <je...@builds.apache.org> on 2012/02/27 15:12:23 UTC

Build failed in Jenkins: Karaf-2.2.x #371

See <https://builds.apache.org/job/Karaf-2.2.x/371/changes>

Changes:

[jbonofre] [KARAF-1233] Upgrade to asm 3.3.1

------------------------------------------
[...truncated 6282 lines...]
Running org.apache.karaf.tooling.features.BundleToArtifactTest
Tests run: 3, Failures: 0, Errors: 0, Skipped: 0, Time elapsed: 0.06 sec
Running org.apache.karaf.tooling.features.ManifestUtilsTest
Tests run: 2, Failures: 0, Errors: 0, Skipped: 0, Time elapsed: 0.015 sec
Running org.apache.karaf.tooling.features.GenerateFeaturesXmlMojoTest
Tests run: 1, Failures: 0, Errors: 0, Skipped: 0, Time elapsed: 0.045 sec
Running org.apache.karaf.tooling.features.GenerateFeaturesFileMojoTest
Tests run: 5, Failures: 0, Errors: 0, Skipped: 0, Time elapsed: 0.008 sec

Results :

Tests run: 11, Failures: 0, Errors: 0, Skipped: 0

[JENKINS] Recording test results
[INFO] [jar:jar {execution: default-jar}]
[INFO] Building jar: <https://builds.apache.org/job/Karaf-2.2.x/ws/karaf/tooling/features-maven-plugin/target/features-maven-plugin-2.2.6-SNAPSHOT.jar>
[INFO] [plugin:addPluginArtifactMetadata {execution: default-addPluginArtifactMetadata}]
[INFO] [install:install {execution: default-install}]
[INFO] Installing <https://builds.apache.org/job/Karaf-2.2.x/ws/karaf/tooling/features-maven-plugin/target/features-maven-plugin-2.2.6-SNAPSHOT.jar> to <https://builds.apache.org/job/Karaf-2.2.x/ws/.repository/org/apache/karaf/tooling/features-maven-plugin/2.2.6-SNAPSHOT/features-maven-plugin-2.2.6-SNAPSHOT.jar>
[JENKINS] Archiving <https://builds.apache.org/job/Karaf-2.2.x/ws/karaf/tooling/features-maven-plugin/pom.xml> to /home/hudson/hudson/jobs/Karaf-2.2.x/modules/org.apache.karaf.tooling$features-maven-plugin/builds/2012-02-27_14-05-44/archive/org.apache.karaf.tooling/features-maven-plugin/2.2.6-SNAPSHOT/features-maven-plugin-2.2.6-SNAPSHOT.pom
[JENKINS] Archiving <https://builds.apache.org/job/Karaf-2.2.x/ws/karaf/tooling/features-maven-plugin/target/features-maven-plugin-2.2.6-SNAPSHOT.jar> to /home/hudson/hudson/jobs/Karaf-2.2.x/modules/org.apache.karaf.tooling$features-maven-plugin/builds/2012-02-27_14-05-44/archive/org.apache.karaf.tooling/features-maven-plugin/2.2.6-SNAPSHOT/features-maven-plugin-2.2.6-SNAPSHOT.jar
[INFO] ------------------------------------------------------------------------
[INFO] Building Apache Karaf :: Assembly
[INFO]    task-segment: [clean, install]
[INFO] ------------------------------------------------------------------------
[INFO] [clean:clean {execution: default-clean}]
[INFO] [bundle:cleanVersions {execution: cleanVersions}]
[INFO] [remote-resources:process {execution: default}]
Downloading: http://svn.apache.org/repos/asf/servicemix/m2-repo/org/apache/servicemix/bundles/org.apache.servicemix.bundles.asm/3.3.1_1/org.apache.servicemix.bundles.asm-3.3.1_1.pom
[INFO] Unable to find resource 'org.apache.servicemix.bundles:org.apache.servicemix.bundles.asm:pom:3.3.1_1' in repository servicemix (http://svn.apache.org/repos/asf/servicemix/m2-repo)
Downloading: http://repo1.maven.org/maven2/org/apache/servicemix/bundles/org.apache.servicemix.bundles.asm/3.3.1_1/org.apache.servicemix.bundles.asm-3.3.1_1.pom

Downloading: http://svn.apache.org/repos/asf/servicemix/m2-repo/org/apache/servicemix/bundles/org.apache.servicemix.bundles.asm/3.3.1_1/org.apache.servicemix.bundles.asm-3.3.1_1.jar
[INFO] Unable to find resource 'org.apache.servicemix.bundles:org.apache.servicemix.bundles.asm:jar:3.3.1_1' in repository servicemix (http://svn.apache.org/repos/asf/servicemix/m2-repo)
Downloading: http://repo1.maven.org/maven2/org/apache/servicemix/bundles/org.apache.servicemix.bundles.asm/3.3.1_1/org.apache.servicemix.bundles.asm-3.3.1_1.jar

[INFO] [antrun:run {execution: copy-notice}]
[INFO] Executing tasks

main:
     [copy] Warning: Could not find file <https://builds.apache.org/job/Karaf-2.2.x/ws/karaf/assemblies/apache-karaf/NOTICE> to copy.
[INFO] Executed tasks
[debug] execute contextualize
[INFO] [resources:resources {execution: filter}]
[INFO] Using 'UTF-8' encoding to copy filtered resources.
[INFO] Copying 18 resources
[INFO] Copying 0 resource
[INFO] Copying 3 resources
[INFO] [dependency:copy {execution: copy}]
[INFO] Configured Artifact: org.apache.karaf:org.apache.karaf.main:?:jar
[INFO] Configured Artifact: org.apache.karaf:org.apache.karaf.client:?:jar
[INFO] Configured Artifact: org.apache.karaf.jaas:org.apache.karaf.jaas.boot:?:jar
[INFO] Copying org.apache.karaf.main-2.2.6-SNAPSHOT.jar to <https://builds.apache.org/job/Karaf-2.2.x/ws/karaf/assemblies/apache-karaf/target/dependencies/lib/karaf.jar>
[INFO] Copying org.apache.karaf.client-2.2.6-SNAPSHOT.jar to <https://builds.apache.org/job/Karaf-2.2.x/ws/karaf/assemblies/apache-karaf/target/dependencies/lib/bin/karaf-client.jar>
[INFO] Copying org.apache.karaf.jaas.boot-2.2.6-SNAPSHOT.jar to <https://builds.apache.org/job/Karaf-2.2.x/ws/karaf/assemblies/apache-karaf/target/dependencies/lib/karaf-jaas-boot.jar>
[INFO] Preparing features:add-features-to-repo
[WARNING] Removing: add-features-to-repo from forked lifecycle, to prevent recursive invocation.
[JENKINS] Archiving <https://builds.apache.org/job/Karaf-2.2.x/ws/karaf/assemblies/apache-karaf/pom.xml> to /home/hudson/hudson/jobs/Karaf-2.2.x/modules/org.apache.karaf$apache-karaf/builds/2012-02-27_14-05-44/archive/org.apache.karaf/apache-karaf/2.2.6-SNAPSHOT/apache-karaf-2.2.6-SNAPSHOT.pom
[INFO] [bundle:cleanVersions {execution: cleanVersions}]
[INFO] [remote-resources:process {execution: default}]
[INFO] [antrun:run {execution: copy-notice}]
[INFO] Executing tasks

main:
     [copy] Warning: Could not find file <https://builds.apache.org/job/Karaf-2.2.x/ws/karaf/assemblies/apache-karaf/NOTICE> to copy.
[INFO] Executed tasks
[debug] execute contextualize
[INFO] [resources:resources {execution: filter}]
[INFO] Using 'UTF-8' encoding to copy filtered resources.
[INFO] Copying 18 resources
[INFO] Copying 0 resource
[INFO] Copying 3 resources
[INFO] Copying 3 resources
[INFO] [dependency:copy {execution: copy}]
[INFO] Configured Artifact: org.apache.karaf:org.apache.karaf.main:?:jar
[INFO] Configured Artifact: org.apache.karaf:org.apache.karaf.client:?:jar
[INFO] Configured Artifact: org.apache.karaf.jaas:org.apache.karaf.jaas.boot:?:jar
[INFO] org.apache.karaf:org.apache.karaf.main:2.2.6-SNAPSHOT:jar already exists in <https://builds.apache.org/job/Karaf-2.2.x/ws/karaf/assemblies/apache-karaf/target/dependencies/lib>
[INFO] org.apache.karaf:org.apache.karaf.client:2.2.6-SNAPSHOT:jar already exists in <https://builds.apache.org/job/Karaf-2.2.x/ws/karaf/assemblies/apache-karaf/target/dependencies/lib/bin>
[INFO] org.apache.karaf.jaas:org.apache.karaf.jaas.boot:2.2.6-SNAPSHOT:jar already exists in <https://builds.apache.org/job/Karaf-2.2.x/ws/karaf/assemblies/apache-karaf/target/dependencies/lib>
[INFO] [features:add-features-to-repo {execution: add-features-to-repo}]
[INFO] Copying bundle: org.apache.karaf.assemblies.features:standard:xml:features:2.2.6-SNAPSHOT
[INFO] Copying bundle: org.apache.karaf.assemblies.features:enterprise:xml:features:2.2.6-SNAPSHOT
[INFO] Copying bundle: org.apache.karaf.assemblies.features:enterprise:xml:features:2.2.6-SNAPSHOT
[INFO] Copying bundle: org.apache.karaf.assemblies.features:standard:xml:features:2.2.6-SNAPSHOT
[INFO] Copying bundle: org.apache.karaf.assemblies.features:standard:xml:features:2.2.6-SNAPSHOT
[INFO] Copying bundle: org.apache.karaf.assemblies.features:enterprise:xml:features:2.2.6-SNAPSHOT
[INFO] Adding contents of transitive feature: management/2.2.6-SNAPSHOT
[INFO] Adding contents of transitive feature: config/2.2.6-SNAPSHOT
[INFO] Adding contents of transitive feature: ssh/2.2.6-SNAPSHOT
[INFO] Base repo: file://<https://builds.apache.org/job/Karaf-2.2.x/ws/.repository>
[INFO] Copying bundle: org.apache.karaf.management.mbeans:org.apache.karaf.management.mbeans.system:jar:2.2.6-SNAPSHOT
[INFO] Copying bundle: org.apache.sshd:sshd-core:jar:0.5.0
[INFO] Copying bundle: org.apache.mina:mina-core:jar:2.0.1
[INFO] Copying bundle: org.apache.aries.jmx:org.apache.aries.jmx:jar:0.3
[INFO] Copying bundle: org.apache.karaf.shell:org.apache.karaf.shell.ssh:jar:2.2.6-SNAPSHOT
[INFO] Copying bundle: org.apache.karaf.management.mbeans:org.apache.karaf.management.mbeans.bundles:jar:2.2.6-SNAPSHOT
[INFO] Copying bundle: org.apache.karaf.shell:org.apache.karaf.shell.config:jar:2.2.6-SNAPSHOT
[INFO] Copying bundle: org.apache.karaf.management:org.apache.karaf.management.server:jar:2.2.6-SNAPSHOT
[INFO] Copying bundle: org.apache.karaf.management.mbeans:org.apache.karaf.management.mbeans.services:jar:2.2.6-SNAPSHOT
[INFO] Copying bundle: org.apache.karaf.management.mbeans:org.apache.karaf.management.mbeans.log:jar:2.2.6-SNAPSHOT
[INFO] Copying bundle: org.apache.karaf.management.mbeans:org.apache.karaf.management.mbeans.dev:jar:2.2.6-SNAPSHOT
[INFO] Copying bundle: org.apache.karaf.management.mbeans:org.apache.karaf.management.mbeans.packages:jar:2.2.6-SNAPSHOT
[INFO] Copying bundle: org.apache.aries.jmx:org.apache.aries.jmx.blueprint:jar:0.3
[INFO] Copying bundle: org.apache.karaf.assemblies.features:standard:xml:features:2.2.6-SNAPSHOT
[INFO] Copying bundle: org.apache.karaf.management.mbeans:org.apache.karaf.management.mbeans.config:jar:2.2.6-SNAPSHOT
[INFO] Copying bundle: org.apache.karaf.assemblies.features:enterprise:xml:features:2.2.6-SNAPSHOT
[INFO] [site:attach-descriptor {execution: default-attach-descriptor}]
[INFO] [build-helper:attach-artifact {execution: attach-artifacts}]
[INFO] [assembly:single {execution: unix-minimal-bin}]
[INFO] Reading assembly descriptor: src/main/descriptors/unix-minimal-bin.xml
[WARNING] The following patterns were never triggered in this artifact inclusion filter:
o  'org.apache.karaf:org.apache.karaf.management'

[INFO] apache-karaf-2.2.6-SNAPSHOT/etc/ already added, skipping
[INFO] apache-karaf-2.2.6-SNAPSHOT/ already added, skipping
[INFO] apache-karaf-2.2.6-SNAPSHOT/ already added, skipping
[INFO] apache-karaf-2.2.6-SNAPSHOT/lib already added, skipping
[INFO] Building tar : <https://builds.apache.org/job/Karaf-2.2.x/ws/karaf/assemblies/apache-karaf/target/apache-karaf-2.2.6-SNAPSHOT-minimal.tar.gz>
[INFO] apache-karaf-2.2.6-SNAPSHOT/etc/ already added, skipping
[INFO] apache-karaf-2.2.6-SNAPSHOT/ already added, skipping
[INFO] apache-karaf-2.2.6-SNAPSHOT/ already added, skipping
[INFO] apache-karaf-2.2.6-SNAPSHOT/lib already added, skipping
[INFO] [assembly:single {execution: unix-bin}]
[INFO] Reading assembly descriptor: src/main/descriptors/unix-bin.xml
[INFO] apache-karaf-2.2.6-SNAPSHOT/demos/ already added, skipping
[INFO] apache-karaf-2.2.6-SNAPSHOT/demos/deployer already added, skipping
[INFO] apache-karaf-2.2.6-SNAPSHOT/demos/deployer/kar already added, skipping
[INFO] apache-karaf-2.2.6-SNAPSHOT/demos/web already added, skipping
[INFO] apache-karaf-2.2.6-SNAPSHOT/demos/command already added, skipping
[INFO] apache-karaf-2.2.6-SNAPSHOT/ already added, skipping
[INFO] apache-karaf-2.2.6-SNAPSHOT/ already added, skipping
[INFO] apache-karaf-2.2.6-SNAPSHOT/lib already added, skipping
[INFO] Building tar : <https://builds.apache.org/job/Karaf-2.2.x/ws/karaf/assemblies/apache-karaf/target/apache-karaf-2.2.6-SNAPSHOT.tar.gz>
[INFO] apache-karaf-2.2.6-SNAPSHOT/demos/ already added, skipping
[INFO] apache-karaf-2.2.6-SNAPSHOT/demos/deployer already added, skipping
[INFO] apache-karaf-2.2.6-SNAPSHOT/demos/deployer/kar already added, skipping
[INFO] apache-karaf-2.2.6-SNAPSHOT/demos/web already added, skipping
[INFO] apache-karaf-2.2.6-SNAPSHOT/demos/command already added, skipping
[INFO] apache-karaf-2.2.6-SNAPSHOT/ already added, skipping
[INFO] apache-karaf-2.2.6-SNAPSHOT/ already added, skipping
[INFO] apache-karaf-2.2.6-SNAPSHOT/lib already added, skipping
[INFO] [assembly:single {execution: windows-minimal-bin}]
[INFO] Reading assembly descriptor: src/main/descriptors/windows-minimal-bin.xml
[WARNING] The following patterns were never triggered in this artifact inclusion filter:
o  'org.apache.karaf:org.apache.karaf.management'

[INFO] apache-karaf-2.2.6-SNAPSHOT/ already added, skipping
[INFO] apache-karaf-2.2.6-SNAPSHOT/etc/ already added, skipping
[INFO] apache-karaf-2.2.6-SNAPSHOT/ already added, skipping
[INFO] apache-karaf-2.2.6-SNAPSHOT/lib already added, skipping
[INFO] Building zip: <https://builds.apache.org/job/Karaf-2.2.x/ws/karaf/assemblies/apache-karaf/target/apache-karaf-2.2.6-SNAPSHOT-minimal.zip>
[INFO] apache-karaf-2.2.6-SNAPSHOT/ already added, skipping
[INFO] apache-karaf-2.2.6-SNAPSHOT/etc/ already added, skipping
[INFO] apache-karaf-2.2.6-SNAPSHOT/ already added, skipping
[INFO] apache-karaf-2.2.6-SNAPSHOT/lib already added, skipping
[INFO] [assembly:single {execution: windows-bin}]
[INFO] Reading assembly descriptor: src/main/descriptors/windows-bin.xml
[INFO] apache-karaf-2.2.6-SNAPSHOT/ already added, skipping
[INFO] apache-karaf-2.2.6-SNAPSHOT/demos/ already added, skipping
[INFO] apache-karaf-2.2.6-SNAPSHOT/demos/deployer already added, skipping
[INFO] apache-karaf-2.2.6-SNAPSHOT/demos/deployer/kar already added, skipping
[INFO] apache-karaf-2.2.6-SNAPSHOT/demos/web already added, skipping
[INFO] apache-karaf-2.2.6-SNAPSHOT/demos/command already added, skipping
[INFO] apache-karaf-2.2.6-SNAPSHOT/ already added, skipping
[INFO] apache-karaf-2.2.6-SNAPSHOT/lib already added, skipping
[INFO] Building zip: <https://builds.apache.org/job/Karaf-2.2.x/ws/karaf/assemblies/apache-karaf/target/apache-karaf-2.2.6-SNAPSHOT.zip>
[INFO] apache-karaf-2.2.6-SNAPSHOT/ already added, skipping
[INFO] apache-karaf-2.2.6-SNAPSHOT/demos/ already added, skipping
[INFO] apache-karaf-2.2.6-SNAPSHOT/demos/deployer already added, skipping
[INFO] apache-karaf-2.2.6-SNAPSHOT/demos/deployer/kar already added, skipping
[INFO] apache-karaf-2.2.6-SNAPSHOT/demos/web already added, skipping
[INFO] apache-karaf-2.2.6-SNAPSHOT/demos/command already added, skipping
[INFO] apache-karaf-2.2.6-SNAPSHOT/ already added, skipping
[INFO] apache-karaf-2.2.6-SNAPSHOT/lib already added, skipping
[INFO] [assembly:single {execution: unix-src}]
[INFO] Reading assembly descriptor: src/main/descriptors/unix-src.xml
[INFO] Building tar : <https://builds.apache.org/job/Karaf-2.2.x/ws/karaf/assemblies/apache-karaf/target/apache-karaf-2.2.6-SNAPSHOT-src.tar.gz>
[INFO] [assembly:single {execution: windows-src}]
[INFO] Reading assembly descriptor: src/main/descriptors/windows-src.xml
[INFO] Building zip: <https://builds.apache.org/job/Karaf-2.2.x/ws/karaf/assemblies/apache-karaf/target/apache-karaf-2.2.6-SNAPSHOT-src.zip>
[INFO] [install:install {execution: default-install}]
[INFO] Installing <https://builds.apache.org/job/Karaf-2.2.x/ws/karaf/assemblies/apache-karaf/pom.xml> to <https://builds.apache.org/job/Karaf-2.2.x/ws/.repository/org/apache/karaf/apache-karaf/2.2.6-SNAPSHOT/apache-karaf-2.2.6-SNAPSHOT.pom>
[INFO] Installing <https://builds.apache.org/job/Karaf-2.2.x/ws/karaf/assemblies/apache-karaf/src/main/resources/extra/jetty.xml> to <https://builds.apache.org/job/Karaf-2.2.x/ws/.repository/org/apache/karaf/apache-karaf/2.2.6-SNAPSHOT/apache-karaf-2.2.6-SNAPSHOT-jettyconfig.xml>
[INFO] Installing <https://builds.apache.org/job/Karaf-2.2.x/ws/karaf/assemblies/apache-karaf/target/apache-karaf-2.2.6-SNAPSHOT-minimal.tar.gz> to <https://builds.apache.org/job/Karaf-2.2.x/ws/.repository/org/apache/karaf/apache-karaf/2.2.6-SNAPSHOT/apache-karaf-2.2.6-SNAPSHOT-minimal.tar.gz>
[INFO] Installing <https://builds.apache.org/job/Karaf-2.2.x/ws/karaf/assemblies/apache-karaf/target/apache-karaf-2.2.6-SNAPSHOT.tar.gz> to <https://builds.apache.org/job/Karaf-2.2.x/ws/.repository/org/apache/karaf/apache-karaf/2.2.6-SNAPSHOT/apache-karaf-2.2.6-SNAPSHOT.tar.gz>
[INFO] Installing <https://builds.apache.org/job/Karaf-2.2.x/ws/karaf/assemblies/apache-karaf/target/apache-karaf-2.2.6-SNAPSHOT-minimal.zip> to <https://builds.apache.org/job/Karaf-2.2.x/ws/.repository/org/apache/karaf/apache-karaf/2.2.6-SNAPSHOT/apache-karaf-2.2.6-SNAPSHOT-minimal.zip>
[INFO] Installing <https://builds.apache.org/job/Karaf-2.2.x/ws/karaf/assemblies/apache-karaf/target/apache-karaf-2.2.6-SNAPSHOT.zip> to <https://builds.apache.org/job/Karaf-2.2.x/ws/.repository/org/apache/karaf/apache-karaf/2.2.6-SNAPSHOT/apache-karaf-2.2.6-SNAPSHOT.zip>
[INFO] Installing <https://builds.apache.org/job/Karaf-2.2.x/ws/karaf/assemblies/apache-karaf/target/apache-karaf-2.2.6-SNAPSHOT-src.tar.gz> to <https://builds.apache.org/job/Karaf-2.2.x/ws/.repository/org/apache/karaf/apache-karaf/2.2.6-SNAPSHOT/apache-karaf-2.2.6-SNAPSHOT-src.tar.gz>
[INFO] Installing <https://builds.apache.org/job/Karaf-2.2.x/ws/karaf/assemblies/apache-karaf/target/apache-karaf-2.2.6-SNAPSHOT-src.zip> to <https://builds.apache.org/job/Karaf-2.2.x/ws/.repository/org/apache/karaf/apache-karaf/2.2.6-SNAPSHOT/apache-karaf-2.2.6-SNAPSHOT-src.zip>
Feb 27, 2012 2:12:19 PM hudson.remoting.Channel$ReaderThread run
SEVERE: I/O error in channel channel
java.io.StreamCorruptedException
	at java.io.ObjectInputStream.readObject0(ObjectInputStream.java:1332)
	at java.io.ObjectInputStream.readObject(ObjectInputStream.java:348)
	at hudson.remoting.Channel$ReaderThread.run(Channel.java:1127)
channel stopped
[INFO] ------------------------------------------------------------------------
[ERROR] FATAL ERROR
[INFO] ------------------------------------------------------------------------
[INFO] null
[INFO] ------------------------------------------------------------------------
[INFO] Trace
java.lang.reflect.UndeclaredThrowableException
	at $Proxy2.isArchivingDisabled(Unknown Source)
	at hudson.maven.MavenBuildProxy$Filter.isArchivingDisabled(MavenBuildProxy.java:227)
	at hudson.maven.reporters.MavenArtifact.archive(MavenArtifact.java:216)
	at hudson.maven.reporters.MavenArtifactArchiver.postBuild(MavenArtifactArchiver.java:106)
	at hudson.maven.Maven2Builder.postModule(Maven2Builder.java:127)
	at hudson.maven.MavenBuilder$Adapter.fireLeaveModule(MavenBuilder.java:327)
	at hudson.maven.MavenBuilder$Adapter.postBuild(MavenBuilder.java:285)
	at org.apache.maven.lifecycle.LifecycleExecutorInterceptor.execute(LifecycleExecutorInterceptor.java:68)
	at org.apache.maven.DefaultMaven.doExecute(DefaultMaven.java:328)
	at org.apache.maven.DefaultMaven.execute(DefaultMaven.java:138)
	at org.apache.maven.cli.MavenCli.main(MavenCli.java:362)
	at sun.reflect.NativeMethodAccessorImpl.invoke0(Native Method)
	at sun.reflect.NativeMethodAccessorImpl.invoke(NativeMethodAccessorImpl.java:39)
	at sun.reflect.DelegatingMethodAccessorImpl.invoke(DelegatingMethodAccessorImpl.java:25)
	at java.lang.reflect.Method.invoke(Method.java:592)
	at org.codehaus.classworlds.Launcher.launchEnhanced(Launcher.java:315)
	at org.codehaus.classworlds.Launcher.launch(Launcher.java:255)
	at hudson.maven.agent.Main.launch(Main.java:185)
	at hudson.maven.MavenBuilder.call(MavenBuilder.java:151)
	at hudson.maven.Maven2Builder.call(Maven2Builder.java:77)
	at hudson.maven.Maven2Builder.call(Maven2Builder.java:53)
	at hudson.remoting.UserRequest.perform(UserRequest.java:118)
	at hudson.remoting.UserRequest.perform(UserRequest.java:48)
	at hudson.remoting.Request$2.run(Request.java:287)
	at hudson.remoting.InterceptingExecutorService$1.call(InterceptingExecutorService.java:72)
	at java.util.concurrent.FutureTask$Sync.innerRun(FutureTask.java:269)
	at java.util.concurrent.FutureTask.run(FutureTask.java:123)
	at java.util.concurrent.ThreadPoolExecutor$Worker.runTask(ThreadPoolExecutor.java:651)
	at java.util.concurrent.ThreadPoolExecutor$Worker.run(ThreadPoolExecutor.java:676)
	at java.lang.Thread.run(Thread.java:595)
Caused by: hudson.remoting.ChannelClosedException: channel is already closed
	at hudson.remoting.Channel.send(Channel.java:499)
	at hudson.remoting.Request.call(Request.java:110)
	at hudson.remoting.Channel.call(Channel.java:681)
	at hudson.remoting.RemoteInvocationHandler.invoke(RemoteInvocationHandler.java:158)
	... 30 more
Caused by: java.io.StreamCorruptedException
	at java.io.ObjectInputStream.readObject0(ObjectInputStream.java:1332)
	at java.io.ObjectInputStream.readObject(ObjectInputStream.java:348)
	at hudson.remoting.Channel$ReaderThread.run(Channel.java:1127)
[INFO] ------------------------------------------------------------------------
[INFO] Total time: 6 minutes 7 seconds
[INFO] Finished at: Mon Feb 27 14:12:19 UTC 2012
ERROR: Maven JVM terminated unexpectedly with exit code 0



Build failed in Jenkins: Karaf-2.2.x #372

Posted by Apache Jenkins Server <je...@builds.apache.org>.
See <https://builds.apache.org/job/Karaf-2.2.x/372/changes>

Changes:

[ffang] [KARAF-1245]blueprint deployer and spring deployer should get started before features.core bundle

[gnodet] [KARAF-1244] Deployer Transformers Supports Manifest Element without A Supporting Schema

------------------------------------------
[...truncated 2502 lines...]
SEVERE: Lost lock!
Mar 2, 2012 9:05:23 AM org.apache.karaf.main.DefaultJDBCLock updateLock
WARNING: Failed to update database lock: java.sql.SQLException
Tests run: 14, Failures: 0, Errors: 0, Skipped: 0, Time elapsed: 0.028 sec
Running org.apache.karaf.main.MainStartTest
Mar 2, 2012 9:05:24 AM org.apache.karaf.main.SimpleFileLock lock
INFO: locking
Mar 2, 2012 9:05:25 AM org.ops4j.pax.swissbox.tinybundles.core.metadata.RawBuilder$1 run
INFO: Copy thread finished.
Mar 2, 2012 9:05:35 AM org.apache.karaf.main.SimpleFileLock release
INFO: releasing
[JENKINS] Recording test resultsTests run: 2, Failures: 0, Errors: 0, Skipped: 1, Time elapsed: 11.515 sec
Running org.apache.karaf.main.StringMapTest
Tests run: 1, Failures: 0, Errors: 0, Skipped: 0, Time elapsed: 0.004 sec
Running org.apache.karaf.main.OracleJDBCLockTest
Mar 2, 2012 9:05:35 AM org.apache.karaf.main.DefaultJDBCLock aquireLock
WARNING: Failed to acquire database lock: java.sql.SQLException
Mar 2, 2012 9:05:35 AM org.apache.karaf.main.DefaultJDBCLock aquireLock
WARNING: Failed to acquire database lock: java.sql.SQLException
Mar 2, 2012 9:05:35 AM org.apache.karaf.main.DefaultJDBCLock aquireLock
WARNING: Failed to acquire database lock: java.sql.SQLException
Mar 2, 2012 9:05:35 AM org.apache.karaf.main.DefaultJDBCLock isAlive
SEVERE: Lost lock!
Mar 2, 2012 9:05:35 AM org.apache.karaf.main.DefaultJDBCLock isAlive
SEVERE: Lost lock!
Tests run: 13, Failures: 0, Errors: 0, Skipped: 0, Time elapsed: 0.023 sec

Results :

Tests run: 68, Failures: 0, Errors: 0, Skipped: 5


[INFO] [bundle:bundle {execution: default-bundle}]
[WARNING] Bundle org.apache.karaf:org.apache.karaf.main:bundle:2.2.6-SNAPSHOT : Split package org/osgi/framework
Use directive -split-package:=(merge-first|merge-last|error|first) on Export/Private Package instruction to get rid of this warning
Package found in   [Jar:osgi, Jar:org.apache.felix.framework]
Reference from     <https://builds.apache.org/job/Karaf-2.2.x/ws/.repository/org/apache/felix/org.apache.felix.framework/3.0.9/org.apache.felix.framework-3.0.9.jar>
Classpath          [Jar:., Jar:osgi, Jar:org.apache.felix.framework]
[WARNING] Bundle org.apache.karaf:org.apache.karaf.main:bundle:2.2.6-SNAPSHOT : Split package org/osgi/framework/hooks/service
Use directive -split-package:=(merge-first|merge-last|error|first) on Export/Private Package instruction to get rid of this warning
Package found in   [Jar:osgi, Jar:org.apache.felix.framework]
Reference from     <https://builds.apache.org/job/Karaf-2.2.x/ws/.repository/org/apache/felix/org.apache.felix.framework/3.0.9/org.apache.felix.framework-3.0.9.jar>
Classpath          [Jar:., Jar:osgi, Jar:org.apache.felix.framework]
[WARNING] Bundle org.apache.karaf:org.apache.karaf.main:bundle:2.2.6-SNAPSHOT : Split package org/osgi/framework/launch
Use directive -split-package:=(merge-first|merge-last|error|first) on Export/Private Package instruction to get rid of this warning
Package found in   [Jar:osgi, Jar:org.apache.felix.framework]
Reference from     <https://builds.apache.org/job/Karaf-2.2.x/ws/.repository/org/apache/felix/org.apache.felix.framework/3.0.9/org.apache.felix.framework-3.0.9.jar>
Classpath          [Jar:., Jar:osgi, Jar:org.apache.felix.framework]
[WARNING] Bundle org.apache.karaf:org.apache.karaf.main:bundle:2.2.6-SNAPSHOT : Split package org/osgi/service/packageadmin
Use directive -split-package:=(merge-first|merge-last|error|first) on Export/Private Package instruction to get rid of this warning
Package found in   [Jar:osgi, Jar:org.apache.felix.framework]
Reference from     <https://builds.apache.org/job/Karaf-2.2.x/ws/.repository/org/apache/felix/org.apache.felix.framework/3.0.9/org.apache.felix.framework-3.0.9.jar>
Classpath          [Jar:., Jar:osgi, Jar:org.apache.felix.framework]
[WARNING] Bundle org.apache.karaf:org.apache.karaf.main:bundle:2.2.6-SNAPSHOT : Split package org/osgi/service/startlevel
Use directive -split-package:=(merge-first|merge-last|error|first) on Export/Private Package instruction to get rid of this warning
Package found in   [Jar:osgi, Jar:org.apache.felix.framework]
Reference from     <https://builds.apache.org/job/Karaf-2.2.x/ws/.repository/org/apache/felix/org.apache.felix.framework/3.0.9/org.apache.felix.framework-3.0.9.jar>
Classpath          [Jar:., Jar:osgi, Jar:org.apache.felix.framework]
[WARNING] Bundle org.apache.karaf:org.apache.karaf.main:bundle:2.2.6-SNAPSHOT : Split package org/osgi/service/url
Use directive -split-package:=(merge-first|merge-last|error|first) on Export/Private Package instruction to get rid of this warning
Package found in   [Jar:osgi, Jar:org.apache.felix.framework]
Reference from     <https://builds.apache.org/job/Karaf-2.2.x/ws/.repository/org/apache/felix/org.apache.felix.framework/3.0.9/org.apache.felix.framework-3.0.9.jar>
Classpath          [Jar:., Jar:osgi, Jar:org.apache.felix.framework]
[WARNING] Bundle org.apache.karaf:org.apache.karaf.main:bundle:2.2.6-SNAPSHOT : Split package org/osgi/util/tracker
Use directive -split-package:=(merge-first|merge-last|error|first) on Export/Private Package instruction to get rid of this warning
Package found in   [Jar:osgi, Jar:org.apache.felix.framework]
Reference from     <https://builds.apache.org/job/Karaf-2.2.x/ws/.repository/org/apache/felix/org.apache.felix.framework/3.0.9/org.apache.felix.framework-3.0.9.jar>
Classpath          [Jar:., Jar:osgi, Jar:org.apache.felix.framework]
[INFO] [install:install {execution: default-install}]
[INFO] Installing <https://builds.apache.org/job/Karaf-2.2.x/ws/karaf/main/target/org.apache.karaf.main-2.2.6-SNAPSHOT.jar> to <https://builds.apache.org/job/Karaf-2.2.x/ws/.repository/org/apache/karaf/org.apache.karaf.main/2.2.6-SNAPSHOT/org.apache.karaf.main-2.2.6-SNAPSHOT.jar>
[INFO] [bundle:install {execution: default-install}]
[INFO] Installing org/apache/karaf/org.apache.karaf.main/2.2.6-SNAPSHOT/org.apache.karaf.main-2.2.6-SNAPSHOT.jar
[INFO] Writing OBR metadata
[JENKINS] Archiving <https://builds.apache.org/job/Karaf-2.2.x/ws/karaf/main/pom.xml> to /home/hudson/hudson/jobs/Karaf-2.2.x/modules/org.apache.karaf$org.apache.karaf.main/builds/2012-03-02_09-03-50/archive/org.apache.karaf/org.apache.karaf.main/2.2.6-SNAPSHOT/org.apache.karaf.main-2.2.6-SNAPSHOT.pom
[JENKINS] Archiving <https://builds.apache.org/job/Karaf-2.2.x/ws/karaf/main/target/org.apache.karaf.main-2.2.6-SNAPSHOT.jar> to /home/hudson/hudson/jobs/Karaf-2.2.x/modules/org.apache.karaf$org.apache.karaf.main/builds/2012-03-02_09-03-50/archive/org.apache.karaf/org.apache.karaf.main/2.2.6-SNAPSHOT/org.apache.karaf.main-2.2.6-SNAPSHOT.jar
[INFO] ------------------------------------------------------------------------
[INFO] Building Apache Karaf :: JAAS
[INFO]    task-segment: [clean, install]
[INFO] ------------------------------------------------------------------------
[INFO] [clean:clean {execution: default-clean}]
[INFO] [bundle:cleanVersions {execution: cleanVersions}]
[INFO] [remote-resources:process {execution: default}]
[INFO] [antrun:run {execution: copy-notice}]
[INFO] Executing tasks

main:
     [copy] Warning: Could not find file <https://builds.apache.org/job/Karaf-2.2.x/ws/karaf/jaas/NOTICE> to copy.
[INFO] Executed tasks
[INFO] [site:attach-descriptor {execution: default-attach-descriptor}]
[INFO] [install:install {execution: default-install}]
[INFO] Installing <https://builds.apache.org/job/Karaf-2.2.x/ws/karaf/jaas/pom.xml> to <https://builds.apache.org/job/Karaf-2.2.x/ws/.repository/org/apache/karaf/jaas/jaas/2.2.6-SNAPSHOT/jaas-2.2.6-SNAPSHOT.pom>
[JENKINS] Archiving <https://builds.apache.org/job/Karaf-2.2.x/ws/karaf/jaas/pom.xml> to /home/hudson/hudson/jobs/Karaf-2.2.x/modules/org.apache.karaf.jaas$jaas/builds/2012-03-02_09-03-51/archive/org.apache.karaf.jaas/jaas/2.2.6-SNAPSHOT/jaas-2.2.6-SNAPSHOT.pom
[INFO] ------------------------------------------------------------------------
[INFO] Building Apache Karaf :: JAAS :: Boot
[INFO]    task-segment: [clean, install]
[INFO] ------------------------------------------------------------------------
[INFO] [clean:clean {execution: default-clean}]
[INFO] [bundle:cleanVersions {execution: cleanVersions}]
[INFO] [remote-resources:process {execution: default}]
[INFO] [antrun:run {execution: copy-notice}]
[INFO] Executing tasks

main:
     [copy] Copying 1 file to <https://builds.apache.org/job/Karaf-2.2.x/ws/karaf/jaas/boot/target/maven-shared-archive-resources/META-INF>
[INFO] Executed tasks
[debug] execute contextualize
[INFO] [resources:resources {execution: default-resources}]
[INFO] Using 'UTF-8' encoding to copy filtered resources.
[INFO] Copying 1 resource
[INFO] Copying 1 resource
[INFO] Copying 3 resources
[INFO] [compiler:compile {execution: default-compile}]
[INFO] Compiling 1 source file to <https://builds.apache.org/job/Karaf-2.2.x/ws/karaf/jaas/boot/target/classes>
[debug] execute contextualize
[INFO] [resources:testResources {execution: default-testResources}]
[INFO] Using 'UTF-8' encoding to copy filtered resources.
[INFO] skip non existing resourceDirectory <https://builds.apache.org/job/Karaf-2.2.x/ws/karaf/jaas/boot/src/test/resources>
[INFO] Copying 3 resources
[INFO] [compiler:testCompile {execution: default-testCompile}]
[INFO] No sources to compile
[INFO] [surefire:test {execution: default-test}]
[INFO] Surefire report directory: <https://builds.apache.org/job/Karaf-2.2.x/ws/karaf/jaas/boot/target/surefire-reports>

-------------------------------------------------------
 T E S T S
-------------------------------------------------------

Results :

Tests run: 0, Failures: 0, Errors: 0, Skipped: 0

[JENKINS] Recording test results[INFO] [bundle:bundle {execution: default-bundle}]

[WARNING] Bundle org.apache.karaf.jaas:org.apache.karaf.jaas.boot:bundle:2.2.6-SNAPSHOT : Did not find matching referal for !org.apache.karaf.jaas.boot*
[INFO] [install:install {execution: default-install}]
[INFO] Installing <https://builds.apache.org/job/Karaf-2.2.x/ws/karaf/jaas/boot/target/org.apache.karaf.jaas.boot-2.2.6-SNAPSHOT.jar> to <https://builds.apache.org/job/Karaf-2.2.x/ws/.repository/org/apache/karaf/jaas/org.apache.karaf.jaas.boot/2.2.6-SNAPSHOT/org.apache.karaf.jaas.boot-2.2.6-SNAPSHOT.jar>
[INFO] [bundle:install {execution: default-install}]
[INFO] Installing org/apache/karaf/jaas/org.apache.karaf.jaas.boot/2.2.6-SNAPSHOT/org.apache.karaf.jaas.boot-2.2.6-SNAPSHOT.jar
[INFO] Writing OBR metadata
[JENKINS] Archiving <https://builds.apache.org/job/Karaf-2.2.x/ws/karaf/jaas/boot/pom.xml> to /home/hudson/hudson/jobs/Karaf-2.2.x/modules/org.apache.karaf.jaas$org.apache.karaf.jaas.boot/builds/2012-03-02_09-03-56/archive/org.apache.karaf.jaas/org.apache.karaf.jaas.boot/2.2.6-SNAPSHOT/org.apache.karaf.jaas.boot-2.2.6-SNAPSHOT.pom
[JENKINS] Archiving <https://builds.apache.org/job/Karaf-2.2.x/ws/karaf/jaas/boot/target/org.apache.karaf.jaas.boot-2.2.6-SNAPSHOT.jar> to /home/hudson/hudson/jobs/Karaf-2.2.x/modules/org.apache.karaf.jaas$org.apache.karaf.jaas.boot/builds/2012-03-02_09-03-56/archive/org.apache.karaf.jaas/org.apache.karaf.jaas.boot/2.2.6-SNAPSHOT/org.apache.karaf.jaas.boot-2.2.6-SNAPSHOT.jar
[INFO] ------------------------------------------------------------------------
[INFO] Building Apache Karaf :: JAAS :: Config
[INFO]    task-segment: [clean, install]
[INFO] ------------------------------------------------------------------------
[INFO] [clean:clean {execution: default-clean}]
[INFO] [bundle:cleanVersions {execution: cleanVersions}]
[INFO] [remote-resources:process {execution: default}]
[INFO] snapshot org.apache.karaf.jaas:org.apache.karaf.jaas.boot:2.2.6-SNAPSHOT: checking for updates from fusesource.snapshots
[INFO] snapshot org.apache.karaf.jaas:org.apache.karaf.jaas.boot:2.2.6-SNAPSHOT: checking for updates from ops4j.sonatype.snapshots.deploy
[INFO] snapshot org.apache.karaf.jaas:org.apache.karaf.jaas.boot:2.2.6-SNAPSHOT: checking for updates from apache.snapshots
[INFO] [antrun:run {execution: copy-notice}]
[INFO] Executing tasks

main:
     [copy] Copying 1 file to <https://builds.apache.org/job/Karaf-2.2.x/ws/karaf/jaas/config/target/maven-shared-archive-resources/META-INF>
[INFO] Executed tasks
[debug] execute contextualize
[INFO] [resources:resources {execution: default-resources}]
[INFO] Using 'UTF-8' encoding to copy filtered resources.
[INFO] Copying 4 resources
[INFO] Copying 1 resource
[INFO] Copying 3 resources
[INFO] [compiler:compile {execution: default-compile}]
[INFO] Compiling 12 source files to <https://builds.apache.org/job/Karaf-2.2.x/ws/karaf/jaas/config/target/classes>
[debug] execute contextualize
[INFO] [resources:testResources {execution: default-testResources}]
[INFO] Using 'UTF-8' encoding to copy filtered resources.
[INFO] skip non existing resourceDirectory <https://builds.apache.org/job/Karaf-2.2.x/ws/karaf/jaas/config/src/test/resources>
[INFO] Copying 3 resources
[INFO] [compiler:testCompile {execution: default-testCompile}]
[INFO] No sources to compile
[INFO] [surefire:test {execution: default-test}]
[INFO] Surefire report directory: <https://builds.apache.org/job/Karaf-2.2.x/ws/karaf/jaas/config/target/surefire-reports>

-------------------------------------------------------
 T E S T S
-------------------------------------------------------

Results :

Tests run: 0, Failures: 0, Errors: 0, Skipped: 0

[JENKINS] Recording test results[INFO] [bundle:bundle {execution: default-bundle}]
[INFO] [install:install {execution: default-install}]
[INFO] Installing <https://builds.apache.org/job/Karaf-2.2.x/ws/karaf/jaas/config/target/org.apache.karaf.jaas.config-2.2.6-SNAPSHOT.jar> to <https://builds.apache.org/job/Karaf-2.2.x/ws/.repository/org/apache/karaf/jaas/org.apache.karaf.jaas.config/2.2.6-SNAPSHOT/org.apache.karaf.jaas.config-2.2.6-SNAPSHOT.jar>
[INFO] [bundle:install {execution: default-install}]
[INFO] Installing org/apache/karaf/jaas/org.apache.karaf.jaas.config/2.2.6-SNAPSHOT/org.apache.karaf.jaas.config-2.2.6-SNAPSHOT.jar
[INFO] Writing OBR metadata
Mar 2, 2012 9:05:55 AM hudson.remoting.Channel$ReaderThread run
SEVERE: I/O error in channel channel
java.io.StreamCorruptedException
	at java.io.ObjectInputStream.readObject0(ObjectInputStream.java:1332)
	at java.io.ObjectInputStream.readObject(ObjectInputStream.java:348)
	at hudson.remoting.Channel$ReaderThread.run(Channel.java:1127)
channel stopped
[INFO] ------------------------------------------------------------------------
[ERROR] FATAL ERROR
[INFO] ------------------------------------------------------------------------
[INFO] null
[INFO] ------------------------------------------------------------------------
[INFO] Trace
java.lang.reflect.UndeclaredThrowableException
	at $Proxy2.isArchivingDisabled(Unknown Source)
	at hudson.maven.MavenBuildProxy$Filter.isArchivingDisabled(MavenBuildProxy.java:227)
	at hudson.maven.reporters.MavenArtifact.archive(MavenArtifact.java:223)
	at hudson.maven.reporters.MavenArtifactArchiver.postBuild(MavenArtifactArchiver.java:106)
	at hudson.maven.Maven2Builder.postModule(Maven2Builder.java:127)
	at hudson.maven.MavenBuilder$Adapter.fireLeaveModule(MavenBuilder.java:327)
	at hudson.maven.MavenBuilder$Adapter.postBuild(MavenBuilder.java:285)
	at org.apache.maven.lifecycle.LifecycleExecutorInterceptor.execute(LifecycleExecutorInterceptor.java:68)
	at org.apache.maven.DefaultMaven.doExecute(DefaultMaven.java:328)
	at org.apache.maven.DefaultMaven.execute(DefaultMaven.java:138)
	at org.apache.maven.cli.MavenCli.main(MavenCli.java:362)
	at sun.reflect.NativeMethodAccessorImpl.invoke0(Native Method)
	at sun.reflect.NativeMethodAccessorImpl.invoke(NativeMethodAccessorImpl.java:39)
	at sun.reflect.DelegatingMethodAccessorImpl.invoke(DelegatingMethodAccessorImpl.java:25)
	at java.lang.reflect.Method.invoke(Method.java:592)
	at org.codehaus.classworlds.Launcher.launchEnhanced(Launcher.java:315)
	at org.codehaus.classworlds.Launcher.launch(Launcher.java:255)
	at hudson.maven.agent.Main.launch(Main.java:185)
	at hudson.maven.MavenBuilder.call(MavenBuilder.java:151)
	at hudson.maven.Maven2Builder.call(Maven2Builder.java:77)
	at hudson.maven.Maven2Builder.call(Maven2Builder.java:53)
	at hudson.remoting.UserRequest.perform(UserRequest.java:118)
	at hudson.remoting.UserRequest.perform(UserRequest.java:48)
	at hudson.remoting.Request$2.run(Request.java:287)
	at hudson.remoting.InterceptingExecutorService$1.call(InterceptingExecutorService.java:72)
	at java.util.concurrent.FutureTask$Sync.innerRun(FutureTask.java:269)
	at java.util.concurrent.FutureTask.run(FutureTask.java:123)
	at java.util.concurrent.ThreadPoolExecutor$Worker.runTask(ThreadPoolExecutor.java:651)
	at java.util.concurrent.ThreadPoolExecutor$Worker.run(ThreadPoolExecutor.java:676)
	at java.lang.Thread.run(Thread.java:595)
Caused by: hudson.remoting.ChannelClosedException: channel is already closed
	at hudson.remoting.Channel.send(Channel.java:499)
	at hudson.remoting.Request.call(Request.java:110)
	at hudson.remoting.Channel.call(Channel.java:681)
	at hudson.remoting.RemoteInvocationHandler.invoke(RemoteInvocationHandler.java:158)
	... 30 more
Caused by: java.io.StreamCorruptedException
	at java.io.ObjectInputStream.readObject0(ObjectInputStream.java:1332)
	at java.io.ObjectInputStream.readObject(ObjectInputStream.java:348)
	at hudson.remoting.Channel$ReaderThread.run(Channel.java:1127)
[INFO] ------------------------------------------------------------------------
[INFO] Total time: 1 minute 16 seconds
[INFO] Finished at: Fri Mar 02 09:05:55 UTC 2012

ERROR: Maven JVM terminated unexpectedly with exit code 0