You are viewing a plain text version of this content. The canonical link for it is here.
Posted to commits@beam.apache.org by Apache Jenkins Server <je...@builds.apache.org> on 2018/06/27 06:23:24 UTC
Build failed in Jenkins: beam_PreCommit_Python_Cron #6
See <https://builds.apache.org/job/beam_PreCommit_Python_Cron/6/display/redirect>
------------------------------------------
[...truncated 1.42 MB...]
}
}
component_coder_ids: "ref_Coder_TupleCoder_12"
component_coder_ids: "ref_Coder_GlobalWindowCoder_4"
}
}
coders {
key: "ref_Coder_WindowedValueCoder_13"
value {
spec {
spec {
urn: "beam:coder:windowed_value:v1"
}
}
component_coder_ids: "ref_Coder_VarIntCoder_14"
component_coder_ids: "ref_Coder_GlobalWindowCoder_4"
}
}
coders {
key: "ref_Coder_WindowedValueCoder_15"
value {
spec {
spec {
urn: "beam:coder:windowed_value:v1"
}
}
component_coder_ids: "ref_Coder_FastPrimitivesCoder_3"
component_coder_ids: "ref_Coder_GlobalWindowCoder_4"
}
}
coders {
key: "ref_Coder_WindowedValueCoder_16"
value {
spec {
spec {
urn: "beam:coder:windowed_value:v1"
}
}
component_coder_ids: "ref_Coder_TupleCoder_17"
component_coder_ids: "ref_Coder_GlobalWindowCoder_4"
}
}
coders {
key: "ref_Coder_WindowedValueCoder_18"
value {
spec {
spec {
urn: "beam:coder:windowed_value:v1"
}
}
component_coder_ids: "ref_Coder_TupleCoder_19"
component_coder_ids: "ref_Coder_GlobalWindowCoder_4"
}
}
coders {
key: "ref_Coder_WindowedValueCoder_1_bytes"
value {
spec {
spec {
urn: "beam:coder:windowed_value:v1"
}
}
component_coder_ids: "ref_Coder_TupleCoder_2_bytes"
component_coder_ids: "ref_Coder_GlobalWindowCoder_4"
}
}
coders {
key: "ref_Coder_WindowedValueCoder_1_len_prefix"
value {
spec {
spec {
urn: "beam:coder:windowed_value:v1"
}
}
component_coder_ids: "ref_Coder_TupleCoder_2_len_prefix"
component_coder_ids: "ref_Coder_GlobalWindowCoder_4"
}
}
coders {
key: "ref_Coder_WindowedValueCoder_20"
value {
spec {
spec {
urn: "beam:coder:windowed_value:v1"
}
}
component_coder_ids: "ref_Coder_TupleCoder_21"
component_coder_ids: "ref_Coder_GlobalWindowCoder_4"
}
}
coders {
key: "ref_Coder_WindowedValueCoder_20_bytes"
value {
spec {
spec {
urn: "beam:coder:windowed_value:v1"
}
}
component_coder_ids: "ref_Coder_TupleCoder_21_bytes"
component_coder_ids: "ref_Coder_GlobalWindowCoder_4"
}
}
coders {
key: "ref_Coder_WindowedValueCoder_20_len_prefix"
value {
spec {
spec {
urn: "beam:coder:windowed_value:v1"
}
}
component_coder_ids: "ref_Coder_TupleCoder_21_len_prefix"
component_coder_ids: "ref_Coder_GlobalWindowCoder_4"
}
}
coders {
key: "ref_Coder_WindowedValueCoder_23"
value {
spec {
spec {
urn: "beam:coder:windowed_value:v1"
}
}
component_coder_ids: "ref_Coder_TupleCoder_24"
component_coder_ids: "ref_Coder_GlobalWindowCoder_4"
}
}
coders {
key: "ref_Coder_WindowedValueCoder_5"
value {
spec {
spec {
urn: "beam:coder:windowed_value:v1"
}
}
component_coder_ids: "ref_Coder_TupleCoder_6"
component_coder_ids: "ref_Coder_GlobalWindowCoder_4"
}
}
coders {
key: "ref_Coder_WindowedValueCoder_7"
value {
spec {
spec {
urn: "beam:coder:windowed_value:v1"
}
}
component_coder_ids: "ref_Coder_TupleCoder_8"
component_coder_ids: "ref_Coder_GlobalWindowCoder_4"
}
}
coders {
key: "ref_Coder_WindowedValueCoder_9"
value {
spec {
spec {
urn: "beam:coder:windowed_value:v1"
}
}
component_coder_ids: "ref_Coder_TupleCoder_10"
component_coder_ids: "ref_Coder_GlobalWindowCoder_4"
}
}
}
}
root: DEBUG: CONTROL RESPONSE instruction_id: "control_5"
register {
}
root: DEBUG: CONTROL REQUEST instruction_id: "bundle_56"
process_bundle {
process_bundle_descriptor_reference: "4"
}
root: INFO: start <DoOperation assert_that/Match output_tags=['out']>
root: INFO: start <DoOperation assert_that/Unkey output_tags=['out']>
root: INFO: start <DoOperation assert_that/Group/Map(_merge_tagged_vals_under_key) output_tags=['out']>
root: INFO: start <DataInputOperation assert_that/Group/GroupByKey/Read receivers=[ConsumerSet[assert_that/Group/GroupByKey/Read.out0, coder=WindowedValueCoder[TupleCoder[LengthPrefixCoder[FastPrimitivesCoder], IterableCoder[LengthPrefixCoder[FastPrimitivesCoder]]]], len(consumers)=1]]>
--------------------- >> end captured logging << ---------------------
----------------------------------------------------------------------
XML: <https://builds.apache.org/job/beam_PreCommit_Python_Cron/ws/src/sdks/python/nosetests.xml>
----------------------------------------------------------------------
Ran 1611 tests in 199.790s
FAILED (SKIP=288, errors=1)
ERROR: InvocationError for command '<https://builds.apache.org/job/beam_PreCommit_Python_Cron/ws/src/sdks/python/target/.tox/py27-cython/bin/python> setup.py nosetests' (exited with code 1)
___________________________________ summary ____________________________________
ERROR: py27-cython: commands failed
> Task :beam-sdks-python:testCython FAILED
:beam-sdks-python:testCython (Thread[Task worker for ':' Thread 5,5,main]) completed. Took 5 mins 57.0 secs.
FAILURE: Build completed with 3 failures.
1: Task failed with an exception.
-----------
* Where:
Build file '<https://builds.apache.org/job/beam_PreCommit_Python_Cron/ws/src/sdks/python/build.gradle'> line: 122
* What went wrong:
Execution failed for task ':beam-sdks-python:testGcp'.
> Process 'command 'sh'' finished with non-zero exit value 1
* Try:
Run with --stacktrace option to get the stack trace. Run with --debug option to get more log output. Run with --scan to get full insights.
==============================================================================
2: Task failed with an exception.
-----------
* Where:
Build file '<https://builds.apache.org/job/beam_PreCommit_Python_Cron/ws/src/sdks/python/build.gradle'> line: 132
* What went wrong:
Execution failed for task ':beam-sdks-python:testPython'.
> Process 'command 'sh'' finished with non-zero exit value 1
* Try:
Run with --stacktrace option to get the stack trace. Run with --debug option to get more log output. Run with --scan to get full insights.
==============================================================================
3: Task failed with an exception.
-----------
* Where:
Build file '<https://builds.apache.org/job/beam_PreCommit_Python_Cron/ws/src/sdks/python/build.gradle'> line: 142
* What went wrong:
Execution failed for task ':beam-sdks-python:testCython'.
> Process 'command 'sh'' finished with non-zero exit value 1
* Try:
Run with --stacktrace option to get the stack trace. Run with --debug option to get more log output. Run with --scan to get full insights.
==============================================================================
* Get more help at https://help.gradle.org
Deprecated Gradle features were used in this build, making it incompatible with Gradle 5.0.
See https://docs.gradle.org/4.8/userguide/command_line_interface.html#sec:command_line_warnings
BUILD FAILED in 15m 24s
9 actionable tasks: 9 executed
Publishing build scan...
https://gradle.com/s/i4itpzk6nsgu4
Build step 'Invoke Gradle script' changed build result to FAILURE
Build step 'Invoke Gradle script' marked build as failure
Not sending mail to unregistered user amaliujia@163.com
Not sending mail to unregistered user xiliu@xiliu-ld1.linkedin.biz
Jenkins build is back to normal : beam_PreCommit_Python_Cron #11
Posted by Apache Jenkins Server <je...@builds.apache.org>.
See <https://builds.apache.org/job/beam_PreCommit_Python_Cron/11/display/redirect?page=changes>
Build failed in Jenkins: beam_PreCommit_Python_Cron #10
Posted by Apache Jenkins Server <je...@builds.apache.org>.
See <https://builds.apache.org/job/beam_PreCommit_Python_Cron/10/display/redirect?page=changes>
Changes:
[scott] Fix ErrorProne warnings in sdks-java-core project
[scott] Enable ErrorProne analysis for all Java projects.
[scott] Enable failOnWarnings for all projects.
------------------------------------------
[...truncated 1.42 MB...]
component_coder_ids: "ref_Coder_TupleCoder_11"
component_coder_ids: "ref_Coder_GlobalWindowCoder_3"
}
}
coders {
key: "ref_Coder_WindowedValueCoder_12"
value {
spec {
spec {
urn: "beam:coder:windowed_value:v1"
}
}
component_coder_ids: "ref_Coder_VarIntCoder_13"
component_coder_ids: "ref_Coder_GlobalWindowCoder_3"
}
}
coders {
key: "ref_Coder_WindowedValueCoder_14"
value {
spec {
spec {
urn: "beam:coder:windowed_value:v1"
}
}
component_coder_ids: "ref_Coder_TupleCoder_9"
component_coder_ids: "ref_Coder_GlobalWindowCoder_3"
}
}
coders {
key: "ref_Coder_WindowedValueCoder_14_bytes"
value {
spec {
spec {
urn: "beam:coder:windowed_value:v1"
}
}
component_coder_ids: "ref_Coder_TupleCoder_9_bytes"
component_coder_ids: "ref_Coder_GlobalWindowCoder_3"
}
}
coders {
key: "ref_Coder_WindowedValueCoder_14_len_prefix"
value {
spec {
spec {
urn: "beam:coder:windowed_value:v1"
}
}
component_coder_ids: "ref_Coder_TupleCoder_9_len_prefix"
component_coder_ids: "ref_Coder_GlobalWindowCoder_3"
}
}
coders {
key: "ref_Coder_WindowedValueCoder_15"
value {
spec {
spec {
urn: "beam:coder:windowed_value:v1"
}
}
component_coder_ids: "ref_Coder_TupleCoder_16"
component_coder_ids: "ref_Coder_GlobalWindowCoder_3"
}
}
coders {
key: "ref_Coder_WindowedValueCoder_17"
value {
spec {
spec {
urn: "beam:coder:windowed_value:v1"
}
}
component_coder_ids: "ref_Coder_FastPrimitivesCoder_6"
component_coder_ids: "ref_Coder_GlobalWindowCoder_3"
}
}
coders {
key: "ref_Coder_WindowedValueCoder_18"
value {
spec {
spec {
urn: "beam:coder:windowed_value:v1"
}
}
component_coder_ids: "ref_Coder_TupleCoder_19"
component_coder_ids: "ref_Coder_GlobalWindowCoder_3"
}
}
coders {
key: "ref_Coder_WindowedValueCoder_20"
value {
spec {
spec {
urn: "beam:coder:windowed_value:v1"
}
}
component_coder_ids: "ref_Coder_TupleCoder_21"
component_coder_ids: "ref_Coder_GlobalWindowCoder_3"
}
}
coders {
key: "ref_Coder_WindowedValueCoder_20_bytes"
value {
spec {
spec {
urn: "beam:coder:windowed_value:v1"
}
}
component_coder_ids: "ref_Coder_TupleCoder_21_bytes"
component_coder_ids: "ref_Coder_GlobalWindowCoder_3"
}
}
coders {
key: "ref_Coder_WindowedValueCoder_20_len_prefix"
value {
spec {
spec {
urn: "beam:coder:windowed_value:v1"
}
}
component_coder_ids: "ref_Coder_TupleCoder_21_len_prefix"
component_coder_ids: "ref_Coder_GlobalWindowCoder_3"
}
}
coders {
key: "ref_Coder_WindowedValueCoder_23"
value {
spec {
spec {
urn: "beam:coder:windowed_value:v1"
}
}
component_coder_ids: "ref_Coder_TupleCoder_24"
component_coder_ids: "ref_Coder_GlobalWindowCoder_3"
}
}
coders {
key: "ref_Coder_WindowedValueCoder_4"
value {
spec {
spec {
urn: "beam:coder:windowed_value:v1"
}
}
component_coder_ids: "ref_Coder_TupleCoder_5"
component_coder_ids: "ref_Coder_GlobalWindowCoder_3"
}
}
coders {
key: "ref_Coder_WindowedValueCoder_7"
value {
spec {
spec {
urn: "beam:coder:windowed_value:v1"
}
}
component_coder_ids: "ref_Coder_TupleCoder_8"
component_coder_ids: "ref_Coder_GlobalWindowCoder_3"
}
}
}
}
root: DEBUG: CONTROL RESPONSE instruction_id: "control_5"
register {
}
root: DEBUG: CONTROL REQUEST instruction_id: "bundle_56"
process_bundle {
process_bundle_descriptor_reference: "4"
}
root: INFO: start <DoOperation assert_that/Match output_tags=['out']>
root: INFO: start <DoOperation assert_that/Unkey output_tags=['out']>
root: INFO: start <DoOperation assert_that/Group/Map(_merge_tagged_vals_under_key) output_tags=['out']>
root: INFO: start <DataInputOperation assert_that/Group/GroupByKey/Read receivers=[ConsumerSet[assert_that/Group/GroupByKey/Read.out0, coder=WindowedValueCoder[TupleCoder[LengthPrefixCoder[FastPrimitivesCoder], IterableCoder[LengthPrefixCoder[FastPrimitivesCoder]]]], len(consumers)=1]]>
--------------------- >> end captured logging << ---------------------
----------------------------------------------------------------------
XML: <https://builds.apache.org/job/beam_PreCommit_Python_Cron/ws/src/sdks/python/nosetests.xml>
----------------------------------------------------------------------
Ran 1611 tests in 164.862s
FAILED (SKIP=288, errors=1)
ERROR: InvocationError for command '<https://builds.apache.org/job/beam_PreCommit_Python_Cron/ws/src/sdks/python/target/.tox/py27-cython/bin/python> setup.py nosetests' (exited with code 1)
___________________________________ summary ____________________________________
ERROR: py27-cython: commands failed
> Task :beam-sdks-python:testCython FAILED
:beam-sdks-python:testCython (Thread[Task worker for ':' Thread 14,5,main]) completed. Took 4 mins 57.318 secs.
FAILURE: Build completed with 3 failures.
1: Task failed with an exception.
-----------
* Where:
Build file '<https://builds.apache.org/job/beam_PreCommit_Python_Cron/ws/src/sdks/python/build.gradle'> line: 122
* What went wrong:
Execution failed for task ':beam-sdks-python:testGcp'.
> Process 'command 'sh'' finished with non-zero exit value 1
* Try:
Run with --stacktrace option to get the stack trace. Run with --debug option to get more log output. Run with --scan to get full insights.
==============================================================================
2: Task failed with an exception.
-----------
* Where:
Build file '<https://builds.apache.org/job/beam_PreCommit_Python_Cron/ws/src/sdks/python/build.gradle'> line: 132
* What went wrong:
Execution failed for task ':beam-sdks-python:testPython'.
> Process 'command 'sh'' finished with non-zero exit value 1
* Try:
Run with --stacktrace option to get the stack trace. Run with --debug option to get more log output. Run with --scan to get full insights.
==============================================================================
3: Task failed with an exception.
-----------
* Where:
Build file '<https://builds.apache.org/job/beam_PreCommit_Python_Cron/ws/src/sdks/python/build.gradle'> line: 142
* What went wrong:
Execution failed for task ':beam-sdks-python:testCython'.
> Process 'command 'sh'' finished with non-zero exit value 1
* Try:
Run with --stacktrace option to get the stack trace. Run with --debug option to get more log output. Run with --scan to get full insights.
==============================================================================
* Get more help at https://help.gradle.org
Deprecated Gradle features were used in this build, making it incompatible with Gradle 5.0.
See https://docs.gradle.org/4.8/userguide/command_line_interface.html#sec:command_line_warnings
BUILD FAILED in 13m 9s
9 actionable tasks: 9 executed
Publishing build scan...
https://gradle.com/s/wlux7k47o3jii
Stopped 1 worker daemon(s).
Build step 'Invoke Gradle script' changed build result to FAILURE
Build step 'Invoke Gradle script' marked build as failure
Not sending mail to unregistered user amaliujia@163.com
Not sending mail to unregistered user xiliu@xiliu-ld1.linkedin.biz
Not sending mail to unregistered user klk@google.com
Build failed in Jenkins: beam_PreCommit_Python_Cron #9
Posted by Apache Jenkins Server <je...@builds.apache.org>.
See <https://builds.apache.org/job/beam_PreCommit_Python_Cron/9/display/redirect?page=changes>
Changes:
[iemejia] Fix maven build part 9
------------------------------------------
[...truncated 1.42 MB...]
}
component_coder_ids: "ref_Coder_TupleCoder_11"
component_coder_ids: "ref_Coder_GlobalWindowCoder_3"
}
}
coders {
key: "ref_Coder_WindowedValueCoder_12"
value {
spec {
spec {
urn: "beam:coder:windowed_value:v1"
}
}
component_coder_ids: "ref_Coder_TupleCoder_9"
component_coder_ids: "ref_Coder_GlobalWindowCoder_3"
}
}
coders {
key: "ref_Coder_WindowedValueCoder_12_bytes"
value {
spec {
spec {
urn: "beam:coder:windowed_value:v1"
}
}
component_coder_ids: "ref_Coder_TupleCoder_9_bytes"
component_coder_ids: "ref_Coder_GlobalWindowCoder_3"
}
}
coders {
key: "ref_Coder_WindowedValueCoder_12_len_prefix"
value {
spec {
spec {
urn: "beam:coder:windowed_value:v1"
}
}
component_coder_ids: "ref_Coder_TupleCoder_9_len_prefix"
component_coder_ids: "ref_Coder_GlobalWindowCoder_3"
}
}
coders {
key: "ref_Coder_WindowedValueCoder_13"
value {
spec {
spec {
urn: "beam:coder:windowed_value:v1"
}
}
component_coder_ids: "ref_Coder_VarIntCoder_14"
component_coder_ids: "ref_Coder_GlobalWindowCoder_3"
}
}
coders {
key: "ref_Coder_WindowedValueCoder_15"
value {
spec {
spec {
urn: "beam:coder:windowed_value:v1"
}
}
component_coder_ids: "ref_Coder_FastPrimitivesCoder_6"
component_coder_ids: "ref_Coder_GlobalWindowCoder_3"
}
}
coders {
key: "ref_Coder_WindowedValueCoder_16"
value {
spec {
spec {
urn: "beam:coder:windowed_value:v1"
}
}
component_coder_ids: "ref_Coder_TupleCoder_17"
component_coder_ids: "ref_Coder_GlobalWindowCoder_3"
}
}
coders {
key: "ref_Coder_WindowedValueCoder_18"
value {
spec {
spec {
urn: "beam:coder:windowed_value:v1"
}
}
component_coder_ids: "ref_Coder_TupleCoder_19"
component_coder_ids: "ref_Coder_GlobalWindowCoder_3"
}
}
coders {
key: "ref_Coder_WindowedValueCoder_18_bytes"
value {
spec {
spec {
urn: "beam:coder:windowed_value:v1"
}
}
component_coder_ids: "ref_Coder_TupleCoder_19_bytes"
component_coder_ids: "ref_Coder_GlobalWindowCoder_3"
}
}
coders {
key: "ref_Coder_WindowedValueCoder_18_len_prefix"
value {
spec {
spec {
urn: "beam:coder:windowed_value:v1"
}
}
component_coder_ids: "ref_Coder_TupleCoder_19_len_prefix"
component_coder_ids: "ref_Coder_GlobalWindowCoder_3"
}
}
coders {
key: "ref_Coder_WindowedValueCoder_21"
value {
spec {
spec {
urn: "beam:coder:windowed_value:v1"
}
}
component_coder_ids: "ref_Coder_TupleCoder_22"
component_coder_ids: "ref_Coder_GlobalWindowCoder_3"
}
}
coders {
key: "ref_Coder_WindowedValueCoder_23"
value {
spec {
spec {
urn: "beam:coder:windowed_value:v1"
}
}
component_coder_ids: "ref_Coder_TupleCoder_24"
component_coder_ids: "ref_Coder_GlobalWindowCoder_3"
}
}
coders {
key: "ref_Coder_WindowedValueCoder_4"
value {
spec {
spec {
urn: "beam:coder:windowed_value:v1"
}
}
component_coder_ids: "ref_Coder_TupleCoder_5"
component_coder_ids: "ref_Coder_GlobalWindowCoder_3"
}
}
coders {
key: "ref_Coder_WindowedValueCoder_7"
value {
spec {
spec {
urn: "beam:coder:windowed_value:v1"
}
}
component_coder_ids: "ref_Coder_TupleCoder_8"
component_coder_ids: "ref_Coder_GlobalWindowCoder_3"
}
}
}
}
root: DEBUG: CONTROL RESPONSE instruction_id: "control_5"
register {
}
root: DEBUG: CONTROL REQUEST instruction_id: "bundle_56"
process_bundle {
process_bundle_descriptor_reference: "4"
}
root: INFO: start <DoOperation assert_that/Match output_tags=['out']>
root: INFO: start <DoOperation assert_that/Unkey output_tags=['out']>
root: INFO: start <DoOperation assert_that/Group/Map(_merge_tagged_vals_under_key) output_tags=['out']>
root: INFO: start <DataInputOperation assert_that/Group/GroupByKey/Read receivers=[ConsumerSet[assert_that/Group/GroupByKey/Read.out0, coder=WindowedValueCoder[TupleCoder[LengthPrefixCoder[FastPrimitivesCoder], IterableCoder[LengthPrefixCoder[FastPrimitivesCoder]]]], len(consumers)=1]]>
--------------------- >> end captured logging << ---------------------
----------------------------------------------------------------------
XML: <https://builds.apache.org/job/beam_PreCommit_Python_Cron/ws/src/sdks/python/nosetests.xml>
----------------------------------------------------------------------
Ran 1611 tests in 161.169s
FAILED (SKIP=288, errors=1)
ERROR: InvocationError for command '<https://builds.apache.org/job/beam_PreCommit_Python_Cron/ws/src/sdks/python/target/.tox/py27-cython/bin/python> setup.py nosetests' (exited with code 1)
___________________________________ summary ____________________________________
ERROR: py27-cython: commands failed
> Task :beam-sdks-python:testCython FAILED
:beam-sdks-python:testCython (Thread[Task worker for ':' Thread 9,5,main]) completed. Took 4 mins 52.37 secs.
FAILURE: Build completed with 3 failures.
1: Task failed with an exception.
-----------
* Where:
Build file '<https://builds.apache.org/job/beam_PreCommit_Python_Cron/ws/src/sdks/python/build.gradle'> line: 122
* What went wrong:
Execution failed for task ':beam-sdks-python:testGcp'.
> Process 'command 'sh'' finished with non-zero exit value 1
* Try:
Run with --stacktrace option to get the stack trace. Run with --debug option to get more log output. Run with --scan to get full insights.
==============================================================================
2: Task failed with an exception.
-----------
* Where:
Build file '<https://builds.apache.org/job/beam_PreCommit_Python_Cron/ws/src/sdks/python/build.gradle'> line: 132
* What went wrong:
Execution failed for task ':beam-sdks-python:testPython'.
> Process 'command 'sh'' finished with non-zero exit value 1
* Try:
Run with --stacktrace option to get the stack trace. Run with --debug option to get more log output. Run with --scan to get full insights.
==============================================================================
3: Task failed with an exception.
-----------
* Where:
Build file '<https://builds.apache.org/job/beam_PreCommit_Python_Cron/ws/src/sdks/python/build.gradle'> line: 142
* What went wrong:
Execution failed for task ':beam-sdks-python:testCython'.
> Process 'command 'sh'' finished with non-zero exit value 1
* Try:
Run with --stacktrace option to get the stack trace. Run with --debug option to get more log output. Run with --scan to get full insights.
==============================================================================
* Get more help at https://help.gradle.org
Deprecated Gradle features were used in this build, making it incompatible with Gradle 5.0.
See https://docs.gradle.org/4.8/userguide/command_line_interface.html#sec:command_line_warnings
BUILD FAILED in 13m 14s
9 actionable tasks: 9 executed
Publishing build scan...
https://gradle.com/s/jjqd223xvxhbq
Build step 'Invoke Gradle script' changed build result to FAILURE
Build step 'Invoke Gradle script' marked build as failure
Not sending mail to unregistered user amaliujia@163.com
Not sending mail to unregistered user xiliu@xiliu-ld1.linkedin.biz
Not sending mail to unregistered user klk@google.com
Build failed in Jenkins: beam_PreCommit_Python_Cron #8
Posted by Apache Jenkins Server <je...@builds.apache.org>.
See <https://builds.apache.org/job/beam_PreCommit_Python_Cron/8/display/redirect>
------------------------------------------
[...truncated 1.42 MB...]
}
component_coder_ids: "ref_Coder_FastPrimitivesCoder_3"
component_coder_ids: "ref_Coder_GlobalWindowCoder_6"
}
}
coders {
key: "ref_Coder_WindowedValueCoder_12"
value {
spec {
spec {
urn: "beam:coder:windowed_value:v1"
}
}
component_coder_ids: "ref_Coder_TupleCoder_13"
component_coder_ids: "ref_Coder_GlobalWindowCoder_6"
}
}
coders {
key: "ref_Coder_WindowedValueCoder_14"
value {
spec {
spec {
urn: "beam:coder:windowed_value:v1"
}
}
component_coder_ids: "ref_Coder_TupleCoder_15"
component_coder_ids: "ref_Coder_GlobalWindowCoder_6"
}
}
coders {
key: "ref_Coder_WindowedValueCoder_14_bytes"
value {
spec {
spec {
urn: "beam:coder:windowed_value:v1"
}
}
component_coder_ids: "ref_Coder_TupleCoder_15_bytes"
component_coder_ids: "ref_Coder_GlobalWindowCoder_6"
}
}
coders {
key: "ref_Coder_WindowedValueCoder_14_len_prefix"
value {
spec {
spec {
urn: "beam:coder:windowed_value:v1"
}
}
component_coder_ids: "ref_Coder_TupleCoder_15_len_prefix"
component_coder_ids: "ref_Coder_GlobalWindowCoder_6"
}
}
coders {
key: "ref_Coder_WindowedValueCoder_17"
value {
spec {
spec {
urn: "beam:coder:windowed_value:v1"
}
}
component_coder_ids: "ref_Coder_TupleCoder_18"
component_coder_ids: "ref_Coder_GlobalWindowCoder_6"
}
}
coders {
key: "ref_Coder_WindowedValueCoder_19"
value {
spec {
spec {
urn: "beam:coder:windowed_value:v1"
}
}
component_coder_ids: "ref_Coder_TupleCoder_20"
component_coder_ids: "ref_Coder_GlobalWindowCoder_6"
}
}
coders {
key: "ref_Coder_WindowedValueCoder_22"
value {
spec {
spec {
urn: "beam:coder:windowed_value:v1"
}
}
component_coder_ids: "ref_Coder_TupleCoder_4"
component_coder_ids: "ref_Coder_GlobalWindowCoder_6"
}
}
coders {
key: "ref_Coder_WindowedValueCoder_23"
value {
spec {
spec {
urn: "beam:coder:windowed_value:v1"
}
}
component_coder_ids: "ref_Coder_TupleCoder_5"
component_coder_ids: "ref_Coder_GlobalWindowCoder_6"
}
}
coders {
key: "ref_Coder_WindowedValueCoder_24"
value {
spec {
spec {
urn: "beam:coder:windowed_value:v1"
}
}
component_coder_ids: "ref_Coder_TupleCoder_25"
component_coder_ids: "ref_Coder_GlobalWindowCoder_6"
}
}
coders {
key: "ref_Coder_WindowedValueCoder_7"
value {
spec {
spec {
urn: "beam:coder:windowed_value:v1"
}
}
component_coder_ids: "ref_Coder_VarIntCoder_8"
component_coder_ids: "ref_Coder_GlobalWindowCoder_6"
}
}
coders {
key: "ref_Coder_WindowedValueCoder_9"
value {
spec {
spec {
urn: "beam:coder:windowed_value:v1"
}
}
component_coder_ids: "ref_Coder_TupleCoder_10"
component_coder_ids: "ref_Coder_GlobalWindowCoder_6"
}
}
coders {
key: "ref_Coder_WindowedValueCoder_9_bytes"
value {
spec {
spec {
urn: "beam:coder:windowed_value:v1"
}
}
component_coder_ids: "ref_Coder_TupleCoder_10_bytes"
component_coder_ids: "ref_Coder_GlobalWindowCoder_6"
}
}
coders {
key: "ref_Coder_WindowedValueCoder_9_len_prefix"
value {
spec {
spec {
urn: "beam:coder:windowed_value:v1"
}
}
component_coder_ids: "ref_Coder_TupleCoder_10_len_prefix"
component_coder_ids: "ref_Coder_GlobalWindowCoder_6"
}
}
}
}
root: DEBUG: CONTROL RESPONSE instruction_id: "control_5"
register {
}
root: DEBUG: CONTROL REQUEST instruction_id: "bundle_56"
process_bundle {
process_bundle_descriptor_reference: "4"
}
root: INFO: start <DoOperation assert_that/Match output_tags=['out']>
root: INFO: start <DoOperation assert_that/Unkey output_tags=['out']>
root: INFO: start <DoOperation assert_that/Group/Map(_merge_tagged_vals_under_key) output_tags=['out']>
root: INFO: start <DataInputOperation assert_that/Group/GroupByKey/Read receivers=[ConsumerSet[assert_that/Group/GroupByKey/Read.out0, coder=WindowedValueCoder[TupleCoder[LengthPrefixCoder[FastPrimitivesCoder], IterableCoder[LengthPrefixCoder[FastPrimitivesCoder]]]], len(consumers)=1]]>
--------------------- >> end captured logging << ---------------------
----------------------------------------------------------------------
XML: <https://builds.apache.org/job/beam_PreCommit_Python_Cron/ws/src/sdks/python/nosetests.xml>
----------------------------------------------------------------------
Ran 1611 tests in 159.448s
FAILED (SKIP=288, errors=1)
ERROR: InvocationError for command '<https://builds.apache.org/job/beam_PreCommit_Python_Cron/ws/src/sdks/python/target/.tox/py27-cython/bin/python> setup.py nosetests' (exited with code 1)
___________________________________ summary ____________________________________
ERROR: py27-cython: commands failed
> Task :beam-sdks-python:testCython FAILED
:beam-sdks-python:testCython (Thread[Task worker for ':' Thread 15,5,main]) completed. Took 4 mins 52.048 secs.
FAILURE: Build completed with 3 failures.
1: Task failed with an exception.
-----------
* Where:
Build file '<https://builds.apache.org/job/beam_PreCommit_Python_Cron/ws/src/sdks/python/build.gradle'> line: 122
* What went wrong:
Execution failed for task ':beam-sdks-python:testGcp'.
> Process 'command 'sh'' finished with non-zero exit value 1
* Try:
Run with --stacktrace option to get the stack trace. Run with --debug option to get more log output. Run with --scan to get full insights.
==============================================================================
2: Task failed with an exception.
-----------
* Where:
Build file '<https://builds.apache.org/job/beam_PreCommit_Python_Cron/ws/src/sdks/python/build.gradle'> line: 132
* What went wrong:
Execution failed for task ':beam-sdks-python:testPython'.
> Process 'command 'sh'' finished with non-zero exit value 1
* Try:
Run with --stacktrace option to get the stack trace. Run with --debug option to get more log output. Run with --scan to get full insights.
==============================================================================
3: Task failed with an exception.
-----------
* Where:
Build file '<https://builds.apache.org/job/beam_PreCommit_Python_Cron/ws/src/sdks/python/build.gradle'> line: 142
* What went wrong:
Execution failed for task ':beam-sdks-python:testCython'.
> Process 'command 'sh'' finished with non-zero exit value 1
* Try:
Run with --stacktrace option to get the stack trace. Run with --debug option to get more log output. Run with --scan to get full insights.
==============================================================================
* Get more help at https://help.gradle.org
Deprecated Gradle features were used in this build, making it incompatible with Gradle 5.0.
See https://docs.gradle.org/4.8/userguide/command_line_interface.html#sec:command_line_warnings
BUILD FAILED in 13m 0s
9 actionable tasks: 9 executed
Publishing build scan...
https://gradle.com/s/7bto6r47gkoro
Build step 'Invoke Gradle script' changed build result to FAILURE
Build step 'Invoke Gradle script' marked build as failure
Not sending mail to unregistered user amaliujia@163.com
Not sending mail to unregistered user xiliu@xiliu-ld1.linkedin.biz
Not sending mail to unregistered user klk@google.com
Build failed in Jenkins: beam_PreCommit_Python_Cron #7
Posted by Apache Jenkins Server <je...@builds.apache.org>.
See <https://builds.apache.org/job/beam_PreCommit_Python_Cron/7/display/redirect?page=changes>
Changes:
[klk] Apply rename of JobBuilder to Samza VR job
------------------------------------------
[...truncated 1.42 MB...]
}
component_coder_ids: "ref_Coder_TupleCoder_11"
component_coder_ids: "ref_Coder_GlobalWindowCoder_3"
}
}
coders {
key: "ref_Coder_WindowedValueCoder_12"
value {
spec {
spec {
urn: "beam:coder:windowed_value:v1"
}
}
component_coder_ids: "ref_Coder_VarIntCoder_13"
component_coder_ids: "ref_Coder_GlobalWindowCoder_3"
}
}
coders {
key: "ref_Coder_WindowedValueCoder_14"
value {
spec {
spec {
urn: "beam:coder:windowed_value:v1"
}
}
component_coder_ids: "ref_Coder_TupleCoder_9"
component_coder_ids: "ref_Coder_GlobalWindowCoder_3"
}
}
coders {
key: "ref_Coder_WindowedValueCoder_14_bytes"
value {
spec {
spec {
urn: "beam:coder:windowed_value:v1"
}
}
component_coder_ids: "ref_Coder_TupleCoder_9_bytes"
component_coder_ids: "ref_Coder_GlobalWindowCoder_3"
}
}
coders {
key: "ref_Coder_WindowedValueCoder_14_len_prefix"
value {
spec {
spec {
urn: "beam:coder:windowed_value:v1"
}
}
component_coder_ids: "ref_Coder_TupleCoder_9_len_prefix"
component_coder_ids: "ref_Coder_GlobalWindowCoder_3"
}
}
coders {
key: "ref_Coder_WindowedValueCoder_15"
value {
spec {
spec {
urn: "beam:coder:windowed_value:v1"
}
}
component_coder_ids: "ref_Coder_TupleCoder_16"
component_coder_ids: "ref_Coder_GlobalWindowCoder_3"
}
}
coders {
key: "ref_Coder_WindowedValueCoder_17"
value {
spec {
spec {
urn: "beam:coder:windowed_value:v1"
}
}
component_coder_ids: "ref_Coder_FastPrimitivesCoder_6"
component_coder_ids: "ref_Coder_GlobalWindowCoder_3"
}
}
coders {
key: "ref_Coder_WindowedValueCoder_18"
value {
spec {
spec {
urn: "beam:coder:windowed_value:v1"
}
}
component_coder_ids: "ref_Coder_TupleCoder_19"
component_coder_ids: "ref_Coder_GlobalWindowCoder_3"
}
}
coders {
key: "ref_Coder_WindowedValueCoder_20"
value {
spec {
spec {
urn: "beam:coder:windowed_value:v1"
}
}
component_coder_ids: "ref_Coder_TupleCoder_21"
component_coder_ids: "ref_Coder_GlobalWindowCoder_3"
}
}
coders {
key: "ref_Coder_WindowedValueCoder_20_bytes"
value {
spec {
spec {
urn: "beam:coder:windowed_value:v1"
}
}
component_coder_ids: "ref_Coder_TupleCoder_21_bytes"
component_coder_ids: "ref_Coder_GlobalWindowCoder_3"
}
}
coders {
key: "ref_Coder_WindowedValueCoder_20_len_prefix"
value {
spec {
spec {
urn: "beam:coder:windowed_value:v1"
}
}
component_coder_ids: "ref_Coder_TupleCoder_21_len_prefix"
component_coder_ids: "ref_Coder_GlobalWindowCoder_3"
}
}
coders {
key: "ref_Coder_WindowedValueCoder_23"
value {
spec {
spec {
urn: "beam:coder:windowed_value:v1"
}
}
component_coder_ids: "ref_Coder_TupleCoder_24"
component_coder_ids: "ref_Coder_GlobalWindowCoder_3"
}
}
coders {
key: "ref_Coder_WindowedValueCoder_4"
value {
spec {
spec {
urn: "beam:coder:windowed_value:v1"
}
}
component_coder_ids: "ref_Coder_TupleCoder_5"
component_coder_ids: "ref_Coder_GlobalWindowCoder_3"
}
}
coders {
key: "ref_Coder_WindowedValueCoder_7"
value {
spec {
spec {
urn: "beam:coder:windowed_value:v1"
}
}
component_coder_ids: "ref_Coder_TupleCoder_8"
component_coder_ids: "ref_Coder_GlobalWindowCoder_3"
}
}
}
}
root: DEBUG: CONTROL RESPONSE instruction_id: "control_5"
register {
}
root: DEBUG: CONTROL REQUEST instruction_id: "bundle_56"
process_bundle {
process_bundle_descriptor_reference: "4"
}
root: INFO: start <DoOperation assert_that/Match output_tags=['out']>
root: INFO: start <DoOperation assert_that/Unkey output_tags=['out']>
root: INFO: start <DoOperation assert_that/Group/Map(_merge_tagged_vals_under_key) output_tags=['out']>
root: INFO: start <DataInputOperation assert_that/Group/GroupByKey/Read receivers=[ConsumerSet[assert_that/Group/GroupByKey/Read.out0, coder=WindowedValueCoder[TupleCoder[LengthPrefixCoder[FastPrimitivesCoder], IterableCoder[LengthPrefixCoder[FastPrimitivesCoder]]]], len(consumers)=1]]>
--------------------- >> end captured logging << ---------------------
----------------------------------------------------------------------
XML: <https://builds.apache.org/job/beam_PreCommit_Python_Cron/ws/src/sdks/python/nosetests.xml>
----------------------------------------------------------------------
Ran 1611 tests in 156.925s
FAILED (SKIP=288, errors=1)
ERROR: InvocationError for command '<https://builds.apache.org/job/beam_PreCommit_Python_Cron/ws/src/sdks/python/target/.tox/py27-cython/bin/python> setup.py nosetests' (exited with code 1)
___________________________________ summary ____________________________________
ERROR: py27-cython: commands failed
> Task :beam-sdks-python:testCython FAILED
:beam-sdks-python:testCython (Thread[Task worker for ':' Thread 15,5,main]) completed. Took 4 mins 55.81 secs.
FAILURE: Build completed with 3 failures.
1: Task failed with an exception.
-----------
* Where:
Build file '<https://builds.apache.org/job/beam_PreCommit_Python_Cron/ws/src/sdks/python/build.gradle'> line: 122
* What went wrong:
Execution failed for task ':beam-sdks-python:testGcp'.
> Process 'command 'sh'' finished with non-zero exit value 1
* Try:
Run with --stacktrace option to get the stack trace. Run with --debug option to get more log output. Run with --scan to get full insights.
==============================================================================
2: Task failed with an exception.
-----------
* Where:
Build file '<https://builds.apache.org/job/beam_PreCommit_Python_Cron/ws/src/sdks/python/build.gradle'> line: 132
* What went wrong:
Execution failed for task ':beam-sdks-python:testPython'.
> Process 'command 'sh'' finished with non-zero exit value 1
* Try:
Run with --stacktrace option to get the stack trace. Run with --debug option to get more log output. Run with --scan to get full insights.
==============================================================================
3: Task failed with an exception.
-----------
* Where:
Build file '<https://builds.apache.org/job/beam_PreCommit_Python_Cron/ws/src/sdks/python/build.gradle'> line: 142
* What went wrong:
Execution failed for task ':beam-sdks-python:testCython'.
> Process 'command 'sh'' finished with non-zero exit value 1
* Try:
Run with --stacktrace option to get the stack trace. Run with --debug option to get more log output. Run with --scan to get full insights.
==============================================================================
* Get more help at https://help.gradle.org
Deprecated Gradle features were used in this build, making it incompatible with Gradle 5.0.
See https://docs.gradle.org/4.8/userguide/command_line_interface.html#sec:command_line_warnings
BUILD FAILED in 18m 22s
9 actionable tasks: 9 executed
Publishing build scan...
https://gradle.com/s/7cyoaqdj5xteo
Build step 'Invoke Gradle script' changed build result to FAILURE
Build step 'Invoke Gradle script' marked build as failure
Not sending mail to unregistered user amaliujia@163.com
Not sending mail to unregistered user xiliu@xiliu-ld1.linkedin.biz
Not sending mail to unregistered user klk@google.com