You are viewing a plain text version of this content. The canonical link for it is here.
Posted to builds@beam.apache.org by Apache Jenkins Server <je...@builds.apache.org> on 2023/07/29 12:28:10 UTC
Build failed in Jenkins: beam_PostCommit_Python_Examples_Direct #2144
See <https://ci-beam.apache.org/job/beam_PostCommit_Python_Examples_Direct/2144/display/redirect>
Changes:
------------------------------------------
[...truncated 734.76 KB...]
../../build/gradleenv/417525523/lib/python3.10/site-packages/google/cloud/_http/__init__.py:494: NotFound
During handling of the above exception, another exception occurred:
apache_beam/utils/retry.py:275: in wrapper
return fun(*args, **kwargs)
_ _ _ _ _ _ _ _ _ _ _ _ _ _ _ _ _ _ _ _ _ _ _ _ _ _ _ _ _ _ _ _ _ _ _ _ _ _ _ _
project = 'apache-beam-testing', dataset_id = 'BigQueryTornadoesIT'
table_id = 'monthly_tornadoes_1690633598223'
@retry.with_exponential_backoff(
num_retries=3, retry_filter=retry.retry_on_server_errors_filter)
def delete_bq_table(project, dataset_id, table_id):
"""Delete a BiqQuery table.
Args:
project: Name of the project.
dataset_id: Name of the dataset where table is.
table_id: Name of the table.
"""
_LOGGER.info(
'Clean up a BigQuery table with project: %s, dataset: %s, '
'table: %s.',
project,
dataset_id,
table_id)
client = bigquery.Client(project=project)
table_ref = client.dataset(dataset_id).table(table_id)
try:
client.delete_table(table_ref)
except gexc.NotFound:
> raise GcpTestIOError('BigQuery table does not exist: %s' % table_ref)
E apache_beam.io.gcp.tests.utils.GcpTestIOError: BigQuery table does not exist: apache-beam-testing.BigQueryTornadoesIT.monthly_tornadoes_1690633598223
apache_beam/io/gcp/tests/utils.py:104: GcpTestIOError
------------------------------ Captured log call -------------------------------
WARNING apache_beam.options.pipeline_options:pipeline_options.py:367 Discarding unparseable args: ['--sleep_secs=20', '--kms_key_name=projects/apache-beam-testing/locations/global/keyRings/beam-it/cryptoKeys/test']
INFO apache_beam.runners.portability.fn_api_runner.translations:translations.py:710 ==================== <function annotate_downstream_side_inputs at 0x7f93640e37f0> ====================
INFO apache_beam.runners.portability.fn_api_runner.translations:translations.py:710 ==================== <function fix_side_input_pcoll_coders at 0x7f93640e3910> ====================
INFO apache_beam.runners.portability.fn_api_runner.translations:translations.py:710 ==================== <function pack_combiners at 0x7f93640e3e20> ====================
INFO apache_beam.runners.portability.fn_api_runner.translations:translations.py:710 ==================== <function lift_combiners at 0x7f93640e3eb0> ====================
INFO apache_beam.runners.portability.fn_api_runner.translations:translations.py:710 ==================== <function expand_sdf at 0x7f93641100d0> ====================
INFO apache_beam.runners.portability.fn_api_runner.translations:translations.py:710 ==================== <function expand_gbk at 0x7f9364110160> ====================
INFO apache_beam.runners.portability.fn_api_runner.translations:translations.py:710 ==================== <function sink_flattens at 0x7f9364110280> ====================
INFO apache_beam.runners.portability.fn_api_runner.translations:translations.py:710 ==================== <function greedily_fuse at 0x7f9364110310> ====================
INFO apache_beam.runners.portability.fn_api_runner.translations:translations.py:710 ==================== <function read_to_impulse at 0x7f93641103a0> ====================
INFO apache_beam.runners.portability.fn_api_runner.translations:translations.py:710 ==================== <function impulse_to_input at 0x7f9364110430> ====================
INFO apache_beam.runners.portability.fn_api_runner.translations:translations.py:710 ==================== <function sort_stages at 0x7f9364110670> ====================
INFO apache_beam.runners.portability.fn_api_runner.translations:translations.py:710 ==================== <function add_impulse_to_dangling_transforms at 0x7f9364110790> ====================
INFO apache_beam.runners.portability.fn_api_runner.translations:translations.py:710 ==================== <function setup_timer_mapping at 0x7f93641105e0> ====================
INFO apache_beam.runners.portability.fn_api_runner.translations:translations.py:710 ==================== <function populate_data_channel_coders at 0x7f9364110700> ====================
INFO apache_beam.runners.worker.statecache:statecache.py:234 Creating state cache with size 104857600
INFO apache_beam.runners.portability.fn_api_runner.worker_handlers:worker_handlers.py:903 Created Worker handler <apache_beam.runners.portability.fn_api_runner.worker_handlers.EmbeddedWorkerHandler object at 0x7f933220e260> for environment ref_Environment_default_environment_1 (beam:env:embedded_python:v1, b'')
INFO apache_beam.io.gcp.bigquery_tools:bigquery_tools.py:575 Started BigQuery job: <JobReference
jobId: 'beam_bq_job_EXPORT_BQ_EXPORT_JOB_61aee1ca-0_1690633599_787'
location: 'US'
projectId: 'apache-beam-testing'>
bq show -j --format=prettyjson --project_id=apache-beam-testing beam_bq_job_EXPORT_BQ_EXPORT_JOB_61aee1ca-0_1690633599_787
INFO root:bigquery_tools.py:648 Job apache-beam-testing:US.beam_bq_job_EXPORT_BQ_EXPORT_JOB_61aee1ca-0_1690633599_787 status: RUNNING
INFO root:bigquery_tools.py:648 Job apache-beam-testing:US.beam_bq_job_EXPORT_BQ_EXPORT_JOB_61aee1ca-0_1690633599_787 status: DONE
INFO apache_beam.io.gcp.gcsio:gcsio.py:645 Finished listing 1 files in 0.040497779846191406 seconds.
INFO apache_beam.io.gcp.gcsio:gcsio.py:645 Finished listing 1 files in 0.036817312240600586 seconds.
INFO apache_beam.io.gcp.bigquery_file_loads:bigquery_file_loads.py:702 Load job has 1 files. Job name is beam_bq_job_LOAD_AUTOMATIC_JOB_NAME_LOAD_STEP_a3bcd58b7c014ac3a5ffab030b84302e_db1bcc2eea62adedc0e2b8b9d0b5c5e4_pane0_partition0.
INFO apache_beam.io.gcp.bigquery_file_loads:bigquery_file_loads.py:715 Triggering job beam_bq_job_LOAD_AUTOMATIC_JOB_NAME_LOAD_STEP_a3bcd58b7c014ac3a5ffab030b84302e_db1bcc2eea62adedc0e2b8b9d0b5c5e4_pane0_partition0 to load data to BigQuery table <TableReference
datasetId: 'BigQueryTornadoesIT'
projectId: 'apache-beam-testing'
tableId: 'monthly_tornadoes_1690633598223'>.Schema: {'fields': [{'name': 'month', 'type': 'INTEGER', 'mode': 'NULLABLE'}, {'name': 'tornado_count', 'type': 'INTEGER', 'mode': 'NULLABLE'}]}. Additional parameters: {}. Source format: NEWLINE_DELIMITED_JSON
INFO apache_beam.io.gcp.bigquery_tools:bigquery_tools.py:575 Started BigQuery job: <JobReference
jobId: 'beam_bq_job_LOAD_AUTOMATIC_JOB_NAME_LOAD_STEP_a3bcd58b7c014ac3a5ffab030b84302e_db1bcc2eea62adedc0e2b8b9d0b5c5e4_pane0_partition0'
location: 'US'
projectId: 'apache-beam-testing'>
bq show -j --format=prettyjson --project_id=apache-beam-testing beam_bq_job_LOAD_AUTOMATIC_JOB_NAME_LOAD_STEP_a3bcd58b7c014ac3a5ffab030b84302e_db1bcc2eea62adedc0e2b8b9d0b5c5e4_pane0_partition0
INFO root:bigquery_tools.py:648 Job apache-beam-testing:US.beam_bq_job_LOAD_AUTOMATIC_JOB_NAME_LOAD_STEP_a3bcd58b7c014ac3a5ffab030b84302e_db1bcc2eea62adedc0e2b8b9d0b5c5e4_pane0_partition0 status: RUNNING
INFO root:bigquery_tools.py:648 Job apache-beam-testing:US.beam_bq_job_LOAD_AUTOMATIC_JOB_NAME_LOAD_STEP_a3bcd58b7c014ac3a5ffab030b84302e_db1bcc2eea62adedc0e2b8b9d0b5c5e4_pane0_partition0 status: DONE
INFO apache_beam.io.gcp.tests.bigquery_matcher:bigquery_matcher.py:121 Attempting to perform query SELECT month, tornado_count FROM `BigQueryTornadoesIT.monthly_tornadoes_1690633598223` to BQ
INFO apache_beam.io.gcp.tests.bigquery_matcher:bigquery_matcher.py:96 Read from given query (SELECT month, tornado_count FROM `BigQueryTornadoesIT.monthly_tornadoes_1690633598223`), total rows 12
INFO apache_beam.io.gcp.tests.bigquery_matcher:bigquery_matcher.py:101 Generate checksum: d860e636050c559a16a791aff40d6ad809d4daf0
INFO apache_beam.io.gcp.tests.utils:utils.py:93 Clean up a BigQuery table with project: apache-beam-testing, dataset: BigQueryTornadoesIT, table: monthly_tornadoes_1690633598223.
=============================== warnings summary ===============================
../../build/gradleenv/417525523/lib/python3.10/site-packages/hdfs/config.py:15
<https://ci-beam.apache.org/job/beam_PostCommit_Python_Examples_Direct/ws/src/build/gradleenv/417525523/lib/python3.10/site-packages/hdfs/config.py>:15: DeprecationWarning: the imp module is deprecated in favour of importlib and slated for removal in Python 3.12; see the module's documentation for alternative uses
from imp import load_source
../../build/gradleenv/417525523/lib/python3.10/site-packages/google/rpc/__init__.py:18
<https://ci-beam.apache.org/job/beam_PostCommit_Python_Examples_Direct/ws/src/build/gradleenv/417525523/lib/python3.10/site-packages/google/rpc/__init__.py>:18: DeprecationWarning: pkg_resources is deprecated as an API. See https://setuptools.pypa.io/en/latest/pkg_resources.html
import pkg_resources
../../build/gradleenv/417525523/lib/python3.10/site-packages/pkg_resources/__init__.py:2871: 20 warnings
<https://ci-beam.apache.org/job/beam_PostCommit_Python_Examples_Direct/ws/src/build/gradleenv/417525523/lib/python3.10/site-packages/pkg_resources/__init__.py>:2871: DeprecationWarning: Deprecated call to `pkg_resources.declare_namespace('google')`.
Implementing implicit namespace packages (as specified in PEP 420) is preferred to `pkg_resources.declare_namespace`. See https://setuptools.pypa.io/en/latest/references/keywords.html#keyword-namespace-packages
declare_namespace(pkg)
../../build/gradleenv/417525523/lib/python3.10/site-packages/pkg_resources/__init__.py:2871: 16 warnings
<https://ci-beam.apache.org/job/beam_PostCommit_Python_Examples_Direct/ws/src/build/gradleenv/417525523/lib/python3.10/site-packages/pkg_resources/__init__.py>:2871: DeprecationWarning: Deprecated call to `pkg_resources.declare_namespace('google.cloud')`.
Implementing implicit namespace packages (as specified in PEP 420) is preferred to `pkg_resources.declare_namespace`. See https://setuptools.pypa.io/en/latest/references/keywords.html#keyword-namespace-packages
declare_namespace(pkg)
../../build/gradleenv/417525523/lib/python3.10/site-packages/pkg_resources/__init__.py:2350
../../build/gradleenv/417525523/lib/python3.10/site-packages/pkg_resources/__init__.py:2350
../../build/gradleenv/417525523/lib/python3.10/site-packages/pkg_resources/__init__.py:2350
../../build/gradleenv/417525523/lib/python3.10/site-packages/pkg_resources/__init__.py:2350
<https://ci-beam.apache.org/job/beam_PostCommit_Python_Examples_Direct/ws/src/build/gradleenv/417525523/lib/python3.10/site-packages/pkg_resources/__init__.py>:2350: DeprecationWarning: Deprecated call to `pkg_resources.declare_namespace('google')`.
Implementing implicit namespace packages (as specified in PEP 420) is preferred to `pkg_resources.declare_namespace`. See https://setuptools.pypa.io/en/latest/references/keywords.html#keyword-namespace-packages
declare_namespace(parent)
../../build/gradleenv/417525523/lib/python3.10/site-packages/pkg_resources/__init__.py:2871
<https://ci-beam.apache.org/job/beam_PostCommit_Python_Examples_Direct/ws/src/build/gradleenv/417525523/lib/python3.10/site-packages/pkg_resources/__init__.py>:2871: DeprecationWarning: Deprecated call to `pkg_resources.declare_namespace('google.logging')`.
Implementing implicit namespace packages (as specified in PEP 420) is preferred to `pkg_resources.declare_namespace`. See https://setuptools.pypa.io/en/latest/references/keywords.html#keyword-namespace-packages
declare_namespace(pkg)
../../build/gradleenv/417525523/lib/python3.10/site-packages/pkg_resources/__init__.py:2871
<https://ci-beam.apache.org/job/beam_PostCommit_Python_Examples_Direct/ws/src/build/gradleenv/417525523/lib/python3.10/site-packages/pkg_resources/__init__.py>:2871: DeprecationWarning: Deprecated call to `pkg_resources.declare_namespace('google.iam')`.
Implementing implicit namespace packages (as specified in PEP 420) is preferred to `pkg_resources.declare_namespace`. See https://setuptools.pypa.io/en/latest/references/keywords.html#keyword-namespace-packages
declare_namespace(pkg)
../../build/gradleenv/417525523/lib/python3.10/site-packages/google/rpc/__init__.py:20
<https://ci-beam.apache.org/job/beam_PostCommit_Python_Examples_Direct/ws/src/build/gradleenv/417525523/lib/python3.10/site-packages/google/rpc/__init__.py>:20: DeprecationWarning: Deprecated call to `pkg_resources.declare_namespace('google.rpc')`.
Implementing implicit namespace packages (as specified in PEP 420) is preferred to `pkg_resources.declare_namespace`. See https://setuptools.pypa.io/en/latest/references/keywords.html#keyword-namespace-packages
pkg_resources.declare_namespace(__name__)
../../build/gradleenv/417525523/lib/python3.10/site-packages/google/api_core/operations_v1/abstract_operations_client.py:17
<https://ci-beam.apache.org/job/beam_PostCommit_Python_Examples_Direct/ws/src/build/gradleenv/417525523/lib/python3.10/site-packages/google/api_core/operations_v1/abstract_operations_client.py>:17: DeprecationWarning: The distutils package is deprecated and slated for removal in Python 3.12. Use setuptools or check PEP 632 for potential alternatives
from distutils import util
apache_beam/typehints/pandas_type_compatibility_test.py:67
<https://ci-beam.apache.org/job/beam_PostCommit_Python_Examples_Direct/ws/src/sdks/python/apache_beam/typehints/pandas_type_compatibility_test.py>:67: FutureWarning: pandas.Int64Index is deprecated and will be removed from pandas in a future version. Use pandas.Index with the appropriate dtype instead.
}).set_index(pd.Int64Index(range(123, 223), name='an_index')),
apache_beam/typehints/pandas_type_compatibility_test.py:90
<https://ci-beam.apache.org/job/beam_PostCommit_Python_Examples_Direct/ws/src/sdks/python/apache_beam/typehints/pandas_type_compatibility_test.py>:90: FutureWarning: pandas.Int64Index is deprecated and will be removed from pandas in a future version. Use pandas.Index with the appropriate dtype instead.
pd.Int64Index(range(123, 223), name='an_index'),
apache_beam/typehints/pandas_type_compatibility_test.py:91
<https://ci-beam.apache.org/job/beam_PostCommit_Python_Examples_Direct/ws/src/sdks/python/apache_beam/typehints/pandas_type_compatibility_test.py>:91: FutureWarning: pandas.Int64Index is deprecated and will be removed from pandas in a future version. Use pandas.Index with the appropriate dtype instead.
pd.Int64Index(range(475, 575), name='another_index'),
apache_beam/examples/complete/game/hourly_team_score_it_test.py::HourlyTeamScoreIT::test_hourly_team_score_output_checksum_on_small_input
<https://ci-beam.apache.org/job/beam_PostCommit_Python_Examples_Direct/ws/src/sdks/python/apache_beam/io/gcp/tests/utils.py>:63: PendingDeprecationWarning: Client.dataset is deprecated and will be removed in a future version. Use a string like 'my_project.my_dataset' or a cloud.google.bigquery.DatasetReference object, instead.
dataset_ref = client.dataset(unique_dataset_name, project=project)
apache_beam/examples/complete/game/hourly_team_score_it_test.py::HourlyTeamScoreIT::test_hourly_team_score_output_checksum_on_small_input
apache_beam/examples/cookbook/bigquery_tornadoes_it_test.py::BigqueryTornadoesIT::test_bigquery_tornadoes_it
apache_beam/examples/cookbook/filters_test.py::FiltersTest::test_filters_output_bigquery_matcher
<https://ci-beam.apache.org/job/beam_PostCommit_Python_Examples_Direct/ws/src/sdks/python/apache_beam/io/gcp/bigquery.py>:2101: BeamDeprecationWarning: options is deprecated since First stable release. References to <pipeline>.options will not be supported
is_streaming_pipeline = p.options.view_as(StandardOptions).streaming
apache_beam/examples/complete/game/hourly_team_score_it_test.py::HourlyTeamScoreIT::test_hourly_team_score_output_checksum_on_small_input
apache_beam/examples/cookbook/bigquery_tornadoes_it_test.py::BigqueryTornadoesIT::test_bigquery_tornadoes_it
apache_beam/examples/cookbook/filters_test.py::FiltersTest::test_filters_output_bigquery_matcher
<https://ci-beam.apache.org/job/beam_PostCommit_Python_Examples_Direct/ws/src/sdks/python/apache_beam/io/gcp/bigquery.py>:2107: BeamDeprecationWarning: options is deprecated since First stable release. References to <pipeline>.options will not be supported
experiments = p.options.view_as(DebugOptions).experiments or []
apache_beam/examples/complete/game/hourly_team_score_it_test.py::HourlyTeamScoreIT::test_hourly_team_score_output_checksum_on_small_input
apache_beam/examples/cookbook/bigquery_tornadoes_it_test.py::BigqueryTornadoesIT::test_bigquery_tornadoes_it
apache_beam/examples/cookbook/filters_test.py::FiltersTest::test_filters_output_bigquery_matcher
<https://ci-beam.apache.org/job/beam_PostCommit_Python_Examples_Direct/ws/src/sdks/python/apache_beam/io/gcp/bigquery_file_loads.py>:1183: BeamDeprecationWarning: options is deprecated since First stable release. References to <pipeline>.options will not be supported
temp_location = p.options.view_as(GoogleCloudOptions).temp_location
apache_beam/examples/complete/game/hourly_team_score_it_test.py::HourlyTeamScoreIT::test_hourly_team_score_output_checksum_on_small_input
apache_beam/examples/cookbook/bigquery_tornadoes_it_test.py::BigqueryTornadoesIT::test_bigquery_tornadoes_it
apache_beam/examples/cookbook/filters_test.py::FiltersTest::test_filters_output_bigquery_matcher
<https://ci-beam.apache.org/job/beam_PostCommit_Python_Examples_Direct/ws/src/sdks/python/apache_beam/io/gcp/bigquery_file_loads.py>:1185: BeamDeprecationWarning: options is deprecated since First stable release. References to <pipeline>.options will not be supported
p.options.view_as(GoogleCloudOptions).job_name or 'AUTOMATIC_JOB_NAME')
apache_beam/examples/cookbook/bigquery_side_input_it_test.py::BigQuerySideInputIT::test_bigquery_side_input_it
apache_beam/examples/cookbook/bigquery_side_input_it_test.py::BigQuerySideInputIT::test_bigquery_side_input_it
apache_beam/examples/cookbook/bigquery_tornadoes_it_test.py::BigqueryTornadoesIT::test_bigquery_tornadoes_it
apache_beam/examples/cookbook/filters_test.py::FiltersTest::test_filters_output_bigquery_matcher
apache_beam/examples/dataframe/flight_delays_it_test.py::FlightDelaysTest::test_flight_delays
<https://ci-beam.apache.org/job/beam_PostCommit_Python_Examples_Direct/ws/src/sdks/python/apache_beam/io/gcp/bigquery.py>:2744: BeamDeprecationWarning: options is deprecated since First stable release. References to <pipeline>.options will not be supported
temp_location = pcoll.pipeline.options.view_as(
apache_beam/examples/cookbook/bigquery_side_input_it_test.py::BigQuerySideInputIT::test_bigquery_side_input_it
apache_beam/examples/cookbook/bigquery_side_input_it_test.py::BigQuerySideInputIT::test_bigquery_side_input_it
apache_beam/examples/cookbook/bigquery_tornadoes_it_test.py::BigqueryTornadoesIT::test_bigquery_tornadoes_it
apache_beam/examples/cookbook/filters_test.py::FiltersTest::test_filters_output_bigquery_matcher
apache_beam/examples/dataframe/flight_delays_it_test.py::FlightDelaysTest::test_flight_delays
<https://ci-beam.apache.org/job/beam_PostCommit_Python_Examples_Direct/ws/src/sdks/python/apache_beam/io/gcp/bigquery.py>:2746: BeamDeprecationWarning: options is deprecated since First stable release. References to <pipeline>.options will not be supported
job_name = pcoll.pipeline.options.view_as(GoogleCloudOptions).job_name
apache_beam/examples/cookbook/bigquery_side_input_it_test.py::BigQuerySideInputIT::test_bigquery_side_input_it
apache_beam/examples/cookbook/bigquery_side_input_it_test.py::BigQuerySideInputIT::test_bigquery_side_input_it
apache_beam/examples/cookbook/bigquery_tornadoes_it_test.py::BigqueryTornadoesIT::test_bigquery_tornadoes_it
apache_beam/examples/cookbook/filters_test.py::FiltersTest::test_filters_output_bigquery_matcher
apache_beam/examples/dataframe/flight_delays_it_test.py::FlightDelaysTest::test_flight_delays
<https://ci-beam.apache.org/job/beam_PostCommit_Python_Examples_Direct/ws/src/sdks/python/apache_beam/io/gcp/bigquery.py>:2770: BeamDeprecationWarning: options is deprecated since First stable release. References to <pipeline>.options will not be supported
pipeline_options=pcoll.pipeline.options,
apache_beam/examples/cookbook/bigquery_tornadoes_it_test.py::BigqueryTornadoesIT::test_bigquery_tornadoes_it
apache_beam/examples/cookbook/filters_test.py::FiltersTest::test_filters_output_bigquery_matcher
<https://ci-beam.apache.org/job/beam_PostCommit_Python_Examples_Direct/ws/src/sdks/python/apache_beam/io/gcp/bigquery.py>:2097: BeamDeprecationWarning: options is deprecated since First stable release. References to <pipeline>.options will not be supported
self.table_reference.projectId = pcoll.pipeline.options.view_as(
apache_beam/examples/cookbook/bigquery_tornadoes_it_test.py::BigqueryTornadoesIT::test_bigquery_tornadoes_it
apache_beam/examples/cookbook/filters_test.py::FiltersTest::test_filters_output_bigquery_matcher
<https://ci-beam.apache.org/job/beam_PostCommit_Python_Examples_Direct/ws/src/sdks/python/apache_beam/io/gcp/bigquery_file_loads.py>:1176: BeamDeprecationWarning: options is deprecated since First stable release. References to <pipeline>.options will not be supported
self.project = self.project or p.options.view_as(GoogleCloudOptions).project
apache_beam/examples/cookbook/bigquery_tornadoes_it_test.py::BigqueryTornadoesIT::test_bigquery_tornadoes_it
apache_beam/examples/cookbook/filters_test.py::FiltersTest::test_filters_output_bigquery_matcher
<https://ci-beam.apache.org/job/beam_PostCommit_Python_Examples_Direct/ws/src/sdks/python/apache_beam/io/gcp/tests/utils.py>:100: PendingDeprecationWarning: Client.dataset is deprecated and will be removed in a future version. Use a string like 'my_project.my_dataset' or a cloud.google.bigquery.DatasetReference object, instead.
table_ref = client.dataset(dataset_id).table(table_id)
apache_beam/examples/dataframe/flight_delays_it_test.py: 46 warnings
<https://ci-beam.apache.org/job/beam_PostCommit_Python_Examples_Direct/ws/src/sdks/python/apache_beam/examples/dataframe/flight_delays.py>:47: FutureWarning: The default value of numeric_only in DataFrame.mean is deprecated. In a future version, it will default to False. In addition, specifying 'numeric_only=None' is deprecated. Select only valid columns or specify the value of numeric_only to silence this warning.
return airline_df[at_top_airports].mean()
apache_beam/examples/dataframe/flight_delays_it_test.py::FlightDelaysTest::test_flight_delays
apache_beam/examples/dataframe/wordcount_test.py::WordCountTest::test_basics
<https://ci-beam.apache.org/job/beam_PostCommit_Python_Examples_Direct/ws/src/sdks/python/apache_beam/io/fileio.py>:593: BeamDeprecationWarning: options is deprecated since First stable release. References to <pipeline>.options will not be supported
p.options.view_as(GoogleCloudOptions).temp_location or
-- Docs: https://docs.pytest.org/en/stable/how-to/capture-warnings.html
- generated xml file: <https://ci-beam.apache.org/job/beam_PostCommit_Python_Examples_Direct/ws/src/sdks/python/pytest_postCommitExamples-direct-py310.xml> -
=========================== short test summary info ============================
FAILED apache_beam/examples/cookbook/bigquery_tornadoes_it_test.py::BigqueryTornadoesIT::test_bigquery_tornadoes_it - apache_beam.io.gcp.tests.utils.GcpTestIOError: BigQuery table does not exist: apache-beam-testing.BigQueryTornadoesIT.monthly_tornadoes_1690633598223
= 1 failed, 22 passed, 15 skipped, 6925 deselected, 131 warnings in 228.79s (0:03:48) =
> Task :sdks:python:test-suites:direct:py310:examples FAILED
FAILURE: Build failed with an exception.
* Where:
Script '<https://ci-beam.apache.org/job/beam_PostCommit_Python_Examples_Direct/ws/src/sdks/python/test-suites/direct/common.gradle'> line: 93
* What went wrong:
Execution failed for task ':sdks:python:test-suites:direct:py310:examples'.
> Process 'command 'sh'' finished with non-zero exit value 1
* Try:
> Run with --stacktrace option to get the stack trace.
> Run with --info or --debug option to get more log output.
* Get more help at https://help.gradle.org
Deprecated Gradle features were used in this build, making it incompatible with Gradle 8.0.
You can use '--warning-mode all' to show the individual deprecation warnings and determine if they come from your own scripts or plugins.
See https://docs.gradle.org/7.6.2/userguide/command_line_interface.html#sec:command_line_warnings
BUILD FAILED in 5m 40s
24 actionable tasks: 18 executed, 4 from cache, 2 up-to-date
Publishing build scan...
https://ge.apache.org/s/fji3ohobenkey
Build step 'Invoke Gradle script' changed build result to FAILURE
Build step 'Invoke Gradle script' marked build as failure
---------------------------------------------------------------------
To unsubscribe, e-mail: builds-unsubscribe@beam.apache.org
For additional commands, e-mail: builds-help@beam.apache.org
Jenkins build is back to normal : beam_PostCommit_Python_Examples_Direct #2145
Posted by Apache Jenkins Server <je...@builds.apache.org>.
See <https://ci-beam.apache.org/job/beam_PostCommit_Python_Examples_Direct/2145/display/redirect>
---------------------------------------------------------------------
To unsubscribe, e-mail: builds-unsubscribe@beam.apache.org
For additional commands, e-mail: builds-help@beam.apache.org