You are viewing a plain text version of this content. The canonical link for it is here.
Posted to builds@beam.apache.org by Apache Jenkins Server <je...@builds.apache.org> on 2023/01/27 14:47:45 UTC
Build failed in Jenkins: beam_PerformanceTests_WordCountIT_Py37 #5348
See <https://ci-beam.apache.org/job/beam_PerformanceTests_WordCountIT_Py37/5348/display/redirect?page=changes>
Changes:
[relax] update GCP cloud libraries BOM to 26.5.0
------------------------------------------
[...truncated 78.14 KB...]
Collecting azure-core>=1.7.0
Using cached azure_core-1.26.2-py3-none-any.whl (173 kB)
Collecting azure-identity>=1.12.0
Using cached azure_identity-1.12.0-py3-none-any.whl (135 kB)
Collecting boto3>=1.9
Using cached boto3-1.26.58-py3-none-any.whl (132 kB)
Requirement already satisfied: six>=1.11.0 in <https://ci-beam.apache.org/job/beam_PerformanceTests_WordCountIT_Py37/ws/src/build/gradleenv/-1734967052/lib/python3.7/site-packages> (from azure-core>=1.7.0->apache-beam==2.46.0.dev0) (1.16.0)
Collecting msal-extensions<2.0.0,>=0.3.0
Using cached msal_extensions-1.0.0-py2.py3-none-any.whl (19 kB)
Collecting msal<2.0.0,>=1.12.0
Using cached msal-1.20.0-py2.py3-none-any.whl (90 kB)
Collecting msrest>=0.7.1
Using cached msrest-0.7.1-py3-none-any.whl (85 kB)
Collecting s3transfer<0.7.0,>=0.6.0
Using cached s3transfer-0.6.0-py3-none-any.whl (79 kB)
Collecting botocore<1.30.0,>=1.29.58
Using cached botocore-1.29.58-py3-none-any.whl (10.4 MB)
Collecting jmespath<2.0.0,>=0.7.1
Using cached jmespath-1.0.1-py3-none-any.whl (20 kB)
Collecting cffi>=1.12
Using cached cffi-1.15.1-cp37-cp37m-manylinux_2_17_x86_64.manylinux2014_x86_64.whl (427 kB)
Collecting oauth2client>=1.4.12
Using cached oauth2client-4.1.3-py2.py3-none-any.whl (98 kB)
Collecting rsa<5,>=3.1.4
Using cached rsa-4.9-py3-none-any.whl (34 kB)
Collecting pyasn1-modules>=0.2.1
Using cached pyasn1_modules-0.2.8-py2.py3-none-any.whl (155 kB)
Collecting google-api-core[grpc]!=2.0.*,!=2.1.*,!=2.2.*,!=2.3.0,<3.0.0dev,>=1.31.5
Using cached google_api_core-2.11.0-py3-none-any.whl (120 kB)
Requirement already satisfied: packaging>=20.0.0 in <https://ci-beam.apache.org/job/beam_PerformanceTests_WordCountIT_Py37/ws/src/build/gradleenv/-1734967052/lib/python3.7/site-packages> (from google-cloud-bigquery<4,>=1.6.0->apache-beam==2.46.0.dev0) (23.0)
Collecting google-resumable-media<3.0dev,>=0.6.0
Using cached google_resumable_media-2.4.1-py2.py3-none-any.whl (77 kB)
Collecting grpc-google-iam-v1<0.13dev,>=0.12.3
Using cached grpc_google_iam_v1-0.12.6-py2.py3-none-any.whl (26 kB)
Collecting grpcio-status>=1.33.2
Using cached grpcio_status-1.51.1-py3-none-any.whl (5.1 kB)
Collecting overrides<7.0.0,>=6.0.1
Using cached overrides-6.5.0-py3-none-any.whl (17 kB)
Collecting sqlparse>=0.3.0
Using cached sqlparse-0.4.3-py3-none-any.whl (42 kB)
Collecting docopt
Using cached docopt-0.6.2-py2.py3-none-any.whl
Collecting pyparsing!=3.0.0,!=3.0.1,!=3.0.2,!=3.0.3,<4,>=2.4.2
Using cached pyparsing-3.0.9-py3-none-any.whl (98 kB)
Collecting sortedcontainers<3.0.0,>=2.1.0
Using cached sortedcontainers-2.4.0-py2.py3-none-any.whl (29 kB)
Collecting attrs>=19.2.0
Using cached attrs-22.2.0-py3-none-any.whl (60 kB)
Collecting exceptiongroup>=1.0.0
Using cached exceptiongroup-1.1.0-py3-none-any.whl (14 kB)
Collecting pbr>=0.11
Using cached pbr-5.11.1-py2.py3-none-any.whl (112 kB)
Collecting iniconfig
Using cached iniconfig-2.0.0-py3-none-any.whl (5.9 kB)
Requirement already satisfied: pluggy<2.0,>=0.12 in <https://ci-beam.apache.org/job/beam_PerformanceTests_WordCountIT_Py37/ws/src/build/gradleenv/-1734967052/lib/python3.7/site-packages> (from pytest<8.0,>=7.1.2->apache-beam==2.46.0.dev0) (1.0.0)
Requirement already satisfied: importlib-metadata>=0.12 in <https://ci-beam.apache.org/job/beam_PerformanceTests_WordCountIT_Py37/ws/src/build/gradleenv/-1734967052/lib/python3.7/site-packages> (from pytest<8.0,>=7.1.2->apache-beam==2.46.0.dev0) (2.1.3)
Collecting tomli>=1.0.0
Using cached tomli-2.0.1-py3-none-any.whl (12 kB)
Collecting execnet>=1.1
Using cached execnet-1.9.0-py2.py3-none-any.whl (39 kB)
Collecting pytest-forked
Using cached pytest_forked-1.4.0-py3-none-any.whl (4.9 kB)
Collecting idna<4,>=2.5
Using cached idna-3.4-py3-none-any.whl (61 kB)
Collecting certifi>=2017.4.17
Using cached certifi-2022.12.7-py3-none-any.whl (155 kB)
Collecting urllib3<1.27,>=1.21.1
Using cached urllib3-1.26.14-py2.py3-none-any.whl (140 kB)
Collecting charset-normalizer<4,>=2
Using cached charset_normalizer-3.0.1-cp37-cp37m-manylinux_2_17_x86_64.manylinux2014_x86_64.whl (170 kB)
Collecting threadpoolctl>=2.0.0
Using cached threadpoolctl-3.1.0-py3-none-any.whl (14 kB)
Collecting scipy>=1.1.0
Using cached scipy-1.7.3-cp37-cp37m-manylinux_2_12_x86_64.manylinux2010_x86_64.whl (38.1 MB)
Collecting greenlet!=0.4.17
Using cached greenlet-2.0.1-cp37-cp37m-manylinux_2_17_x86_64.manylinux2014_x86_64.whl (514 kB)
Collecting docker>=4.0.0
Using cached docker-6.0.1-py3-none-any.whl (147 kB)
Collecting wrapt
Using cached wrapt-1.14.1-cp37-cp37m-manylinux_2_5_x86_64.manylinux1_x86_64.manylinux_2_17_x86_64.manylinux2014_x86_64.whl (75 kB)
Collecting deprecation
Using cached deprecation-2.1.0-py2.py3-none-any.whl (11 kB)
Collecting pymysql
Using cached PyMySQL-1.0.2-py3-none-any.whl (43 kB)
Collecting pycparser
Using cached pycparser-2.21-py2.py3-none-any.whl (118 kB)
Collecting websocket-client>=0.32.0
Using cached websocket_client-1.5.0-py3-none-any.whl (55 kB)
Collecting googleapis-common-protos<2.0dev,>=1.56.2
Using cached googleapis_common_protos-1.58.0-py2.py3-none-any.whl (223 kB)
Collecting google-crc32c<2.0dev,>=1.0
Using cached google_crc32c-1.5.0-cp37-cp37m-manylinux_2_17_x86_64.manylinux2014_x86_64.whl (32 kB)
Collecting grpcio-status>=1.33.2
Using cached grpcio_status-1.50.0-py3-none-any.whl (14 kB)
Using cached grpcio_status-1.49.1-py3-none-any.whl (14 kB)
Using cached grpcio_status-1.48.2-py3-none-any.whl (14 kB)
Requirement already satisfied: zipp>=0.5 in <https://ci-beam.apache.org/job/beam_PerformanceTests_WordCountIT_Py37/ws/src/build/gradleenv/-1734967052/lib/python3.7/site-packages> (from importlib-metadata>=0.12->pytest<8.0,>=7.1.2->apache-beam==2.46.0.dev0) (3.11.0)
Collecting PyJWT[crypto]<3,>=1.0.0
Using cached PyJWT-2.6.0-py3-none-any.whl (20 kB)
Collecting portalocker<3,>=1.0
Using cached portalocker-2.7.0-py2.py3-none-any.whl (15 kB)
Collecting requests-oauthlib>=0.5.0
Using cached requests_oauthlib-1.3.1-py2.py3-none-any.whl (23 kB)
Collecting isodate>=0.6.0
Using cached isodate-0.6.1-py2.py3-none-any.whl (41 kB)
Collecting pyasn1>=0.1.7
Using cached pyasn1-0.4.8-py2.py3-none-any.whl (77 kB)
Requirement already satisfied: py in <https://ci-beam.apache.org/job/beam_PerformanceTests_WordCountIT_Py37/ws/src/build/gradleenv/-1734967052/lib/python3.7/site-packages> (from pytest-forked->pytest-xdist<3,>=2.5.0->apache-beam==2.46.0.dev0) (1.11.0)
Collecting oauthlib>=3.0.0
Using cached oauthlib-3.2.2-py3-none-any.whl (151 kB)
Building wheels for collected packages: apache-beam
Building wheel for apache-beam (setup.py): started
Building wheel for apache-beam (setup.py): finished with status 'done'
Created wheel for apache-beam: filename=apache_beam-2.46.0.dev0-py3-none-any.whl size=2985446 sha256=4529d8e57c9ff76cfd2564cd2e1135a9aed7942bf1d7e217ef31f8eff4f1e563
Stored in directory: /home/jenkins/.cache/pip/wheels/7f/41/08/a0bdba888438d3601d5ccb8022b61157f771f1ffdf7528eb92
Successfully built apache-beam
Installing collected packages: sortedcontainers, pytz, pyasn1, parameterized, docopt, crcmod, charset-normalizer, zstandard, wrapt, websocket-client, urllib3, tomli, threadpoolctl, tenacity, sqlparse, scipy, rsa, regex, pyyaml, python-dateutil, pyparsing, pymysql, pymongo, PyJWT, pyhamcrest, pycparser, pyasn1-modules, pyarrow, psycopg2-binary, proto-plus, portalocker, pbr, overrides, orjson, objsize, oauthlib, joblib, jmespath, isodate, iniconfig, idna, greenlet, googleapis-common-protos, google-crc32c, fasteners, fastavro, execnet, exceptiongroup, dill, deprecation, cloudpickle, certifi, cachetools, attrs, sqlalchemy, scikit-learn, requests, pydot, pandas, mock, hypothesis, httplib2, grpcio-status, google-resumable-media, google-auth, freezegun, cffi, botocore, s3transfer, requests-oauthlib, requests_mock, pytest, oauth2client, hdfs, grpc-google-iam-v1, google-auth-httplib2, google-api-core, docker, cryptography, azure-core, testcontainers, pytest-timeout, pytest-forked, msrest, google-cloud-core, google-apitools, boto3, apache-beam, pytest-xdist, msal, google-cloud-vision, google-cloud-videointelligence, google-cloud-spanner, google-cloud-recommendations-ai, google-cloud-pubsub, google-cloud-language, google-cloud-dlp, google-cloud-datastore, google-cloud-bigtable, google-cloud-bigquery-storage, google-cloud-bigquery, azure-storage-blob, msal-extensions, google-cloud-pubsublite, azure-identity
Successfully installed PyJWT-2.6.0 apache-beam-2.46.0.dev0 attrs-22.2.0 azure-core-1.26.2 azure-identity-1.12.0 azure-storage-blob-12.14.1 boto3-1.26.58 botocore-1.29.58 cachetools-4.2.4 certifi-2022.12.7 cffi-1.15.1 charset-normalizer-3.0.1 cloudpickle-2.2.1 crcmod-1.7 cryptography-39.0.0 deprecation-2.1.0 dill-0.3.1.1 docker-6.0.1 docopt-0.6.2 exceptiongroup-1.1.0 execnet-1.9.0 fastavro-1.7.0 fasteners-0.18 freezegun-1.2.2 google-api-core-2.11.0 google-apitools-0.5.31 google-auth-2.16.0 google-auth-httplib2-0.1.0 google-cloud-bigquery-3.4.2 google-cloud-bigquery-storage-2.16.2 google-cloud-bigtable-1.7.3 google-cloud-core-2.3.2 google-cloud-datastore-1.15.5 google-cloud-dlp-3.11.1 google-cloud-language-1.3.2 google-cloud-pubsub-2.14.0 google-cloud-pubsublite-1.6.0 google-cloud-recommendations-ai-0.7.1 google-cloud-spanner-3.27.0 google-cloud-videointelligence-1.16.3 google-cloud-vision-3.3.1 google-crc32c-1.5.0 google-resumable-media-2.4.1 googleapis-common-protos-1.58.0 greenlet-2.0.1 grpc-google-iam-v1-0.12.6 grpcio-status-1.48.2 hdfs-2.7.0 httplib2-0.21.0 hypothesis-6.65.2 idna-3.4 iniconfig-2.0.0 isodate-0.6.1 jmespath-1.0.1 joblib-1.2.0 mock-2.0.0 msal-1.20.0 msal-extensions-1.0.0 msrest-0.7.1 oauth2client-4.1.3 oauthlib-3.2.2 objsize-0.6.1 orjson-3.8.5 overrides-6.5.0 pandas-1.3.5 parameterized-0.8.1 pbr-5.11.1 portalocker-2.7.0 proto-plus-1.22.2 psycopg2-binary-2.9.5 pyarrow-9.0.0 pyasn1-0.4.8 pyasn1-modules-0.2.8 pycparser-2.21 pydot-1.4.2 pyhamcrest-1.10.1 pymongo-3.13.0 pymysql-1.0.2 pyparsing-3.0.9 pytest-7.2.1 pytest-forked-1.4.0 pytest-timeout-2.1.0 pytest-xdist-2.5.0 python-dateutil-2.8.2 pytz-2022.7.1 pyyaml-6.0 regex-2022.10.31 requests-2.28.2 requests-oauthlib-1.3.1 requests_mock-1.10.0 rsa-4.9 s3transfer-0.6.0 scikit-learn-1.0.2 scipy-1.7.3 sortedcontainers-2.4.0 sqlalchemy-1.4.46 sqlparse-0.4.3 tenacity-5.1.5 testcontainers-3.7.1 threadpoolctl-3.1.0 tomli-2.0.1 urllib3-1.26.14 websocket-client-1.5.0 wrapt-1.14.1 zstandard-0.19.0
:sdks:python:test-suites:dataflow:py37:installGcpTest (Thread[Execution **** Thread 7,5,main]) completed. Took 47.731 secs.
Resolve mutations for :sdks:python:test-suites:dataflow:py37:runPerformanceTest (Thread[included builds,5,main]) started.
Resolve mutations for :sdks:python:test-suites:dataflow:py37:runPerformanceTest (Thread[included builds,5,main]) completed. Took 0.0 secs.
:sdks:python:test-suites:dataflow:py37:runPerformanceTest (Thread[Execution **** Thread 4,5,main]) started.
> Task :sdks:python:test-suites:dataflow:py37:runPerformanceTest
Caching disabled for task ':sdks:python:test-suites:dataflow:py37:runPerformanceTest' because:
Gradle would require more information to cache this task
Task ':sdks:python:test-suites:dataflow:py37:runPerformanceTest' is not up-to-date because:
Task has not declared any outputs despite executing actions.
Starting process 'command 'sh''. Working directory: <https://ci-beam.apache.org/job/beam_PerformanceTests_WordCountIT_Py37/ws/src/sdks/python> Command: sh -c . <https://ci-beam.apache.org/job/beam_PerformanceTests_WordCountIT_Py37/ws/src/build/gradleenv/-1734967052/bin/activate> && pytest -o junit_suite_name=runPerformanceTest-df-py37 apache_beam/examples/wordcount_it_test.py::WordCountIT::test_wordcount_it --test-pipeline-options="--project=apache-beam-testing --region=us-central1 --staging_location=gs://temp-storage-for-end-to-end-tests/staging-it --temp_location=gs://temp-storage-for-end-to-end-tests/temp-it --job_name=performance-tests-wordcount-python37-batch-1gb0127125630 --runner=TestDataflowRunner --publish_to_big_query=true --metrics_dataset=beam_performance --metrics_table=wordcount_py37_pkb_results --influx_measurement=wordcount_py37_results --influx_db_name=beam_test_metrics --influx_hostname=http://10.128.0.96:8086 --input=gs://apache-beam-samples/input_small_files/ascii_sort_1MB_input.0000* --output=gs://temp-storage-for-end-to-end-tests/py-it-cloud/output --expect_checksum=ea0ca2e5ee4ea5f218790f28d0b9fe7d09d8d710 --num_****s=10 --autoscaling_algorithm=NONE --sdk_location=<https://ci-beam.apache.org/job/beam_PerformanceTests_WordCountIT_Py37/ws/src/sdks/python/build/apache-beam.tar.gz"> --junitxml=pytest-runPerformanceTest-df-py37.xml --timeout=1800
Successfully started process 'command 'sh''
============================= test session starts ==============================
platform linux -- Python 3.7.12, pytest-7.2.1, pluggy-1.0.0
rootdir: <https://ci-beam.apache.org/job/beam_PerformanceTests_WordCountIT_Py37/ws/src/sdks/python,> configfile: pytest.ini
plugins: hypothesis-6.65.2, xdist-2.5.0, timeout-2.1.0, forked-1.4.0, requests-mock-1.10.0
timeout: 1800.0s
timeout method: signal
timeout func_only: False
collected 1 item
apache_beam/examples/wordcount_it_test.py F [100%]
=================================== FAILURES ===================================
________________________ WordCountIT.test_wordcount_it _________________________
self = <apache_beam.examples.wordcount_it_test.WordCountIT testMethod=test_wordcount_it>
@pytest.mark.it_postcommit
def test_wordcount_it(self):
> self._run_wordcount_it(wordcount.run)
apache_beam/examples/wordcount_it_test.py:49:
_ _ _ _ _ _ _ _ _ _ _ _ _ _ _ _ _ _ _ _ _ _ _ _ _ _ _ _ _ _ _ _ _ _ _ _ _ _ _ _
apache_beam/examples/wordcount_it_test.py:155: in _run_wordcount_it
save_main_session=False,
apache_beam/examples/wordcount.py:106: in run
output | 'Write' >> WriteToText(known_args.output)
apache_beam/pipeline.py:600: in __exit__
self.result = self.run()
apache_beam/pipeline.py:553: in run
self._options).run(False)
apache_beam/pipeline.py:577: in run
return self.runner.run_pipeline(self, self._options)
_ _ _ _ _ _ _ _ _ _ _ _ _ _ _ _ _ _ _ _ _ _ _ _ _ _ _ _ _ _ _ _ _ _ _ _ _ _ _ _
self = <apache_beam.runners.dataflow.test_dataflow_runner.TestDataflowRunner object at 0x7f9bcb5d6e10>
pipeline = <apache_beam.pipeline.Pipeline object at 0x7f9bcb64d790>
options = <apache_beam.options.pipeline_options.PipelineOptions object at 0x7f9bcb5e0e50>
def run_pipeline(self, pipeline, options):
"""Execute test pipeline and verify test matcher"""
test_options = options.view_as(TestOptions)
on_success_matcher = test_options.on_success_matcher
wait_duration = test_options.wait_until_finish_duration
is_streaming = options.view_as(StandardOptions).streaming
# [BEAM-1889] Do not send this to remote ****s also, there is no need to
# send this option to remote executors.
test_options.on_success_matcher = None
self.result = super().run_pipeline(pipeline, options)
if self.result.has_job:
# TODO(markflyhigh)(https://github.com/apache/beam/issues/18254): Use
# print since Nose dosen't show logs in some cases.
print('Worker logs: %s' % self.build_console_url(options))
_LOGGER.info('Console log: ')
_LOGGER.info(self.build_console_url(options))
try:
self.wait_until_in_state(PipelineState.RUNNING)
if is_streaming and not wait_duration:
_LOGGER.warning('Waiting indefinitely for streaming job.')
self.result.wait_until_finish(duration=wait_duration)
if on_success_matcher:
from hamcrest import assert_that as hc_assert_that
> hc_assert_that(self.result, pickler.loads(on_success_matcher))
E AssertionError:
E Expected: (Test pipeline expected terminated in state: DONE and Expected checksum is ea0ca2e5ee4ea5f218790f28d0b9fe7d09d8d710)
E but: Test pipeline expected terminated in state: DONE Test pipeline job terminated in state: FAILED
apache_beam/runners/dataflow/test_dataflow_runner.py:70: AssertionError
----------------------------- Captured stdout call -----------------------------
Worker logs: https://console.cloud.google.com/dataflow/jobs/us-central1/2023-01-27_06_47_04-8661280351246188488?project=apache-beam-testing
=============================== warnings summary ===============================
../../build/gradleenv/-1734967052/lib/python3.7/site-packages/hdfs/config.py:15
<https://ci-beam.apache.org/job/beam_PerformanceTests_WordCountIT_Py37/ws/src/build/gradleenv/-1734967052/lib/python3.7/site-packages/hdfs/config.py>:15: DeprecationWarning: the imp module is deprecated in favour of importlib; see the module's documentation for alternative uses
from imp import load_source
-- Docs: https://docs.pytest.org/en/stable/how-to/capture-warnings.html
- generated xml file: <https://ci-beam.apache.org/job/beam_PerformanceTests_WordCountIT_Py37/ws/src/sdks/python/pytest-runPerformanceTest-df-py37.xml> -
=========================== short test summary info ============================
FAILED apache_beam/examples/wordcount_it_test.py::WordCountIT::test_wordcount_it - AssertionError:
Expected: (Test pipeline expected terminated in state: DONE and Expected checksum is ea0ca2e5ee4ea5f218790f28d0b9fe7d09d8d710)
but: Test pipeline expected terminated in state: DONE Test pipeline job terminated in state: FAILED
======================== 1 failed, 1 warning in 39.80s =========================
> Task :sdks:python:test-suites:dataflow:py37:runPerformanceTest FAILED
:sdks:python:test-suites:dataflow:py37:runPerformanceTest (Thread[Execution **** Thread 4,5,main]) completed. Took 42.999 secs.
FAILURE: Build failed with an exception.
* What went wrong:
Execution failed for task ':sdks:python:test-suites:dataflow:py37:runPerformanceTest'.
> Process 'command 'sh'' finished with non-zero exit value 1
* Try:
> Run with --stacktrace option to get the stack trace.
> Run with --debug option to get more log output.
* Get more help at https://help.gradle.org
Deprecated Gradle features were used in this build, making it incompatible with Gradle 8.0.
You can use '--warning-mode all' to show the individual deprecation warnings and determine if they come from your own scripts or plugins.
See https://docs.gradle.org/7.5.1/userguide/command_line_interface.html#sec:command_line_warnings
BUILD FAILED in 2m 11s
15 actionable tasks: 9 executed, 4 from cache, 2 up-to-date
Publishing build scan...
https://gradle.com/s/bvywdyqq67re2
Build cache (/home/jenkins/.gradle/caches/build-cache-1) removing files not accessed on or after Fri Jan 20 14:45:36 UTC 2023.
Build cache (/home/jenkins/.gradle/caches/build-cache-1) cleanup deleted 704 files/directories.
Build cache (/home/jenkins/.gradle/caches/build-cache-1) cleaned up in 1.697 secs.
Build step 'Invoke Gradle script' changed build result to FAILURE
Build step 'Invoke Gradle script' marked build as failure
---------------------------------------------------------------------
To unsubscribe, e-mail: builds-unsubscribe@beam.apache.org
For additional commands, e-mail: builds-help@beam.apache.org
Jenkins build is back to normal : beam_PerformanceTests_WordCountIT_Py37 #5349
Posted by Apache Jenkins Server <je...@builds.apache.org>.
See <https://ci-beam.apache.org/job/beam_PerformanceTests_WordCountIT_Py37/5349/display/redirect?page=changes>
---------------------------------------------------------------------
To unsubscribe, e-mail: builds-unsubscribe@beam.apache.org
For additional commands, e-mail: builds-help@beam.apache.org