You are viewing a plain text version of this content. The canonical link for it is here.
Posted to builds@solr.apache.org by Apache Jenkins Server <je...@builds.apache.org> on 2024/02/01 15:53:01 UTC

[JENKINS] Solr » Solr-Check-9.x (Crave) - Build # 6235 - Still Failing!

Build: https://ci-builds.apache.org/job/Solr/job/Solr-Check-9.x%20(Crave)/6235/

No tests ran.

Build Log:
[...truncated 15504 lines...]
ERROR: The following test(s) have failed:
  - org.apache.solr.hdfs.index.CheckHdfsIndexTest.testChecksumsOnlyVerbose (:solr:modules:hdfs)
    Test output: /tmp/src/solr/solr/modules/hdfs/build/test-results/test/outputs/OUTPUT-org.apache.solr.hdfs.index.CheckHdfsIndexTest.txt
    Reproduce with: gradlew :solr:modules:hdfs:test --tests "org.apache.solr.hdfs.index.CheckHdfsIndexTest.testChecksumsOnlyVerbose" -Ptests.jvms=96 "-Ptests.jvmargs=-XX:TieredStopAtLevel=1 -XX:+UseParallelGC -XX:ActiveProcessorCount=1 -XX:ReservedCodeCacheSize=120m" -Ptests.seed=1BC7A6E649AFB86C -Ptests.file.encoding=US-ASCII

  - org.apache.solr.hdfs.index.CheckHdfsIndexTest.testChecksumsOnly (:solr:modules:hdfs)
    Test output: /tmp/src/solr/solr/modules/hdfs/build/test-results/test/outputs/OUTPUT-org.apache.solr.hdfs.index.CheckHdfsIndexTest.txt
    Reproduce with: gradlew :solr:modules:hdfs:test --tests "org.apache.solr.hdfs.index.CheckHdfsIndexTest.testChecksumsOnly" -Ptests.jvms=96 "-Ptests.jvmargs=-XX:TieredStopAtLevel=1 -XX:+UseParallelGC -XX:ActiveProcessorCount=1 -XX:ReservedCodeCacheSize=120m" -Ptests.seed=1BC7A6E649AFB86C -Ptests.file.encoding=US-ASCII

  - org.apache.solr.hdfs.index.CheckHdfsIndexTest.testDeletedDocs (:solr:modules:hdfs)
    Test output: /tmp/src/solr/solr/modules/hdfs/build/test-results/test/outputs/OUTPUT-org.apache.solr.hdfs.index.CheckHdfsIndexTest.txt
    Reproduce with: gradlew :solr:modules:hdfs:test --tests "org.apache.solr.hdfs.index.CheckHdfsIndexTest.testDeletedDocs" -Ptests.jvms=96 "-Ptests.jvmargs=-XX:TieredStopAtLevel=1 -XX:+UseParallelGC -XX:ActiveProcessorCount=1 -XX:ReservedCodeCacheSize=120m" -Ptests.seed=1BC7A6E649AFB86C -Ptests.file.encoding=US-ASCII

  - org.apache.solr.hdfs.index.CheckHdfsIndexTest.doTest (:solr:modules:hdfs)
    Test output: /tmp/src/solr/solr/modules/hdfs/build/test-results/test/outputs/OUTPUT-org.apache.solr.hdfs.index.CheckHdfsIndexTest.txt
    Reproduce with: gradlew :solr:modules:hdfs:test --tests "org.apache.solr.hdfs.index.CheckHdfsIndexTest.doTest" -Ptests.jvms=96 "-Ptests.jvmargs=-XX:TieredStopAtLevel=1 -XX:+UseParallelGC -XX:ActiveProcessorCount=1 -XX:ReservedCodeCacheSize=120m" -Ptests.seed=1BC7A6E649AFB86C -Ptests.file.encoding=US-ASCII

  - org.apache.solr.cloud.BasicDistributedZk2Test.test (:solr:core)
    Test output: /tmp/src/solr/solr/core/build/test-results/test/outputs/OUTPUT-org.apache.solr.cloud.BasicDistributedZk2Test.txt
    Reproduce with: gradlew :solr:core:test --tests "org.apache.solr.cloud.BasicDistributedZk2Test.test" -Ptests.jvms=96 "-Ptests.jvmargs=-XX:TieredStopAtLevel=1 -XX:+UseParallelGC -XX:ActiveProcessorCount=1 -XX:ReservedCodeCacheSize=120m" -Ptests.seed=1BC7A6E649AFB86C -Ptests.file.encoding=US-ASCII

  - org.apache.solr.cloud.SolrCloudExampleTest.testLoadDocsIntoGettingStartedCollection (:solr:core)
    Test output: /tmp/src/solr/solr/core/build/test-results/test/outputs/OUTPUT-org.apache.solr.cloud.SolrCloudExampleTest.txt
    Reproduce with: gradlew :solr:core:test --tests "org.apache.solr.cloud.SolrCloudExampleTest.testLoadDocsIntoGettingStartedCollection" -Ptests.jvms=96 "-Ptests.jvmargs=-XX:TieredStopAtLevel=1 -XX:+UseParallelGC -XX:ActiveProcessorCount=1 -XX:ReservedCodeCacheSize=120m" -Ptests.seed=1BC7A6E649AFB86C -Ptests.file.encoding=US-ASCII

  - org.apache.solr.cloud.TestDistribDocBasedVersion.test (:solr:core)
    Test output: /tmp/src/solr/solr/core/build/test-results/test/outputs/OUTPUT-org.apache.solr.cloud.TestDistribDocBasedVersion.txt
    Reproduce with: gradlew :solr:core:test --tests "org.apache.solr.cloud.TestDistribDocBasedVersion.test" -Ptests.jvms=96 "-Ptests.jvmargs=-XX:TieredStopAtLevel=1 -XX:+UseParallelGC -XX:ActiveProcessorCount=1 -XX:ReservedCodeCacheSize=120m" -Ptests.seed=1BC7A6E649AFB86C -Ptests.file.encoding=US-ASCII

  - org.apache.solr.cloud.api.collections.TestCollectionAPI.testRecreateCollectionAfterFailure (:solr:core)
    Test output: /tmp/src/solr/solr/core/build/test-results/test/outputs/OUTPUT-org.apache.solr.cloud.api.collections.TestCollectionAPI.txt
    Reproduce with: gradlew :solr:core:test --tests "org.apache.solr.cloud.api.collections.TestCollectionAPI.testRecreateCollectionAfterFailure" -Ptests.jvms=96 "-Ptests.jvmargs=-XX:TieredStopAtLevel=1 -XX:+UseParallelGC -XX:ActiveProcessorCount=1 -XX:ReservedCodeCacheSize=120m" -Ptests.seed=1BC7A6E649AFB86C -Ptests.file.encoding=US-ASCII

  - org.apache.solr.cloud.DistribCursorPagingTest.test (:solr:core)
    Test output: /tmp/src/solr/solr/core/build/test-results/test/outputs/OUTPUT-org.apache.solr.cloud.DistribCursorPagingTest.txt
    Reproduce with: gradlew :solr:core:test --tests "org.apache.solr.cloud.DistribCursorPagingTest.test" -Ptests.jvms=96 "-Ptests.jvmargs=-XX:TieredStopAtLevel=1 -XX:+UseParallelGC -XX:ActiveProcessorCount=1 -XX:ReservedCodeCacheSize=120m" -Ptests.seed=1BC7A6E649AFB86C -Ptests.file.encoding=US-ASCII

  - org.apache.solr.cloud.BasicDistributedZkTest.test (:solr:core)
    Test output: /tmp/src/solr/solr/core/build/test-results/test/outputs/OUTPUT-org.apache.solr.cloud.BasicDistributedZkTest.txt
    Reproduce with: gradlew :solr:core:test --tests "org.apache.solr.cloud.BasicDistributedZkTest.test" -Ptests.jvms=96 "-Ptests.jvmargs=-XX:TieredStopAtLevel=1 -XX:+UseParallelGC -XX:ActiveProcessorCount=1 -XX:ReservedCodeCacheSize=120m" -Ptests.seed=1BC7A6E649AFB86C -Ptests.file.encoding=US-ASCII

  - org.apache.solr.cloud.RollingRestartTest.test (:solr:core)
    Test output: /tmp/src/solr/solr/core/build/test-results/test/outputs/OUTPUT-org.apache.solr.cloud.RollingRestartTest.txt
    Reproduce with: gradlew :solr:core:test --tests "org.apache.solr.cloud.RollingRestartTest.test" -Ptests.jvms=96 "-Ptests.jvmargs=-XX:TieredStopAtLevel=1 -XX:+UseParallelGC -XX:ActiveProcessorCount=1 -XX:ReservedCodeCacheSize=120m" -Ptests.seed=1BC7A6E649AFB86C -Ptests.file.encoding=US-ASCII

  - org.apache.solr.cloud.UnloadDistributedZkTest.test (:solr:core)
    Test output: /tmp/src/solr/solr/core/build/test-results/test/outputs/OUTPUT-org.apache.solr.cloud.UnloadDistributedZkTest.txt
    Reproduce with: gradlew :solr:core:test --tests "org.apache.solr.cloud.UnloadDistributedZkTest.test" -Ptests.jvms=96 "-Ptests.jvmargs=-XX:TieredStopAtLevel=1 -XX:+UseParallelGC -XX:ActiveProcessorCount=1 -XX:ReservedCodeCacheSize=120m" -Ptests.seed=1BC7A6E649AFB86C -Ptests.file.encoding=US-ASCII

  - org.apache.solr.cloud.ShardRoutingCustomTest.test (:solr:core)
    Test output: /tmp/src/solr/solr/core/build/test-results/test/outputs/OUTPUT-org.apache.solr.cloud.ShardRoutingCustomTest.txt
    Reproduce with: gradlew :solr:core:test --tests "org.apache.solr.cloud.ShardRoutingCustomTest.test" -Ptests.jvms=96 "-Ptests.jvmargs=-XX:TieredStopAtLevel=1 -XX:+UseParallelGC -XX:ActiveProcessorCount=1 -XX:ReservedCodeCacheSize=120m" -Ptests.seed=1BC7A6E649AFB86C -Ptests.file.encoding=US-ASCII

  - org.apache.solr.cloud.HttpPartitionOnCommitTest.test (:solr:core)
    Test output: /tmp/src/solr/solr/core/build/test-results/test/outputs/OUTPUT-org.apache.solr.cloud.HttpPartitionOnCommitTest.txt
    Reproduce with: gradlew :solr:core:test --tests "org.apache.solr.cloud.HttpPartitionOnCommitTest.test" -Ptests.jvms=96 "-Ptests.jvmargs=-XX:TieredStopAtLevel=1 -XX:+UseParallelGC -XX:ActiveProcessorCount=1 -XX:ReservedCodeCacheSize=120m" -Ptests.seed=1BC7A6E649AFB86C -Ptests.file.encoding=US-ASCII

  - org.apache.solr.cloud.RecoveryAfterSoftCommitTest.test (:solr:core)
    Test output: /tmp/src/solr/solr/core/build/test-results/test/outputs/OUTPUT-org.apache.solr.cloud.RecoveryAfterSoftCommitTest.txt
    Reproduce with: gradlew :solr:core:test --tests "org.apache.solr.cloud.RecoveryAfterSoftCommitTest.test" -Ptests.jvms=96 "-Ptests.jvmargs=-XX:TieredStopAtLevel=1 -XX:+UseParallelGC -XX:ActiveProcessorCount=1 -XX:ReservedCodeCacheSize=120m" -Ptests.seed=1BC7A6E649AFB86C -Ptests.file.encoding=US-ASCII

  - org.apache.solr.cloud.api.collections.TestCollectionAPI.testConfigCaching (:solr:core)
    Test output: /tmp/src/solr/solr/core/build/test-results/test/outputs/OUTPUT-org.apache.solr.cloud.api.collections.TestCollectionAPI.txt
    Reproduce with: gradlew :solr:core:test --tests "org.apache.solr.cloud.api.collections.TestCollectionAPI.testConfigCaching" -Ptests.jvms=96 "-Ptests.jvmargs=-XX:TieredStopAtLevel=1 -XX:+UseParallelGC -XX:ActiveProcessorCount=1 -XX:ReservedCodeCacheSize=120m" -Ptests.seed=1BC7A6E649AFB86C -Ptests.file.encoding=US-ASCII

  - org.apache.solr.cloud.api.collections.TestRequestStatusCollectionAPI.test (:solr:core)
    Test output: /tmp/src/solr/solr/core/build/test-results/test/outputs/OUTPUT-org.apache.solr.cloud.api.collections.TestRequestStatusCollectionAPI.txt
    Reproduce with: gradlew :solr:core:test --tests "org.apache.solr.cloud.api.collections.TestRequestStatusCollectionAPI.test" -Ptests.jvms=96 "-Ptests.jvmargs=-XX:TieredStopAtLevel=1 -XX:+UseParallelGC -XX:ActiveProcessorCount=1 -XX:ReservedCodeCacheSize=120m" -Ptests.seed=1BC7A6E649AFB86C -Ptests.file.encoding=US-ASCII

  - org.apache.solr.cloud.api.collections.TestReplicaProperties.test (:solr:core)
    Test output: /tmp/src/solr/solr/core/build/test-results/test/outputs/OUTPUT-org.apache.solr.cloud.api.collections.TestReplicaProperties.txt
    Reproduce with: gradlew :solr:core:test --tests "org.apache.solr.cloud.api.collections.TestReplicaProperties.test" -Ptests.jvms=96 "-Ptests.jvmargs=-XX:TieredStopAtLevel=1 -XX:+UseParallelGC -XX:ActiveProcessorCount=1 -XX:ReservedCodeCacheSize=120m" -Ptests.seed=1BC7A6E649AFB86C -Ptests.file.encoding=US-ASCII

  - org.apache.solr.cloud.PeerSyncReplicationTest.test (:solr:core)
    Test output: /tmp/src/solr/solr/core/build/test-results/test/outputs/OUTPUT-org.apache.solr.cloud.PeerSyncReplicationTest.txt
    Reproduce with: gradlew :solr:core:test --tests "org.apache.solr.cloud.PeerSyncReplicationTest.test" -Ptests.jvms=96 "-Ptests.jvmargs=-XX:TieredStopAtLevel=1 -XX:+UseParallelGC -XX:ActiveProcessorCount=1 -XX:ReservedCodeCacheSize=120m" -Ptests.seed=1BC7A6E649AFB86C -Ptests.file.encoding=US-ASCII

  - org.apache.solr.cloud.ReplicationFactorTest.test (:solr:core)
    Test output: /tmp/src/solr/solr/core/build/test-results/test/outputs/OUTPUT-org.apache.solr.cloud.ReplicationFactorTest.txt
    Reproduce with: gradlew :solr:core:test --tests "org.apache.solr.cloud.ReplicationFactorTest.test" -Ptests.jvms=96 "-Ptests.jvmargs=-XX:TieredStopAtLevel=1 -XX:+UseParallelGC -XX:ActiveProcessorCount=1 -XX:ReservedCodeCacheSize=120m" -Ptests.seed=1BC7A6E649AFB86C -Ptests.file.encoding=US-ASCII

  - org.apache.solr.cloud.TestShortCircuitedRequests.test (:solr:core)
    Test output: /tmp/src/solr/solr/core/build/test-results/test/outputs/OUTPUT-org.apache.solr.cloud.TestShortCircuitedRequests.txt
    Reproduce with: gradlew :solr:core:test --tests "org.apache.solr.cloud.TestShortCircuitedRequests.test" -Ptests.jvms=96 "-Ptests.jvmargs=-XX:TieredStopAtLevel=1 -XX:+UseParallelGC -XX:ActiveProcessorCount=1 -XX:ReservedCodeCacheSize=120m" -Ptests.seed=1BC7A6E649AFB86C -Ptests.file.encoding=US-ASCII

  - org.apache.solr.cloud.MultiThreadedOCPTest.testTaskExclusivity (:solr:core)
    Test output: /tmp/src/solr/solr/core/build/test-results/test/outputs/OUTPUT-org.apache.solr.cloud.MultiThreadedOCPTest.txt
    Reproduce with: gradlew :solr:core:test --tests "org.apache.solr.cloud.MultiThreadedOCPTest.testTaskExclusivity" -Ptests.jvms=96 "-Ptests.jvmargs=-XX:TieredStopAtLevel=1 -XX:+UseParallelGC -XX:ActiveProcessorCount=1 -XX:ReservedCodeCacheSize=120m" -Ptests.seed=1BC7A6E649AFB86C -Ptests.file.encoding=US-ASCII

  - org.apache.solr.cloud.LeaderFailureAfterFreshStartTest.test (:solr:core)
    Test output: /tmp/src/solr/solr/core/build/test-results/test/outputs/OUTPUT-org.apache.solr.cloud.LeaderFailureAfterFreshStartTest.txt
    Reproduce with: gradlew :solr:core:test --tests "org.apache.solr.cloud.LeaderFailureAfterFreshStartTest.test" -Ptests.jvms=96 "-Ptests.jvmargs=-XX:TieredStopAtLevel=1 -XX:+UseParallelGC -XX:ActiveProcessorCount=1 -XX:ReservedCodeCacheSize=120m" -Ptests.seed=1BC7A6E649AFB86C -Ptests.file.encoding=US-ASCII

  - org.apache.solr.cloud.ShardRoutingTest.test (:solr:core)
    Test output: /tmp/src/solr/solr/core/build/test-results/test/outputs/OUTPUT-org.apache.solr.cloud.ShardRoutingTest.txt
    Reproduce with: gradlew :solr:core:test --tests "org.apache.solr.cloud.ShardRoutingTest.test" -Ptests.jvms=96 "-Ptests.jvmargs=-XX:TieredStopAtLevel=1 -XX:+UseParallelGC -XX:ActiveProcessorCount=1 -XX:ReservedCodeCacheSize=120m" -Ptests.seed=1BC7A6E649AFB86C -Ptests.file.encoding=US-ASCII

  - org.apache.solr.core.TestCustomStream.testDynamicLoadingCustomStream (:solr:core)
    Test output: /tmp/src/solr/solr/core/build/test-results/test/outputs/OUTPUT-org.apache.solr.core.TestCustomStream.txt
    Reproduce with: gradlew :solr:core:test --tests "org.apache.solr.core.TestCustomStream.testDynamicLoadingCustomStream" -Ptests.jvms=96 "-Ptests.jvmargs=-XX:TieredStopAtLevel=1 -XX:+UseParallelGC -XX:ActiveProcessorCount=1 -XX:ReservedCodeCacheSize=120m" -Ptests.seed=1BC7A6E649AFB86C -Ptests.file.encoding=US-ASCII

  - org.apache.solr.cloud.SyncSliceTest.test (:solr:core)
    Test output: /tmp/src/solr/solr/core/build/test-results/test/outputs/OUTPUT-org.apache.solr.cloud.SyncSliceTest.txt
    Reproduce with: gradlew :solr:core:test --tests "org.apache.solr.cloud.SyncSliceTest.test" -Ptests.jvms=96 "-Ptests.jvmargs=-XX:TieredStopAtLevel=1 -XX:+UseParallelGC -XX:ActiveProcessorCount=1 -XX:ReservedCodeCacheSize=120m" -Ptests.seed=1BC7A6E649AFB86C -Ptests.file.encoding=US-ASCII

  - org.apache.solr.cloud.TestDynamicFieldNamesIndexCorrectly.test (:solr:core)
    Test output: /tmp/src/solr/solr/core/build/test-results/test/outputs/OUTPUT-org.apache.solr.cloud.TestDynamicFieldNamesIndexCorrectly.txt
    Reproduce with: gradlew :solr:core:test --tests "org.apache.solr.cloud.TestDynamicFieldNamesIndexCorrectly.test" -Ptests.jvms=96 "-Ptests.jvmargs=-XX:TieredStopAtLevel=1 -XX:+UseParallelGC -XX:ActiveProcessorCount=1 -XX:ReservedCodeCacheSize=120m" -Ptests.seed=1BC7A6E649AFB86C -Ptests.file.encoding=US-ASCII

  - org.apache.solr.cloud.api.collections.SimpleCollectionCreateDeleteTest.testPropertiesOfReplica (:solr:core)
    Test output: /tmp/src/solr/solr/core/build/test-results/test/outputs/OUTPUT-org.apache.solr.cloud.api.collections.SimpleCollectionCreateDeleteTest.txt
    Reproduce with: gradlew :solr:core:test --tests "org.apache.solr.cloud.api.collections.SimpleCollectionCreateDeleteTest.testPropertiesOfReplica" -Ptests.jvms=96 "-Ptests.jvmargs=-XX:TieredStopAtLevel=1 -XX:+UseParallelGC -XX:ActiveProcessorCount=1 -XX:ReservedCodeCacheSize=120m" -Ptests.seed=1BC7A6E649AFB86C -Ptests.file.encoding=US-ASCII

  - org.apache.solr.cloud.api.collections.TestCollectionAPI.testCreateCollectionBooleanValues (:solr:core)
    Test output: /tmp/src/solr/solr/core/build/test-results/test/outputs/OUTPUT-org.apache.solr.cloud.api.collections.TestCollectionAPI.txt
    Reproduce with: gradlew :solr:core:test --tests "org.apache.solr.cloud.api.collections.TestCollectionAPI.testCreateCollectionBooleanValues" -Ptests.jvms=96 "-Ptests.jvmargs=-XX:TieredStopAtLevel=1 -XX:+UseParallelGC -XX:ActiveProcessorCount=1 -XX:ReservedCodeCacheSize=120m" -Ptests.seed=1BC7A6E649AFB86C -Ptests.file.encoding=US-ASCII

  - org.apache.solr.cloud.TestOnReconnectListenerSupport.test (:solr:core)
    Test output: /tmp/src/solr/solr/core/build/test-results/test/outputs/OUTPUT-org.apache.solr.cloud.TestOnReconnectListenerSupport.txt
    Reproduce with: gradlew :solr:core:test --tests "org.apache.solr.cloud.TestOnReconnectListenerSupport.test" -Ptests.jvms=96 "-Ptests.jvmargs=-XX:TieredStopAtLevel=1 -XX:+UseParallelGC -XX:ActiveProcessorCount=1 -XX:ReservedCodeCacheSize=120m" -Ptests.seed=1BC7A6E649AFB86C -Ptests.file.encoding=US-ASCII

  - org.apache.solr.cloud.TestRandomRequestDistribution.test (:solr:core)
    Test output: /tmp/src/solr/solr/core/build/test-results/test/outputs/OUTPUT-org.apache.solr.cloud.TestRandomRequestDistribution.txt
    Reproduce with: gradlew :solr:core:test --tests "org.apache.solr.cloud.TestRandomRequestDistribution.test" -Ptests.jvms=96 "-Ptests.jvmargs=-XX:TieredStopAtLevel=1 -XX:+UseParallelGC -XX:ActiveProcessorCount=1 -XX:ReservedCodeCacheSize=120m" -Ptests.seed=1BC7A6E649AFB86C -Ptests.file.encoding=US-ASCII

  - org.apache.solr.cloud.MultiThreadedOCPTest.testLongAndShortRunningParallelApiCalls (:solr:core)
    Test output: /tmp/src/solr/solr/core/build/test-results/test/outputs/OUTPUT-org.apache.solr.cloud.MultiThreadedOCPTest.txt
    Reproduce with: gradlew :solr:core:test --tests "org.apache.solr.cloud.MultiThreadedOCPTest.testLongAndShortRunningParallelApiCalls" -Ptests.jvms=96 "-Ptests.jvmargs=-XX:TieredStopAtLevel=1 -XX:+UseParallelGC -XX:ActiveProcessorCount=1 -XX:ReservedCodeCacheSize=120m" -Ptests.seed=1BC7A6E649AFB86C -Ptests.file.encoding=US-ASCII

  - org.apache.solr.cloud.api.collections.SimpleCollectionCreateDeleteTest.testDeleteAlsoDeletesAutocreatedConfigSet (:solr:core)
    Test output: /tmp/src/solr/solr/core/build/test-results/test/outputs/OUTPUT-org.apache.solr.cloud.api.collections.SimpleCollectionCreateDeleteTest.txt
    Reproduce with: gradlew :solr:core:test --tests "org.apache.solr.cloud.api.collections.SimpleCollectionCreateDeleteTest.testDeleteAlsoDeletesAutocreatedConfigSet" -Ptests.jvms=96 "-Ptests.jvmargs=-XX:TieredStopAtLevel=1 -XX:+UseParallelGC -XX:ActiveProcessorCount=1 -XX:ReservedCodeCacheSize=120m" -Ptests.seed=1BC7A6E649AFB86C -Ptests.file.encoding=US-ASCII

  - org.apache.solr.handler.TestSystemCollAutoCreate.testAutoCreate (:solr:core)
    Test output: /tmp/src/solr/solr/core/build/test-results/test/outputs/OUTPUT-org.apache.solr.handler.TestSystemCollAutoCreate.txt
    Reproduce with: gradlew :solr:core:test --tests "org.apache.solr.handler.TestSystemCollAutoCreate.testAutoCreate" -Ptests.jvms=96 "-Ptests.jvmargs=-XX:TieredStopAtLevel=1 -XX:+UseParallelGC -XX:ActiveProcessorCount=1 -XX:ReservedCodeCacheSize=120m" -Ptests.seed=1BC7A6E649AFB86C -Ptests.file.encoding=US-ASCII

  - org.apache.solr.cloud.api.collections.TestCollectionAPI.test (:solr:core)
    Test output: /tmp/src/solr/solr/core/build/test-results/test/outputs/OUTPUT-org.apache.solr.cloud.api.collections.TestCollectionAPI.txt
    Reproduce with: gradlew :solr:core:test --tests "org.apache.solr.cloud.api.collections.TestCollectionAPI.test" -Ptests.jvms=96 "-Ptests.jvmargs=-XX:TieredStopAtLevel=1 -XX:+UseParallelGC -XX:ActiveProcessorCount=1 -XX:ReservedCodeCacheSize=120m" -Ptests.seed=1BC7A6E649AFB86C -Ptests.file.encoding=US-ASCII

  - org.apache.solr.cloud.MultiThreadedOCPTest.testFillWorkQueue (:solr:core)
    Test output: /tmp/src/solr/solr/core/build/test-results/test/outputs/OUTPUT-org.apache.solr.cloud.MultiThreadedOCPTest.txt
    Reproduce with: gradlew :solr:core:test --tests "org.apache.solr.cloud.MultiThreadedOCPTest.testFillWorkQueue" -Ptests.jvms=96 "-Ptests.jvmargs=-XX:TieredStopAtLevel=1 -XX:+UseParallelGC -XX:ActiveProcessorCount=1 -XX:ReservedCodeCacheSize=120m" -Ptests.seed=1BC7A6E649AFB86C -Ptests.file.encoding=US-ASCII

  - org.apache.solr.cloud.TestCloudPivotFacet.test (:solr:core)
    Test output: /tmp/src/solr/solr/core/build/test-results/test/outputs/OUTPUT-org.apache.solr.cloud.TestCloudPivotFacet.txt
    Reproduce with: gradlew :solr:core:test --tests "org.apache.solr.cloud.TestCloudPivotFacet.test" -Ptests.jvms=96 "-Ptests.jvmargs=-XX:TieredStopAtLevel=1 -XX:+UseParallelGC -XX:ActiveProcessorCount=1 -XX:ReservedCodeCacheSize=120m" -Ptests.seed=1BC7A6E649AFB86C -Ptests.file.encoding=US-ASCII

  - org.apache.solr.cloud.api.collections.SimpleCollectionCreateDeleteTest.testDeleteDoesNotDeleteSharedAutocreatedConfigSet (:solr:core)
    Test output: /tmp/src/solr/solr/core/build/test-results/test/outputs/OUTPUT-org.apache.solr.cloud.api.collections.SimpleCollectionCreateDeleteTest.txt
    Reproduce with: gradlew :solr:core:test --tests "org.apache.solr.cloud.api.collections.SimpleCollectionCreateDeleteTest.testDeleteDoesNotDeleteSharedAutocreatedConfigSet" -Ptests.jvms=96 "-Ptests.jvmargs=-XX:TieredStopAtLevel=1 -XX:+UseParallelGC -XX:ActiveProcessorCount=1 -XX:ReservedCodeCacheSize=120m" -Ptests.seed=1BC7A6E649AFB86C -Ptests.file.encoding=US-ASCII

  - org.apache.solr.cloud.api.collections.SimpleCollectionCreateDeleteTest.testCreateAndDeleteThenCreateAgain (:solr:core)
    Test output: /tmp/src/solr/solr/core/build/test-results/test/outputs/OUTPUT-org.apache.solr.cloud.api.collections.SimpleCollectionCreateDeleteTest.txt
    Reproduce with: gradlew :solr:core:test --tests "org.apache.solr.cloud.api.collections.SimpleCollectionCreateDeleteTest.testCreateAndDeleteThenCreateAgain" -Ptests.jvms=96 "-Ptests.jvmargs=-XX:TieredStopAtLevel=1 -XX:+UseParallelGC -XX:ActiveProcessorCount=1 -XX:ReservedCodeCacheSize=120m" -Ptests.seed=1BC7A6E649AFB86C -Ptests.file.encoding=US-ASCII

  - org.apache.solr.schema.TestCloudManagedSchema.test (:solr:core)
    Test output: /tmp/src/solr/solr/core/build/test-results/test/outputs/OUTPUT-org.apache.solr.schema.TestCloudManagedSchema.txt
    Reproduce with: gradlew :solr:core:test --tests "org.apache.solr.schema.TestCloudManagedSchema.test" -Ptests.jvms=96 "-Ptests.jvmargs=-XX:TieredStopAtLevel=1 -XX:+UseParallelGC -XX:ActiveProcessorCount=1 -XX:ReservedCodeCacheSize=120m" -Ptests.seed=1BC7A6E649AFB86C -Ptests.file.encoding=US-ASCII

  - org.apache.solr.cloud.MultiThreadedOCPTest.testParallelCollectionAPICalls (:solr:core)
    Test output: /tmp/src/solr/solr/core/build/test-results/test/outputs/OUTPUT-org.apache.solr.cloud.MultiThreadedOCPTest.txt
    Reproduce with: gradlew :solr:core:test --tests "org.apache.solr.cloud.MultiThreadedOCPTest.testParallelCollectionAPICalls" -Ptests.jvms=96 "-Ptests.jvmargs=-XX:TieredStopAtLevel=1 -XX:+UseParallelGC -XX:ActiveProcessorCount=1 -XX:ReservedCodeCacheSize=120m" -Ptests.seed=1BC7A6E649AFB86C -Ptests.file.encoding=US-ASCII

  - org.apache.solr.cloud.TestStressInPlaceUpdates.stressTest (:solr:core)
    Test output: /tmp/src/solr/solr/core/build/test-results/test/outputs/OUTPUT-org.apache.solr.cloud.TestStressInPlaceUpdates.txt
    Reproduce with: gradlew :solr:core:test --tests "org.apache.solr.cloud.TestStressInPlaceUpdates.stressTest" -Ptests.jvms=96 "-Ptests.jvmargs=-XX:TieredStopAtLevel=1 -XX:+UseParallelGC -XX:ActiveProcessorCount=1 -XX:ReservedCodeCacheSize=120m" -Ptests.seed=1BC7A6E649AFB86C -Ptests.file.encoding=US-ASCII

  - org.apache.solr.cloud.MultiThreadedOCPTest.testDeduplicationOfSubmittedTasks (:solr:core)
    Test output: /tmp/src/solr/solr/core/build/test-results/test/outputs/OUTPUT-org.apache.solr.cloud.MultiThreadedOCPTest.txt
    Reproduce with: gradlew :solr:core:test --tests "org.apache.solr.cloud.MultiThreadedOCPTest.testDeduplicationOfSubmittedTasks" -Ptests.jvms=96 "-Ptests.jvmargs=-XX:TieredStopAtLevel=1 -XX:+UseParallelGC -XX:ActiveProcessorCount=1 -XX:ReservedCodeCacheSize=120m" -Ptests.seed=1BC7A6E649AFB86C -Ptests.file.encoding=US-ASCII

  - org.apache.solr.update.TestInPlaceUpdatesDistrib.test (:solr:core)
    Test output: /tmp/src/solr/solr/core/build/test-results/test/outputs/OUTPUT-org.apache.solr.update.TestInPlaceUpdatesDistrib.txt
    Reproduce with: gradlew :solr:core:test --tests "org.apache.solr.update.TestInPlaceUpdatesDistrib.test" -Ptests.jvms=96 "-Ptests.jvmargs=-XX:TieredStopAtLevel=1 -XX:+UseParallelGC -XX:ActiveProcessorCount=1 -XX:ReservedCodeCacheSize=120m" -Ptests.seed=1BC7A6E649AFB86C -Ptests.file.encoding=US-ASCII

  - org.apache.solr.handler.TestConfigReload.test (:solr:core)
    Test output: /tmp/src/solr/solr/core/build/test-results/test/outputs/OUTPUT-org.apache.solr.handler.TestConfigReload.txt
    Reproduce with: gradlew :solr:core:test --tests "org.apache.solr.handler.TestConfigReload.test" -Ptests.jvms=96 "-Ptests.jvmargs=-XX:TieredStopAtLevel=1 -XX:+UseParallelGC -XX:ActiveProcessorCount=1 -XX:ReservedCodeCacheSize=120m" -Ptests.seed=1BC7A6E649AFB86C -Ptests.file.encoding=US-ASCII

  - org.apache.solr.handler.TestSolrConfigHandlerConcurrent.test (:solr:core)
    Test output: /tmp/src/solr/solr/core/build/test-results/test/outputs/OUTPUT-org.apache.solr.handler.TestSolrConfigHandlerConcurrent.txt
    Reproduce with: gradlew :solr:core:test --tests "org.apache.solr.handler.TestSolrConfigHandlerConcurrent.test" -Ptests.jvms=96 "-Ptests.jvmargs=-XX:TieredStopAtLevel=1 -XX:+UseParallelGC -XX:ActiveProcessorCount=1 -XX:ReservedCodeCacheSize=120m" -Ptests.seed=1BC7A6E649AFB86C -Ptests.file.encoding=US-ASCII

  - org.apache.solr.handler.TestSolrConfigHandlerCloud.test (:solr:core)
    Test output: /tmp/src/solr/solr/core/build/test-results/test/outputs/OUTPUT-org.apache.solr.handler.TestSolrConfigHandlerCloud.txt
    Reproduce with: gradlew :solr:core:test --tests "org.apache.solr.handler.TestSolrConfigHandlerCloud.test" -Ptests.jvms=96 "-Ptests.jvmargs=-XX:TieredStopAtLevel=1 -XX:+UseParallelGC -XX:ActiveProcessorCount=1 -XX:ReservedCodeCacheSize=120m" -Ptests.seed=1BC7A6E649AFB86C -Ptests.file.encoding=US-ASCII

  - org.apache.solr.handler.component.TestTrackingShardHandlerFactory.testRequestTracking (:solr:core)
    Test output: /tmp/src/solr/solr/core/build/test-results/test/outputs/OUTPUT-org.apache.solr.handler.component.TestTrackingShardHandlerFactory.txt
    Reproduce with: gradlew :solr:core:test --tests "org.apache.solr.handler.component.TestTrackingShardHandlerFactory.testRequestTracking" -Ptests.jvms=96 "-Ptests.jvmargs=-XX:TieredStopAtLevel=1 -XX:+UseParallelGC -XX:ActiveProcessorCount=1 -XX:ReservedCodeCacheSize=120m" -Ptests.seed=1BC7A6E649AFB86C -Ptests.file.encoding=US-ASCII

  - org.apache.solr.schema.TestCloudSchemaless.test (:solr:core)
    Test output: /tmp/src/solr/solr/core/build/test-results/test/outputs/OUTPUT-org.apache.solr.schema.TestCloudSchemaless.txt
    Reproduce with: gradlew :solr:core:test --tests "org.apache.solr.schema.TestCloudSchemaless.test" -Ptests.jvms=96 "-Ptests.jvmargs=-XX:TieredStopAtLevel=1 -XX:+UseParallelGC -XX:ActiveProcessorCount=1 -XX:ReservedCodeCacheSize=120m" -Ptests.seed=1BC7A6E649AFB86C -Ptests.file.encoding=US-ASCII

  - org.apache.solr.security.TestAuthorizationFramework.authorizationFrameworkTest (:solr:core)
    Test output: /tmp/src/solr/solr/core/build/test-results/test/outputs/OUTPUT-org.apache.solr.security.TestAuthorizationFramework.txt
    Reproduce with: gradlew :solr:core:test --tests "org.apache.solr.security.TestAuthorizationFramework.authorizationFrameworkTest" -Ptests.jvms=96 "-Ptests.jvmargs=-XX:TieredStopAtLevel=1 -XX:+UseParallelGC -XX:ActiveProcessorCount=1 -XX:ReservedCodeCacheSize=120m" -Ptests.seed=1BC7A6E649AFB86C -Ptests.file.encoding=US-ASCII

  - org.apache.solr.handler.TestBlobHandler.doBlobHandlerTest (:solr:core)
    Test output: /tmp/src/solr/solr/core/build/test-results/test/outputs/OUTPUT-org.apache.solr.handler.TestBlobHandler.txt
    Reproduce with: gradlew :solr:core:test --tests "org.apache.solr.handler.TestBlobHandler.doBlobHandlerTest" -Ptests.jvms=96 "-Ptests.jvmargs=-XX:TieredStopAtLevel=1 -XX:+UseParallelGC -XX:ActiveProcessorCount=1 -XX:ReservedCodeCacheSize=120m" -Ptests.seed=1BC7A6E649AFB86C -Ptests.file.encoding=US-ASCII

  - org.apache.solr.schema.TestBulkSchemaConcurrent.test (:solr:core)
    Test output: /tmp/src/solr/solr/core/build/test-results/test/outputs/OUTPUT-org.apache.solr.schema.TestBulkSchemaConcurrent.txt
    Reproduce with: gradlew :solr:core:test --tests "org.apache.solr.schema.TestBulkSchemaConcurrent.test" -Ptests.jvms=96 "-Ptests.jvmargs=-XX:TieredStopAtLevel=1 -XX:+UseParallelGC -XX:ActiveProcessorCount=1 -XX:ReservedCodeCacheSize=120m" -Ptests.seed=1BC7A6E649AFB86C -Ptests.file.encoding=US-ASCII

WARNING: there were unreferenced files under license folder:
  - /tmp/src/solr/solr/licenses/jakarta.inject-2.6.1.jar.sha1

FAILURE: Build completed with 2 failures.

1: Task failed with an exception.
-----------
* What went wrong:
Execution failed for task ':solr:modules:hdfs:test'.
> There were failing tests. See the results at: file:///tmp/src/solr/solr/modules/hdfs/build/test-results/test/

* Try:
> Run with --scan to get full insights.
==============================================================================

2: Task failed with an exception.
-----------
* What went wrong:
Execution failed for task ':solr:core:test'.
> There were failing tests. See the results at: file:///tmp/src/solr/solr/core/build/test-results/test/

* Try:
> Run with --scan to get full insights.
==============================================================================

BUILD FAILED in 8m 4s
670 actionable tasks: 668 executed, 2 up-to-date
[?12l[?25h
------------------------------------------------------------------------
Build Failed: returned 1

Total time: 8m26s
------------------------------------------------------------------------
+ status=1
+ ./crave pull '**/build/**/test/TEST-*.xml'
+ ./crave pull '**/*.events'
+ ./crave pull 'heapdumps/**'
Error: rsync: [sender] change_dir "/tmp/src/solr/heapdumps" failed: No such file or directory (2)
rsync error: some files/attrs were not transferred (see previous errors) (code 23) at main.c(1675) [Receiver=3.1.2]
rsync: [Receiver] write error: Broken pipe (32)

+ ./crave pull '**/hs_err_pid*'
+ exit 1
Build step 'Execute shell' marked build as failure
Archiving artifacts
Recording test results
ERROR: Step ‘Publish JUnit test result report’ failed: No test report files were found. Configuration error?
Email was triggered for: Failure - Any
Sending email for trigger: Failure - Any

[JENKINS] Solr » Solr-Check-9.x (Crave) - Build # 6238 - Still Failing!

Posted by Apache Jenkins Server <je...@builds.apache.org>.
Build: https://ci-builds.apache.org/job/Solr/job/Solr-Check-9.x%20(Crave)/6238/

No tests ran.

Build Log:
[...truncated 15709 lines...]
ERROR: The following test(s) have failed:
  - org.apache.solr.hdfs.index.CheckHdfsIndexTest.testDeletedDocs (:solr:modules:hdfs)
    Test output: /tmp/src/solr/solr/modules/hdfs/build/test-results/test/outputs/OUTPUT-org.apache.solr.hdfs.index.CheckHdfsIndexTest.txt
    Reproduce with: gradlew :solr:modules:hdfs:test --tests "org.apache.solr.hdfs.index.CheckHdfsIndexTest.testDeletedDocs" -Ptests.jvms=96 "-Ptests.jvmargs=-XX:TieredStopAtLevel=1 -XX:+UseParallelGC -XX:ActiveProcessorCount=1 -XX:ReservedCodeCacheSize=120m" -Ptests.seed=1BD7721ACAF8B444 -Ptests.file.encoding=UTF-8

  - org.apache.solr.hdfs.index.CheckHdfsIndexTest.testChecksumsOnly (:solr:modules:hdfs)
    Test output: /tmp/src/solr/solr/modules/hdfs/build/test-results/test/outputs/OUTPUT-org.apache.solr.hdfs.index.CheckHdfsIndexTest.txt
    Reproduce with: gradlew :solr:modules:hdfs:test --tests "org.apache.solr.hdfs.index.CheckHdfsIndexTest.testChecksumsOnly" -Ptests.jvms=96 "-Ptests.jvmargs=-XX:TieredStopAtLevel=1 -XX:+UseParallelGC -XX:ActiveProcessorCount=1 -XX:ReservedCodeCacheSize=120m" -Ptests.seed=1BD7721ACAF8B444 -Ptests.file.encoding=UTF-8

  - org.apache.solr.hdfs.index.CheckHdfsIndexTest.testChecksumsOnlyVerbose (:solr:modules:hdfs)
    Test output: /tmp/src/solr/solr/modules/hdfs/build/test-results/test/outputs/OUTPUT-org.apache.solr.hdfs.index.CheckHdfsIndexTest.txt
    Reproduce with: gradlew :solr:modules:hdfs:test --tests "org.apache.solr.hdfs.index.CheckHdfsIndexTest.testChecksumsOnlyVerbose" -Ptests.jvms=96 "-Ptests.jvmargs=-XX:TieredStopAtLevel=1 -XX:+UseParallelGC -XX:ActiveProcessorCount=1 -XX:ReservedCodeCacheSize=120m" -Ptests.seed=1BD7721ACAF8B444 -Ptests.file.encoding=UTF-8

  - org.apache.solr.hdfs.index.CheckHdfsIndexTest.doTest (:solr:modules:hdfs)
    Test output: /tmp/src/solr/solr/modules/hdfs/build/test-results/test/outputs/OUTPUT-org.apache.solr.hdfs.index.CheckHdfsIndexTest.txt
    Reproduce with: gradlew :solr:modules:hdfs:test --tests "org.apache.solr.hdfs.index.CheckHdfsIndexTest.doTest" -Ptests.jvms=96 "-Ptests.jvmargs=-XX:TieredStopAtLevel=1 -XX:+UseParallelGC -XX:ActiveProcessorCount=1 -XX:ReservedCodeCacheSize=120m" -Ptests.seed=1BD7721ACAF8B444 -Ptests.file.encoding=UTF-8

  - org.apache.solr.cloud.api.collections.TestCollectionAPI.testRecreateCollectionAfterFailure (:solr:core)
    Test output: /tmp/src/solr/solr/core/build/test-results/test/outputs/OUTPUT-org.apache.solr.cloud.api.collections.TestCollectionAPI.txt
    Reproduce with: gradlew :solr:core:test --tests "org.apache.solr.cloud.api.collections.TestCollectionAPI.testRecreateCollectionAfterFailure" -Ptests.jvms=96 "-Ptests.jvmargs=-XX:TieredStopAtLevel=1 -XX:+UseParallelGC -XX:ActiveProcessorCount=1 -XX:ReservedCodeCacheSize=120m" -Ptests.seed=1BD7721ACAF8B444 -Ptests.file.encoding=UTF-8

  - org.apache.solr.cloud.TestDistribDocBasedVersion.test (:solr:core)
    Test output: /tmp/src/solr/solr/core/build/test-results/test/outputs/OUTPUT-org.apache.solr.cloud.TestDistribDocBasedVersion.txt
    Reproduce with: gradlew :solr:core:test --tests "org.apache.solr.cloud.TestDistribDocBasedVersion.test" -Ptests.jvms=96 "-Ptests.jvmargs=-XX:TieredStopAtLevel=1 -XX:+UseParallelGC -XX:ActiveProcessorCount=1 -XX:ReservedCodeCacheSize=120m" -Ptests.seed=1BD7721ACAF8B444 -Ptests.file.encoding=UTF-8

  - org.apache.solr.cloud.BasicDistributedZk2Test.test (:solr:core)
    Test output: /tmp/src/solr/solr/core/build/test-results/test/outputs/OUTPUT-org.apache.solr.cloud.BasicDistributedZk2Test.txt
    Reproduce with: gradlew :solr:core:test --tests "org.apache.solr.cloud.BasicDistributedZk2Test.test" -Ptests.jvms=96 "-Ptests.jvmargs=-XX:TieredStopAtLevel=1 -XX:+UseParallelGC -XX:ActiveProcessorCount=1 -XX:ReservedCodeCacheSize=120m" -Ptests.seed=1BD7721ACAF8B444 -Ptests.file.encoding=UTF-8

  - org.apache.solr.cloud.BasicDistributedZkTest.test (:solr:core)
    Test output: /tmp/src/solr/solr/core/build/test-results/test/outputs/OUTPUT-org.apache.solr.cloud.BasicDistributedZkTest.txt
    Reproduce with: gradlew :solr:core:test --tests "org.apache.solr.cloud.BasicDistributedZkTest.test" -Ptests.jvms=96 "-Ptests.jvmargs=-XX:TieredStopAtLevel=1 -XX:+UseParallelGC -XX:ActiveProcessorCount=1 -XX:ReservedCodeCacheSize=120m" -Ptests.seed=1BD7721ACAF8B444 -Ptests.file.encoding=UTF-8

  - org.apache.solr.cloud.DistribCursorPagingTest.test (:solr:core)
    Test output: /tmp/src/solr/solr/core/build/test-results/test/outputs/OUTPUT-org.apache.solr.cloud.DistribCursorPagingTest.txt
    Reproduce with: gradlew :solr:core:test --tests "org.apache.solr.cloud.DistribCursorPagingTest.test" -Ptests.jvms=96 "-Ptests.jvmargs=-XX:TieredStopAtLevel=1 -XX:+UseParallelGC -XX:ActiveProcessorCount=1 -XX:ReservedCodeCacheSize=120m" -Ptests.seed=1BD7721ACAF8B444 -Ptests.file.encoding=UTF-8

  - org.apache.solr.cloud.RollingRestartTest.test (:solr:core)
    Test output: /tmp/src/solr/solr/core/build/test-results/test/outputs/OUTPUT-org.apache.solr.cloud.RollingRestartTest.txt
    Reproduce with: gradlew :solr:core:test --tests "org.apache.solr.cloud.RollingRestartTest.test" -Ptests.jvms=96 "-Ptests.jvmargs=-XX:TieredStopAtLevel=1 -XX:+UseParallelGC -XX:ActiveProcessorCount=1 -XX:ReservedCodeCacheSize=120m" -Ptests.seed=1BD7721ACAF8B444 -Ptests.file.encoding=UTF-8

  - org.apache.solr.cloud.SolrCloudExampleTest.testLoadDocsIntoGettingStartedCollection (:solr:core)
    Test output: /tmp/src/solr/solr/core/build/test-results/test/outputs/OUTPUT-org.apache.solr.cloud.SolrCloudExampleTest.txt
    Reproduce with: gradlew :solr:core:test --tests "org.apache.solr.cloud.SolrCloudExampleTest.testLoadDocsIntoGettingStartedCollection" -Ptests.jvms=96 "-Ptests.jvmargs=-XX:TieredStopAtLevel=1 -XX:+UseParallelGC -XX:ActiveProcessorCount=1 -XX:ReservedCodeCacheSize=120m" -Ptests.seed=1BD7721ACAF8B444 -Ptests.file.encoding=UTF-8

  - org.apache.solr.cloud.ShardRoutingCustomTest.test (:solr:core)
    Test output: /tmp/src/solr/solr/core/build/test-results/test/outputs/OUTPUT-org.apache.solr.cloud.ShardRoutingCustomTest.txt
    Reproduce with: gradlew :solr:core:test --tests "org.apache.solr.cloud.ShardRoutingCustomTest.test" -Ptests.jvms=96 "-Ptests.jvmargs=-XX:TieredStopAtLevel=1 -XX:+UseParallelGC -XX:ActiveProcessorCount=1 -XX:ReservedCodeCacheSize=120m" -Ptests.seed=1BD7721ACAF8B444 -Ptests.file.encoding=UTF-8

  - org.apache.solr.cloud.api.collections.TestCollectionAPI.test (:solr:core)
    Test output: /tmp/src/solr/solr/core/build/test-results/test/outputs/OUTPUT-org.apache.solr.cloud.api.collections.TestCollectionAPI.txt
    Reproduce with: gradlew :solr:core:test --tests "org.apache.solr.cloud.api.collections.TestCollectionAPI.test" -Ptests.jvms=96 "-Ptests.jvmargs=-XX:TieredStopAtLevel=1 -XX:+UseParallelGC -XX:ActiveProcessorCount=1 -XX:ReservedCodeCacheSize=120m" -Ptests.seed=1BD7721ACAF8B444 -Ptests.file.encoding=UTF-8

  - org.apache.solr.cloud.PeerSyncReplicationTest.test (:solr:core)
    Test output: /tmp/src/solr/solr/core/build/test-results/test/outputs/OUTPUT-org.apache.solr.cloud.PeerSyncReplicationTest.txt
    Reproduce with: gradlew :solr:core:test --tests "org.apache.solr.cloud.PeerSyncReplicationTest.test" -Ptests.jvms=96 "-Ptests.jvmargs=-XX:TieredStopAtLevel=1 -XX:+UseParallelGC -XX:ActiveProcessorCount=1 -XX:ReservedCodeCacheSize=120m" -Ptests.seed=1BD7721ACAF8B444 -Ptests.file.encoding=UTF-8

  - org.apache.solr.cloud.LeaderFailureAfterFreshStartTest.test (:solr:core)
    Test output: /tmp/src/solr/solr/core/build/test-results/test/outputs/OUTPUT-org.apache.solr.cloud.LeaderFailureAfterFreshStartTest.txt
    Reproduce with: gradlew :solr:core:test --tests "org.apache.solr.cloud.LeaderFailureAfterFreshStartTest.test" -Ptests.jvms=96 "-Ptests.jvmargs=-XX:TieredStopAtLevel=1 -XX:+UseParallelGC -XX:ActiveProcessorCount=1 -XX:ReservedCodeCacheSize=120m" -Ptests.seed=1BD7721ACAF8B444 -Ptests.file.encoding=UTF-8

  - org.apache.solr.cloud.api.collections.SimpleCollectionCreateDeleteTest.testPropertiesOfReplica (:solr:core)
    Test output: /tmp/src/solr/solr/core/build/test-results/test/outputs/OUTPUT-org.apache.solr.cloud.api.collections.SimpleCollectionCreateDeleteTest.txt
    Reproduce with: gradlew :solr:core:test --tests "org.apache.solr.cloud.api.collections.SimpleCollectionCreateDeleteTest.testPropertiesOfReplica" -Ptests.jvms=96 "-Ptests.jvmargs=-XX:TieredStopAtLevel=1 -XX:+UseParallelGC -XX:ActiveProcessorCount=1 -XX:ReservedCodeCacheSize=120m" -Ptests.seed=1BD7721ACAF8B444 -Ptests.file.encoding=UTF-8

  - org.apache.solr.cloud.api.collections.TestReplicaProperties.test (:solr:core)
    Test output: /tmp/src/solr/solr/core/build/test-results/test/outputs/OUTPUT-org.apache.solr.cloud.api.collections.TestReplicaProperties.txt
    Reproduce with: gradlew :solr:core:test --tests "org.apache.solr.cloud.api.collections.TestReplicaProperties.test" -Ptests.jvms=96 "-Ptests.jvmargs=-XX:TieredStopAtLevel=1 -XX:+UseParallelGC -XX:ActiveProcessorCount=1 -XX:ReservedCodeCacheSize=120m" -Ptests.seed=1BD7721ACAF8B444 -Ptests.file.encoding=UTF-8

  - org.apache.solr.cloud.SyncSliceTest.test (:solr:core)
    Test output: /tmp/src/solr/solr/core/build/test-results/test/outputs/OUTPUT-org.apache.solr.cloud.SyncSliceTest.txt
    Reproduce with: gradlew :solr:core:test --tests "org.apache.solr.cloud.SyncSliceTest.test" -Ptests.jvms=96 "-Ptests.jvmargs=-XX:TieredStopAtLevel=1 -XX:+UseParallelGC -XX:ActiveProcessorCount=1 -XX:ReservedCodeCacheSize=120m" -Ptests.seed=1BD7721ACAF8B444 -Ptests.file.encoding=UTF-8

  - org.apache.solr.cloud.TestOnReconnectListenerSupport.test (:solr:core)
    Test output: /tmp/src/solr/solr/core/build/test-results/test/outputs/OUTPUT-org.apache.solr.cloud.TestOnReconnectListenerSupport.txt
    Reproduce with: gradlew :solr:core:test --tests "org.apache.solr.cloud.TestOnReconnectListenerSupport.test" -Ptests.jvms=96 "-Ptests.jvmargs=-XX:TieredStopAtLevel=1 -XX:+UseParallelGC -XX:ActiveProcessorCount=1 -XX:ReservedCodeCacheSize=120m" -Ptests.seed=1BD7721ACAF8B444 -Ptests.file.encoding=UTF-8

  - org.apache.solr.cloud.api.collections.TestRequestStatusCollectionAPI.test (:solr:core)
    Test output: /tmp/src/solr/solr/core/build/test-results/test/outputs/OUTPUT-org.apache.solr.cloud.api.collections.TestRequestStatusCollectionAPI.txt
    Reproduce with: gradlew :solr:core:test --tests "org.apache.solr.cloud.api.collections.TestRequestStatusCollectionAPI.test" -Ptests.jvms=96 "-Ptests.jvmargs=-XX:TieredStopAtLevel=1 -XX:+UseParallelGC -XX:ActiveProcessorCount=1 -XX:ReservedCodeCacheSize=120m" -Ptests.seed=1BD7721ACAF8B444 -Ptests.file.encoding=UTF-8

  - org.apache.solr.cloud.TestShortCircuitedRequests.test (:solr:core)
    Test output: /tmp/src/solr/solr/core/build/test-results/test/outputs/OUTPUT-org.apache.solr.cloud.TestShortCircuitedRequests.txt
    Reproduce with: gradlew :solr:core:test --tests "org.apache.solr.cloud.TestShortCircuitedRequests.test" -Ptests.jvms=96 "-Ptests.jvmargs=-XX:TieredStopAtLevel=1 -XX:+UseParallelGC -XX:ActiveProcessorCount=1 -XX:ReservedCodeCacheSize=120m" -Ptests.seed=1BD7721ACAF8B444 -Ptests.file.encoding=UTF-8

  - org.apache.solr.cloud.ReplicationFactorTest.test (:solr:core)
    Test output: /tmp/src/solr/solr/core/build/test-results/test/outputs/OUTPUT-org.apache.solr.cloud.ReplicationFactorTest.txt
    Reproduce with: gradlew :solr:core:test --tests "org.apache.solr.cloud.ReplicationFactorTest.test" -Ptests.jvms=96 "-Ptests.jvmargs=-XX:TieredStopAtLevel=1 -XX:+UseParallelGC -XX:ActiveProcessorCount=1 -XX:ReservedCodeCacheSize=120m" -Ptests.seed=1BD7721ACAF8B444 -Ptests.file.encoding=UTF-8

  - org.apache.solr.cloud.ShardRoutingTest.test (:solr:core)
    Test output: /tmp/src/solr/solr/core/build/test-results/test/outputs/OUTPUT-org.apache.solr.cloud.ShardRoutingTest.txt
    Reproduce with: gradlew :solr:core:test --tests "org.apache.solr.cloud.ShardRoutingTest.test" -Ptests.jvms=96 "-Ptests.jvmargs=-XX:TieredStopAtLevel=1 -XX:+UseParallelGC -XX:ActiveProcessorCount=1 -XX:ReservedCodeCacheSize=120m" -Ptests.seed=1BD7721ACAF8B444 -Ptests.file.encoding=UTF-8

  - org.apache.solr.cloud.RecoveryAfterSoftCommitTest.test (:solr:core)
    Test output: /tmp/src/solr/solr/core/build/test-results/test/outputs/OUTPUT-org.apache.solr.cloud.RecoveryAfterSoftCommitTest.txt
    Reproduce with: gradlew :solr:core:test --tests "org.apache.solr.cloud.RecoveryAfterSoftCommitTest.test" -Ptests.jvms=96 "-Ptests.jvmargs=-XX:TieredStopAtLevel=1 -XX:+UseParallelGC -XX:ActiveProcessorCount=1 -XX:ReservedCodeCacheSize=120m" -Ptests.seed=1BD7721ACAF8B444 -Ptests.file.encoding=UTF-8

  - org.apache.solr.cloud.UnloadDistributedZkTest.test (:solr:core)
    Test output: /tmp/src/solr/solr/core/build/test-results/test/outputs/OUTPUT-org.apache.solr.cloud.UnloadDistributedZkTest.txt
    Reproduce with: gradlew :solr:core:test --tests "org.apache.solr.cloud.UnloadDistributedZkTest.test" -Ptests.jvms=96 "-Ptests.jvmargs=-XX:TieredStopAtLevel=1 -XX:+UseParallelGC -XX:ActiveProcessorCount=1 -XX:ReservedCodeCacheSize=120m" -Ptests.seed=1BD7721ACAF8B444 -Ptests.file.encoding=UTF-8

  - org.apache.solr.cloud.api.collections.TestCollectionAPI.testCreateCollectionBooleanValues (:solr:core)
    Test output: /tmp/src/solr/solr/core/build/test-results/test/outputs/OUTPUT-org.apache.solr.cloud.api.collections.TestCollectionAPI.txt
    Reproduce with: gradlew :solr:core:test --tests "org.apache.solr.cloud.api.collections.TestCollectionAPI.testCreateCollectionBooleanValues" -Ptests.jvms=96 "-Ptests.jvmargs=-XX:TieredStopAtLevel=1 -XX:+UseParallelGC -XX:ActiveProcessorCount=1 -XX:ReservedCodeCacheSize=120m" -Ptests.seed=1BD7721ACAF8B444 -Ptests.file.encoding=UTF-8

  - org.apache.solr.core.TestCustomStream.testDynamicLoadingCustomStream (:solr:core)
    Test output: /tmp/src/solr/solr/core/build/test-results/test/outputs/OUTPUT-org.apache.solr.core.TestCustomStream.txt
    Reproduce with: gradlew :solr:core:test --tests "org.apache.solr.core.TestCustomStream.testDynamicLoadingCustomStream" -Ptests.jvms=96 "-Ptests.jvmargs=-XX:TieredStopAtLevel=1 -XX:+UseParallelGC -XX:ActiveProcessorCount=1 -XX:ReservedCodeCacheSize=120m" -Ptests.seed=1BD7721ACAF8B444 -Ptests.file.encoding=UTF-8

  - org.apache.solr.cloud.MultiThreadedOCPTest.testParallelCollectionAPICalls (:solr:core)
    Test output: /tmp/src/solr/solr/core/build/test-results/test/outputs/OUTPUT-org.apache.solr.cloud.MultiThreadedOCPTest.txt
    Reproduce with: gradlew :solr:core:test --tests "org.apache.solr.cloud.MultiThreadedOCPTest.testParallelCollectionAPICalls" -Ptests.jvms=96 "-Ptests.jvmargs=-XX:TieredStopAtLevel=1 -XX:+UseParallelGC -XX:ActiveProcessorCount=1 -XX:ReservedCodeCacheSize=120m" -Ptests.seed=1BD7721ACAF8B444 -Ptests.file.encoding=UTF-8

  - org.apache.solr.cloud.TestDynamicFieldNamesIndexCorrectly.test (:solr:core)
    Test output: /tmp/src/solr/solr/core/build/test-results/test/outputs/OUTPUT-org.apache.solr.cloud.TestDynamicFieldNamesIndexCorrectly.txt
    Reproduce with: gradlew :solr:core:test --tests "org.apache.solr.cloud.TestDynamicFieldNamesIndexCorrectly.test" -Ptests.jvms=96 "-Ptests.jvmargs=-XX:TieredStopAtLevel=1 -XX:+UseParallelGC -XX:ActiveProcessorCount=1 -XX:ReservedCodeCacheSize=120m" -Ptests.seed=1BD7721ACAF8B444 -Ptests.file.encoding=UTF-8

  - org.apache.solr.cloud.api.collections.SimpleCollectionCreateDeleteTest.testCreateAndDeleteThenCreateAgain (:solr:core)
    Test output: /tmp/src/solr/solr/core/build/test-results/test/outputs/OUTPUT-org.apache.solr.cloud.api.collections.SimpleCollectionCreateDeleteTest.txt
    Reproduce with: gradlew :solr:core:test --tests "org.apache.solr.cloud.api.collections.SimpleCollectionCreateDeleteTest.testCreateAndDeleteThenCreateAgain" -Ptests.jvms=96 "-Ptests.jvmargs=-XX:TieredStopAtLevel=1 -XX:+UseParallelGC -XX:ActiveProcessorCount=1 -XX:ReservedCodeCacheSize=120m" -Ptests.seed=1BD7721ACAF8B444 -Ptests.file.encoding=UTF-8

  - org.apache.solr.cloud.HttpPartitionOnCommitTest.test (:solr:core)
    Test output: /tmp/src/solr/solr/core/build/test-results/test/outputs/OUTPUT-org.apache.solr.cloud.HttpPartitionOnCommitTest.txt
    Reproduce with: gradlew :solr:core:test --tests "org.apache.solr.cloud.HttpPartitionOnCommitTest.test" -Ptests.jvms=96 "-Ptests.jvmargs=-XX:TieredStopAtLevel=1 -XX:+UseParallelGC -XX:ActiveProcessorCount=1 -XX:ReservedCodeCacheSize=120m" -Ptests.seed=1BD7721ACAF8B444 -Ptests.file.encoding=UTF-8

  - org.apache.solr.cloud.TestRandomRequestDistribution.test (:solr:core)
    Test output: /tmp/src/solr/solr/core/build/test-results/test/outputs/OUTPUT-org.apache.solr.cloud.TestRandomRequestDistribution.txt
    Reproduce with: gradlew :solr:core:test --tests "org.apache.solr.cloud.TestRandomRequestDistribution.test" -Ptests.jvms=96 "-Ptests.jvmargs=-XX:TieredStopAtLevel=1 -XX:+UseParallelGC -XX:ActiveProcessorCount=1 -XX:ReservedCodeCacheSize=120m" -Ptests.seed=1BD7721ACAF8B444 -Ptests.file.encoding=UTF-8

  - org.apache.solr.cloud.api.collections.TestCollectionAPI.testConfigCaching (:solr:core)
    Test output: /tmp/src/solr/solr/core/build/test-results/test/outputs/OUTPUT-org.apache.solr.cloud.api.collections.TestCollectionAPI.txt
    Reproduce with: gradlew :solr:core:test --tests "org.apache.solr.cloud.api.collections.TestCollectionAPI.testConfigCaching" -Ptests.jvms=96 "-Ptests.jvmargs=-XX:TieredStopAtLevel=1 -XX:+UseParallelGC -XX:ActiveProcessorCount=1 -XX:ReservedCodeCacheSize=120m" -Ptests.seed=1BD7721ACAF8B444 -Ptests.file.encoding=UTF-8

  - org.apache.solr.cloud.MultiThreadedOCPTest.testFillWorkQueue (:solr:core)
    Test output: /tmp/src/solr/solr/core/build/test-results/test/outputs/OUTPUT-org.apache.solr.cloud.MultiThreadedOCPTest.txt
    Reproduce with: gradlew :solr:core:test --tests "org.apache.solr.cloud.MultiThreadedOCPTest.testFillWorkQueue" -Ptests.jvms=96 "-Ptests.jvmargs=-XX:TieredStopAtLevel=1 -XX:+UseParallelGC -XX:ActiveProcessorCount=1 -XX:ReservedCodeCacheSize=120m" -Ptests.seed=1BD7721ACAF8B444 -Ptests.file.encoding=UTF-8

  - org.apache.solr.handler.TestSystemCollAutoCreate.testAutoCreate (:solr:core)
    Test output: /tmp/src/solr/solr/core/build/test-results/test/outputs/OUTPUT-org.apache.solr.handler.TestSystemCollAutoCreate.txt
    Reproduce with: gradlew :solr:core:test --tests "org.apache.solr.handler.TestSystemCollAutoCreate.testAutoCreate" -Ptests.jvms=96 "-Ptests.jvmargs=-XX:TieredStopAtLevel=1 -XX:+UseParallelGC -XX:ActiveProcessorCount=1 -XX:ReservedCodeCacheSize=120m" -Ptests.seed=1BD7721ACAF8B444 -Ptests.file.encoding=UTF-8

  - org.apache.solr.cloud.MultiThreadedOCPTest.testLongAndShortRunningParallelApiCalls (:solr:core)
    Test output: /tmp/src/solr/solr/core/build/test-results/test/outputs/OUTPUT-org.apache.solr.cloud.MultiThreadedOCPTest.txt
    Reproduce with: gradlew :solr:core:test --tests "org.apache.solr.cloud.MultiThreadedOCPTest.testLongAndShortRunningParallelApiCalls" -Ptests.jvms=96 "-Ptests.jvmargs=-XX:TieredStopAtLevel=1 -XX:+UseParallelGC -XX:ActiveProcessorCount=1 -XX:ReservedCodeCacheSize=120m" -Ptests.seed=1BD7721ACAF8B444 -Ptests.file.encoding=UTF-8

  - org.apache.solr.cloud.api.collections.SimpleCollectionCreateDeleteTest.testDeleteDoesNotDeleteSharedAutocreatedConfigSet (:solr:core)
    Test output: /tmp/src/solr/solr/core/build/test-results/test/outputs/OUTPUT-org.apache.solr.cloud.api.collections.SimpleCollectionCreateDeleteTest.txt
    Reproduce with: gradlew :solr:core:test --tests "org.apache.solr.cloud.api.collections.SimpleCollectionCreateDeleteTest.testDeleteDoesNotDeleteSharedAutocreatedConfigSet" -Ptests.jvms=96 "-Ptests.jvmargs=-XX:TieredStopAtLevel=1 -XX:+UseParallelGC -XX:ActiveProcessorCount=1 -XX:ReservedCodeCacheSize=120m" -Ptests.seed=1BD7721ACAF8B444 -Ptests.file.encoding=UTF-8

  - org.apache.solr.cloud.TestCloudPivotFacet.test (:solr:core)
    Test output: /tmp/src/solr/solr/core/build/test-results/test/outputs/OUTPUT-org.apache.solr.cloud.TestCloudPivotFacet.txt
    Reproduce with: gradlew :solr:core:test --tests "org.apache.solr.cloud.TestCloudPivotFacet.test" -Ptests.jvms=96 "-Ptests.jvmargs=-XX:TieredStopAtLevel=1 -XX:+UseParallelGC -XX:ActiveProcessorCount=1 -XX:ReservedCodeCacheSize=120m" -Ptests.seed=1BD7721ACAF8B444 -Ptests.file.encoding=UTF-8

  - org.apache.solr.cloud.api.collections.SimpleCollectionCreateDeleteTest.testDeleteAlsoDeletesAutocreatedConfigSet (:solr:core)
    Test output: /tmp/src/solr/solr/core/build/test-results/test/outputs/OUTPUT-org.apache.solr.cloud.api.collections.SimpleCollectionCreateDeleteTest.txt
    Reproduce with: gradlew :solr:core:test --tests "org.apache.solr.cloud.api.collections.SimpleCollectionCreateDeleteTest.testDeleteAlsoDeletesAutocreatedConfigSet" -Ptests.jvms=96 "-Ptests.jvmargs=-XX:TieredStopAtLevel=1 -XX:+UseParallelGC -XX:ActiveProcessorCount=1 -XX:ReservedCodeCacheSize=120m" -Ptests.seed=1BD7721ACAF8B444 -Ptests.file.encoding=UTF-8

  - org.apache.solr.cloud.MultiThreadedOCPTest.testTaskExclusivity (:solr:core)
    Test output: /tmp/src/solr/solr/core/build/test-results/test/outputs/OUTPUT-org.apache.solr.cloud.MultiThreadedOCPTest.txt
    Reproduce with: gradlew :solr:core:test --tests "org.apache.solr.cloud.MultiThreadedOCPTest.testTaskExclusivity" -Ptests.jvms=96 "-Ptests.jvmargs=-XX:TieredStopAtLevel=1 -XX:+UseParallelGC -XX:ActiveProcessorCount=1 -XX:ReservedCodeCacheSize=120m" -Ptests.seed=1BD7721ACAF8B444 -Ptests.file.encoding=UTF-8

  - org.apache.solr.handler.TestSolrConfigHandlerCloud.test (:solr:core)
    Test output: /tmp/src/solr/solr/core/build/test-results/test/outputs/OUTPUT-org.apache.solr.handler.TestSolrConfigHandlerCloud.txt
    Reproduce with: gradlew :solr:core:test --tests "org.apache.solr.handler.TestSolrConfigHandlerCloud.test" -Ptests.jvms=96 "-Ptests.jvmargs=-XX:TieredStopAtLevel=1 -XX:+UseParallelGC -XX:ActiveProcessorCount=1 -XX:ReservedCodeCacheSize=120m" -Ptests.seed=1BD7721ACAF8B444 -Ptests.file.encoding=UTF-8

  - org.apache.solr.handler.TestSolrConfigHandlerConcurrent.test (:solr:core)
    Test output: /tmp/src/solr/solr/core/build/test-results/test/outputs/OUTPUT-org.apache.solr.handler.TestSolrConfigHandlerConcurrent.txt
    Reproduce with: gradlew :solr:core:test --tests "org.apache.solr.handler.TestSolrConfigHandlerConcurrent.test" -Ptests.jvms=96 "-Ptests.jvmargs=-XX:TieredStopAtLevel=1 -XX:+UseParallelGC -XX:ActiveProcessorCount=1 -XX:ReservedCodeCacheSize=120m" -Ptests.seed=1BD7721ACAF8B444 -Ptests.file.encoding=UTF-8

  - org.apache.solr.cloud.MultiThreadedOCPTest.testDeduplicationOfSubmittedTasks (:solr:core)
    Test output: /tmp/src/solr/solr/core/build/test-results/test/outputs/OUTPUT-org.apache.solr.cloud.MultiThreadedOCPTest.txt
    Reproduce with: gradlew :solr:core:test --tests "org.apache.solr.cloud.MultiThreadedOCPTest.testDeduplicationOfSubmittedTasks" -Ptests.jvms=96 "-Ptests.jvmargs=-XX:TieredStopAtLevel=1 -XX:+UseParallelGC -XX:ActiveProcessorCount=1 -XX:ReservedCodeCacheSize=120m" -Ptests.seed=1BD7721ACAF8B444 -Ptests.file.encoding=UTF-8

  - org.apache.solr.update.TestInPlaceUpdatesDistrib.test (:solr:core)
    Test output: /tmp/src/solr/solr/core/build/test-results/test/outputs/OUTPUT-org.apache.solr.update.TestInPlaceUpdatesDistrib.txt
    Reproduce with: gradlew :solr:core:test --tests "org.apache.solr.update.TestInPlaceUpdatesDistrib.test" -Ptests.jvms=96 "-Ptests.jvmargs=-XX:TieredStopAtLevel=1 -XX:+UseParallelGC -XX:ActiveProcessorCount=1 -XX:ReservedCodeCacheSize=120m" -Ptests.seed=1BD7721ACAF8B444 -Ptests.file.encoding=UTF-8

  - org.apache.solr.schema.TestCloudManagedSchema.test (:solr:core)
    Test output: /tmp/src/solr/solr/core/build/test-results/test/outputs/OUTPUT-org.apache.solr.schema.TestCloudManagedSchema.txt
    Reproduce with: gradlew :solr:core:test --tests "org.apache.solr.schema.TestCloudManagedSchema.test" -Ptests.jvms=96 "-Ptests.jvmargs=-XX:TieredStopAtLevel=1 -XX:+UseParallelGC -XX:ActiveProcessorCount=1 -XX:ReservedCodeCacheSize=120m" -Ptests.seed=1BD7721ACAF8B444 -Ptests.file.encoding=UTF-8

  - org.apache.solr.handler.TestConfigReload.test (:solr:core)
    Test output: /tmp/src/solr/solr/core/build/test-results/test/outputs/OUTPUT-org.apache.solr.handler.TestConfigReload.txt
    Reproduce with: gradlew :solr:core:test --tests "org.apache.solr.handler.TestConfigReload.test" -Ptests.jvms=96 "-Ptests.jvmargs=-XX:TieredStopAtLevel=1 -XX:+UseParallelGC -XX:ActiveProcessorCount=1 -XX:ReservedCodeCacheSize=120m" -Ptests.seed=1BD7721ACAF8B444 -Ptests.file.encoding=UTF-8

  - org.apache.solr.cloud.TestStressInPlaceUpdates.stressTest (:solr:core)
    Test output: /tmp/src/solr/solr/core/build/test-results/test/outputs/OUTPUT-org.apache.solr.cloud.TestStressInPlaceUpdates.txt
    Reproduce with: gradlew :solr:core:test --tests "org.apache.solr.cloud.TestStressInPlaceUpdates.stressTest" -Ptests.jvms=96 "-Ptests.jvmargs=-XX:TieredStopAtLevel=1 -XX:+UseParallelGC -XX:ActiveProcessorCount=1 -XX:ReservedCodeCacheSize=120m" -Ptests.seed=1BD7721ACAF8B444 -Ptests.file.encoding=UTF-8

  - org.apache.solr.handler.component.TestTrackingShardHandlerFactory.testRequestTracking (:solr:core)
    Test output: /tmp/src/solr/solr/core/build/test-results/test/outputs/OUTPUT-org.apache.solr.handler.component.TestTrackingShardHandlerFactory.txt
    Reproduce with: gradlew :solr:core:test --tests "org.apache.solr.handler.component.TestTrackingShardHandlerFactory.testRequestTracking" -Ptests.jvms=96 "-Ptests.jvmargs=-XX:TieredStopAtLevel=1 -XX:+UseParallelGC -XX:ActiveProcessorCount=1 -XX:ReservedCodeCacheSize=120m" -Ptests.seed=1BD7721ACAF8B444 -Ptests.file.encoding=UTF-8

  - org.apache.solr.security.TestAuthorizationFramework.authorizationFrameworkTest (:solr:core)
    Test output: /tmp/src/solr/solr/core/build/test-results/test/outputs/OUTPUT-org.apache.solr.security.TestAuthorizationFramework.txt
    Reproduce with: gradlew :solr:core:test --tests "org.apache.solr.security.TestAuthorizationFramework.authorizationFrameworkTest" -Ptests.jvms=96 "-Ptests.jvmargs=-XX:TieredStopAtLevel=1 -XX:+UseParallelGC -XX:ActiveProcessorCount=1 -XX:ReservedCodeCacheSize=120m" -Ptests.seed=1BD7721ACAF8B444 -Ptests.file.encoding=UTF-8

  - org.apache.solr.schema.TestCloudSchemaless.test (:solr:core)
    Test output: /tmp/src/solr/solr/core/build/test-results/test/outputs/OUTPUT-org.apache.solr.schema.TestCloudSchemaless.txt
    Reproduce with: gradlew :solr:core:test --tests "org.apache.solr.schema.TestCloudSchemaless.test" -Ptests.jvms=96 "-Ptests.jvmargs=-XX:TieredStopAtLevel=1 -XX:+UseParallelGC -XX:ActiveProcessorCount=1 -XX:ReservedCodeCacheSize=120m" -Ptests.seed=1BD7721ACAF8B444 -Ptests.file.encoding=UTF-8

  - org.apache.solr.handler.TestBlobHandler.doBlobHandlerTest (:solr:core)
    Test output: /tmp/src/solr/solr/core/build/test-results/test/outputs/OUTPUT-org.apache.solr.handler.TestBlobHandler.txt
    Reproduce with: gradlew :solr:core:test --tests "org.apache.solr.handler.TestBlobHandler.doBlobHandlerTest" -Ptests.jvms=96 "-Ptests.jvmargs=-XX:TieredStopAtLevel=1 -XX:+UseParallelGC -XX:ActiveProcessorCount=1 -XX:ReservedCodeCacheSize=120m" -Ptests.seed=1BD7721ACAF8B444 -Ptests.file.encoding=UTF-8

  - org.apache.solr.schema.TestBulkSchemaConcurrent.test (:solr:core)
    Test output: /tmp/src/solr/solr/core/build/test-results/test/outputs/OUTPUT-org.apache.solr.schema.TestBulkSchemaConcurrent.txt
    Reproduce with: gradlew :solr:core:test --tests "org.apache.solr.schema.TestBulkSchemaConcurrent.test" -Ptests.jvms=96 "-Ptests.jvmargs=-XX:TieredStopAtLevel=1 -XX:+UseParallelGC -XX:ActiveProcessorCount=1 -XX:ReservedCodeCacheSize=120m" -Ptests.seed=1BD7721ACAF8B444 -Ptests.file.encoding=UTF-8

WARNING: there were unreferenced files under license folder:
  - /tmp/src/solr/solr/licenses/jakarta.inject-2.6.1.jar.sha1

FAILURE: Build completed with 2 failures.

1: Task failed with an exception.
-----------
* What went wrong:
Execution failed for task ':solr:modules:hdfs:test'.
> There were failing tests. See the results at: file:///tmp/src/solr/solr/modules/hdfs/build/test-results/test/

* Try:
> Run with --scan to get full insights.
==============================================================================

2: Task failed with an exception.
-----------
* What went wrong:
Execution failed for task ':solr:core:test'.
> There were failing tests. See the results at: file:///tmp/src/solr/solr/core/build/test-results/test/

* Try:
> Run with --scan to get full insights.
==============================================================================

BUILD FAILED in 8m 7s
670 actionable tasks: 668 executed, 2 up-to-date
[?12l[?25h
------------------------------------------------------------------------
Build Failed: returned 1

Total time: 8m32s
------------------------------------------------------------------------
+ status=1
+ ./crave pull '**/build/**/test/TEST-*.xml'
+ ./crave pull '**/*.events'
+ ./crave pull 'heapdumps/**'
Error: rsync: [sender] change_dir "/tmp/src/solr/heapdumps" failed: No such file or directory (2)
rsync error: some files/attrs were not transferred (see previous errors) (code 23) at main.c(1682) [Receiver=3.1.3]
rsync: [Receiver] write error: Broken pipe (32)

+ ./crave pull '**/hs_err_pid*'
+ exit 1
Build step 'Execute shell' marked build as failure
Archiving artifacts
Recording test results
ERROR: Step ‘Publish JUnit test result report’ failed: No test report files were found. Configuration error?
Email was triggered for: Failure - Any
Sending email for trigger: Failure - Any

[JENKINS] Solr » Solr-Check-9.x (Crave) - Build # 6237 - Still Failing!

Posted by Apache Jenkins Server <je...@builds.apache.org>.
Build: https://ci-builds.apache.org/job/Solr/job/Solr-Check-9.x%20(Crave)/6237/

No tests ran.

Build Log:
[...truncated 15373 lines...]
ERROR: The following test(s) have failed:
  - org.apache.solr.hdfs.index.CheckHdfsIndexTest.testDeletedDocs (:solr:modules:hdfs)
    Test output: /tmp/src/solr/solr/modules/hdfs/build/test-results/test/outputs/OUTPUT-org.apache.solr.hdfs.index.CheckHdfsIndexTest.txt
    Reproduce with: gradlew :solr:modules:hdfs:test --tests "org.apache.solr.hdfs.index.CheckHdfsIndexTest.testDeletedDocs" -Ptests.jvms=96 "-Ptests.jvmargs=-XX:TieredStopAtLevel=1 -XX:+UseParallelGC -XX:ActiveProcessorCount=1 -XX:ReservedCodeCacheSize=120m" -Ptests.seed=AF8D7EB09B621873 -Ptests.file.encoding=US-ASCII

  - org.apache.solr.hdfs.index.CheckHdfsIndexTest.doTest (:solr:modules:hdfs)
    Test output: /tmp/src/solr/solr/modules/hdfs/build/test-results/test/outputs/OUTPUT-org.apache.solr.hdfs.index.CheckHdfsIndexTest.txt
    Reproduce with: gradlew :solr:modules:hdfs:test --tests "org.apache.solr.hdfs.index.CheckHdfsIndexTest.doTest" -Ptests.jvms=96 "-Ptests.jvmargs=-XX:TieredStopAtLevel=1 -XX:+UseParallelGC -XX:ActiveProcessorCount=1 -XX:ReservedCodeCacheSize=120m" -Ptests.seed=AF8D7EB09B621873 -Ptests.file.encoding=US-ASCII

  - org.apache.solr.hdfs.index.CheckHdfsIndexTest.testChecksumsOnly (:solr:modules:hdfs)
    Test output: /tmp/src/solr/solr/modules/hdfs/build/test-results/test/outputs/OUTPUT-org.apache.solr.hdfs.index.CheckHdfsIndexTest.txt
    Reproduce with: gradlew :solr:modules:hdfs:test --tests "org.apache.solr.hdfs.index.CheckHdfsIndexTest.testChecksumsOnly" -Ptests.jvms=96 "-Ptests.jvmargs=-XX:TieredStopAtLevel=1 -XX:+UseParallelGC -XX:ActiveProcessorCount=1 -XX:ReservedCodeCacheSize=120m" -Ptests.seed=AF8D7EB09B621873 -Ptests.file.encoding=US-ASCII

  - org.apache.solr.hdfs.index.CheckHdfsIndexTest.testChecksumsOnlyVerbose (:solr:modules:hdfs)
    Test output: /tmp/src/solr/solr/modules/hdfs/build/test-results/test/outputs/OUTPUT-org.apache.solr.hdfs.index.CheckHdfsIndexTest.txt
    Reproduce with: gradlew :solr:modules:hdfs:test --tests "org.apache.solr.hdfs.index.CheckHdfsIndexTest.testChecksumsOnlyVerbose" -Ptests.jvms=96 "-Ptests.jvmargs=-XX:TieredStopAtLevel=1 -XX:+UseParallelGC -XX:ActiveProcessorCount=1 -XX:ReservedCodeCacheSize=120m" -Ptests.seed=AF8D7EB09B621873 -Ptests.file.encoding=US-ASCII

  - org.apache.solr.cloud.BasicDistributedZkTest.test (:solr:core)
    Test output: /tmp/src/solr/solr/core/build/test-results/test/outputs/OUTPUT-org.apache.solr.cloud.BasicDistributedZkTest.txt
    Reproduce with: gradlew :solr:core:test --tests "org.apache.solr.cloud.BasicDistributedZkTest.test" -Ptests.jvms=96 "-Ptests.jvmargs=-XX:TieredStopAtLevel=1 -XX:+UseParallelGC -XX:ActiveProcessorCount=1 -XX:ReservedCodeCacheSize=120m" -Ptests.seed=AF8D7EB09B621873 -Ptests.file.encoding=US-ASCII

  - org.apache.solr.cloud.DistribCursorPagingTest.test (:solr:core)
    Test output: /tmp/src/solr/solr/core/build/test-results/test/outputs/OUTPUT-org.apache.solr.cloud.DistribCursorPagingTest.txt
    Reproduce with: gradlew :solr:core:test --tests "org.apache.solr.cloud.DistribCursorPagingTest.test" -Ptests.jvms=96 "-Ptests.jvmargs=-XX:TieredStopAtLevel=1 -XX:+UseParallelGC -XX:ActiveProcessorCount=1 -XX:ReservedCodeCacheSize=120m" -Ptests.seed=AF8D7EB09B621873 -Ptests.file.encoding=US-ASCII

  - org.apache.solr.cloud.api.collections.TestCollectionAPI.testCreateCollectionBooleanValues (:solr:core)
    Test output: /tmp/src/solr/solr/core/build/test-results/test/outputs/OUTPUT-org.apache.solr.cloud.api.collections.TestCollectionAPI.txt
    Reproduce with: gradlew :solr:core:test --tests "org.apache.solr.cloud.api.collections.TestCollectionAPI.testCreateCollectionBooleanValues" -Ptests.jvms=96 "-Ptests.jvmargs=-XX:TieredStopAtLevel=1 -XX:+UseParallelGC -XX:ActiveProcessorCount=1 -XX:ReservedCodeCacheSize=120m" -Ptests.seed=AF8D7EB09B621873 -Ptests.file.encoding=US-ASCII

  - org.apache.solr.cloud.RollingRestartTest.test (:solr:core)
    Test output: /tmp/src/solr/solr/core/build/test-results/test/outputs/OUTPUT-org.apache.solr.cloud.RollingRestartTest.txt
    Reproduce with: gradlew :solr:core:test --tests "org.apache.solr.cloud.RollingRestartTest.test" -Ptests.jvms=96 "-Ptests.jvmargs=-XX:TieredStopAtLevel=1 -XX:+UseParallelGC -XX:ActiveProcessorCount=1 -XX:ReservedCodeCacheSize=120m" -Ptests.seed=AF8D7EB09B621873 -Ptests.file.encoding=US-ASCII

  - org.apache.solr.cloud.HttpPartitionOnCommitTest.test (:solr:core)
    Test output: /tmp/src/solr/solr/core/build/test-results/test/outputs/OUTPUT-org.apache.solr.cloud.HttpPartitionOnCommitTest.txt
    Reproduce with: gradlew :solr:core:test --tests "org.apache.solr.cloud.HttpPartitionOnCommitTest.test" -Ptests.jvms=96 "-Ptests.jvmargs=-XX:TieredStopAtLevel=1 -XX:+UseParallelGC -XX:ActiveProcessorCount=1 -XX:ReservedCodeCacheSize=120m" -Ptests.seed=AF8D7EB09B621873 -Ptests.file.encoding=US-ASCII

  - org.apache.solr.cloud.BasicDistributedZk2Test.test (:solr:core)
    Test output: /tmp/src/solr/solr/core/build/test-results/test/outputs/OUTPUT-org.apache.solr.cloud.BasicDistributedZk2Test.txt
    Reproduce with: gradlew :solr:core:test --tests "org.apache.solr.cloud.BasicDistributedZk2Test.test" -Ptests.jvms=96 "-Ptests.jvmargs=-XX:TieredStopAtLevel=1 -XX:+UseParallelGC -XX:ActiveProcessorCount=1 -XX:ReservedCodeCacheSize=120m" -Ptests.seed=AF8D7EB09B621873 -Ptests.file.encoding=US-ASCII

  - org.apache.solr.cloud.SolrCloudExampleTest.testLoadDocsIntoGettingStartedCollection (:solr:core)
    Test output: /tmp/src/solr/solr/core/build/test-results/test/outputs/OUTPUT-org.apache.solr.cloud.SolrCloudExampleTest.txt
    Reproduce with: gradlew :solr:core:test --tests "org.apache.solr.cloud.SolrCloudExampleTest.testLoadDocsIntoGettingStartedCollection" -Ptests.jvms=96 "-Ptests.jvmargs=-XX:TieredStopAtLevel=1 -XX:+UseParallelGC -XX:ActiveProcessorCount=1 -XX:ReservedCodeCacheSize=120m" -Ptests.seed=AF8D7EB09B621873 -Ptests.file.encoding=US-ASCII

  - org.apache.solr.cloud.TestDistribDocBasedVersion.test (:solr:core)
    Test output: /tmp/src/solr/solr/core/build/test-results/test/outputs/OUTPUT-org.apache.solr.cloud.TestDistribDocBasedVersion.txt
    Reproduce with: gradlew :solr:core:test --tests "org.apache.solr.cloud.TestDistribDocBasedVersion.test" -Ptests.jvms=96 "-Ptests.jvmargs=-XX:TieredStopAtLevel=1 -XX:+UseParallelGC -XX:ActiveProcessorCount=1 -XX:ReservedCodeCacheSize=120m" -Ptests.seed=AF8D7EB09B621873 -Ptests.file.encoding=US-ASCII

  - org.apache.solr.cloud.PeerSyncReplicationTest.test (:solr:core)
    Test output: /tmp/src/solr/solr/core/build/test-results/test/outputs/OUTPUT-org.apache.solr.cloud.PeerSyncReplicationTest.txt
    Reproduce with: gradlew :solr:core:test --tests "org.apache.solr.cloud.PeerSyncReplicationTest.test" -Ptests.jvms=96 "-Ptests.jvmargs=-XX:TieredStopAtLevel=1 -XX:+UseParallelGC -XX:ActiveProcessorCount=1 -XX:ReservedCodeCacheSize=120m" -Ptests.seed=AF8D7EB09B621873 -Ptests.file.encoding=US-ASCII

  - org.apache.solr.cloud.SyncSliceTest.test (:solr:core)
    Test output: /tmp/src/solr/solr/core/build/test-results/test/outputs/OUTPUT-org.apache.solr.cloud.SyncSliceTest.txt
    Reproduce with: gradlew :solr:core:test --tests "org.apache.solr.cloud.SyncSliceTest.test" -Ptests.jvms=96 "-Ptests.jvmargs=-XX:TieredStopAtLevel=1 -XX:+UseParallelGC -XX:ActiveProcessorCount=1 -XX:ReservedCodeCacheSize=120m" -Ptests.seed=AF8D7EB09B621873 -Ptests.file.encoding=US-ASCII

  - org.apache.solr.cloud.api.collections.TestCollectionAPI.test (:solr:core)
    Test output: /tmp/src/solr/solr/core/build/test-results/test/outputs/OUTPUT-org.apache.solr.cloud.api.collections.TestCollectionAPI.txt
    Reproduce with: gradlew :solr:core:test --tests "org.apache.solr.cloud.api.collections.TestCollectionAPI.test" -Ptests.jvms=96 "-Ptests.jvmargs=-XX:TieredStopAtLevel=1 -XX:+UseParallelGC -XX:ActiveProcessorCount=1 -XX:ReservedCodeCacheSize=120m" -Ptests.seed=AF8D7EB09B621873 -Ptests.file.encoding=US-ASCII

  - org.apache.solr.cloud.RecoveryAfterSoftCommitTest.test (:solr:core)
    Test output: /tmp/src/solr/solr/core/build/test-results/test/outputs/OUTPUT-org.apache.solr.cloud.RecoveryAfterSoftCommitTest.txt
    Reproduce with: gradlew :solr:core:test --tests "org.apache.solr.cloud.RecoveryAfterSoftCommitTest.test" -Ptests.jvms=96 "-Ptests.jvmargs=-XX:TieredStopAtLevel=1 -XX:+UseParallelGC -XX:ActiveProcessorCount=1 -XX:ReservedCodeCacheSize=120m" -Ptests.seed=AF8D7EB09B621873 -Ptests.file.encoding=US-ASCII

  - org.apache.solr.cloud.ShardRoutingCustomTest.test (:solr:core)
    Test output: /tmp/src/solr/solr/core/build/test-results/test/outputs/OUTPUT-org.apache.solr.cloud.ShardRoutingCustomTest.txt
    Reproduce with: gradlew :solr:core:test --tests "org.apache.solr.cloud.ShardRoutingCustomTest.test" -Ptests.jvms=96 "-Ptests.jvmargs=-XX:TieredStopAtLevel=1 -XX:+UseParallelGC -XX:ActiveProcessorCount=1 -XX:ReservedCodeCacheSize=120m" -Ptests.seed=AF8D7EB09B621873 -Ptests.file.encoding=US-ASCII

  - org.apache.solr.cloud.MultiThreadedOCPTest.testParallelCollectionAPICalls (:solr:core)
    Test output: /tmp/src/solr/solr/core/build/test-results/test/outputs/OUTPUT-org.apache.solr.cloud.MultiThreadedOCPTest.txt
    Reproduce with: gradlew :solr:core:test --tests "org.apache.solr.cloud.MultiThreadedOCPTest.testParallelCollectionAPICalls" -Ptests.jvms=96 "-Ptests.jvmargs=-XX:TieredStopAtLevel=1 -XX:+UseParallelGC -XX:ActiveProcessorCount=1 -XX:ReservedCodeCacheSize=120m" -Ptests.seed=AF8D7EB09B621873 -Ptests.file.encoding=US-ASCII

  - org.apache.solr.cloud.UnloadDistributedZkTest.test (:solr:core)
    Test output: /tmp/src/solr/solr/core/build/test-results/test/outputs/OUTPUT-org.apache.solr.cloud.UnloadDistributedZkTest.txt
    Reproduce with: gradlew :solr:core:test --tests "org.apache.solr.cloud.UnloadDistributedZkTest.test" -Ptests.jvms=96 "-Ptests.jvmargs=-XX:TieredStopAtLevel=1 -XX:+UseParallelGC -XX:ActiveProcessorCount=1 -XX:ReservedCodeCacheSize=120m" -Ptests.seed=AF8D7EB09B621873 -Ptests.file.encoding=US-ASCII

  - org.apache.solr.cloud.api.collections.SimpleCollectionCreateDeleteTest.testDeleteDoesNotDeleteSharedAutocreatedConfigSet (:solr:core)
    Test output: /tmp/src/solr/solr/core/build/test-results/test/outputs/OUTPUT-org.apache.solr.cloud.api.collections.SimpleCollectionCreateDeleteTest.txt
    Reproduce with: gradlew :solr:core:test --tests "org.apache.solr.cloud.api.collections.SimpleCollectionCreateDeleteTest.testDeleteDoesNotDeleteSharedAutocreatedConfigSet" -Ptests.jvms=96 "-Ptests.jvmargs=-XX:TieredStopAtLevel=1 -XX:+UseParallelGC -XX:ActiveProcessorCount=1 -XX:ReservedCodeCacheSize=120m" -Ptests.seed=AF8D7EB09B621873 -Ptests.file.encoding=US-ASCII

  - org.apache.solr.cloud.TestShortCircuitedRequests.test (:solr:core)
    Test output: /tmp/src/solr/solr/core/build/test-results/test/outputs/OUTPUT-org.apache.solr.cloud.TestShortCircuitedRequests.txt
    Reproduce with: gradlew :solr:core:test --tests "org.apache.solr.cloud.TestShortCircuitedRequests.test" -Ptests.jvms=96 "-Ptests.jvmargs=-XX:TieredStopAtLevel=1 -XX:+UseParallelGC -XX:ActiveProcessorCount=1 -XX:ReservedCodeCacheSize=120m" -Ptests.seed=AF8D7EB09B621873 -Ptests.file.encoding=US-ASCII

  - org.apache.solr.cloud.ReplicationFactorTest.test (:solr:core)
    Test output: /tmp/src/solr/solr/core/build/test-results/test/outputs/OUTPUT-org.apache.solr.cloud.ReplicationFactorTest.txt
    Reproduce with: gradlew :solr:core:test --tests "org.apache.solr.cloud.ReplicationFactorTest.test" -Ptests.jvms=96 "-Ptests.jvmargs=-XX:TieredStopAtLevel=1 -XX:+UseParallelGC -XX:ActiveProcessorCount=1 -XX:ReservedCodeCacheSize=120m" -Ptests.seed=AF8D7EB09B621873 -Ptests.file.encoding=US-ASCII

  - org.apache.solr.cloud.LeaderFailureAfterFreshStartTest.test (:solr:core)
    Test output: /tmp/src/solr/solr/core/build/test-results/test/outputs/OUTPUT-org.apache.solr.cloud.LeaderFailureAfterFreshStartTest.txt
    Reproduce with: gradlew :solr:core:test --tests "org.apache.solr.cloud.LeaderFailureAfterFreshStartTest.test" -Ptests.jvms=96 "-Ptests.jvmargs=-XX:TieredStopAtLevel=1 -XX:+UseParallelGC -XX:ActiveProcessorCount=1 -XX:ReservedCodeCacheSize=120m" -Ptests.seed=AF8D7EB09B621873 -Ptests.file.encoding=US-ASCII

  - org.apache.solr.cloud.TestDynamicFieldNamesIndexCorrectly.test (:solr:core)
    Test output: /tmp/src/solr/solr/core/build/test-results/test/outputs/OUTPUT-org.apache.solr.cloud.TestDynamicFieldNamesIndexCorrectly.txt
    Reproduce with: gradlew :solr:core:test --tests "org.apache.solr.cloud.TestDynamicFieldNamesIndexCorrectly.test" -Ptests.jvms=96 "-Ptests.jvmargs=-XX:TieredStopAtLevel=1 -XX:+UseParallelGC -XX:ActiveProcessorCount=1 -XX:ReservedCodeCacheSize=120m" -Ptests.seed=AF8D7EB09B621873 -Ptests.file.encoding=US-ASCII

  - org.apache.solr.cloud.api.collections.TestCollectionAPI.testConfigCaching (:solr:core)
    Test output: /tmp/src/solr/solr/core/build/test-results/test/outputs/OUTPUT-org.apache.solr.cloud.api.collections.TestCollectionAPI.txt
    Reproduce with: gradlew :solr:core:test --tests "org.apache.solr.cloud.api.collections.TestCollectionAPI.testConfigCaching" -Ptests.jvms=96 "-Ptests.jvmargs=-XX:TieredStopAtLevel=1 -XX:+UseParallelGC -XX:ActiveProcessorCount=1 -XX:ReservedCodeCacheSize=120m" -Ptests.seed=AF8D7EB09B621873 -Ptests.file.encoding=US-ASCII

  - org.apache.solr.cloud.api.collections.TestReplicaProperties.test (:solr:core)
    Test output: /tmp/src/solr/solr/core/build/test-results/test/outputs/OUTPUT-org.apache.solr.cloud.api.collections.TestReplicaProperties.txt
    Reproduce with: gradlew :solr:core:test --tests "org.apache.solr.cloud.api.collections.TestReplicaProperties.test" -Ptests.jvms=96 "-Ptests.jvmargs=-XX:TieredStopAtLevel=1 -XX:+UseParallelGC -XX:ActiveProcessorCount=1 -XX:ReservedCodeCacheSize=120m" -Ptests.seed=AF8D7EB09B621873 -Ptests.file.encoding=US-ASCII

  - org.apache.solr.cloud.ShardRoutingTest.test (:solr:core)
    Test output: /tmp/src/solr/solr/core/build/test-results/test/outputs/OUTPUT-org.apache.solr.cloud.ShardRoutingTest.txt
    Reproduce with: gradlew :solr:core:test --tests "org.apache.solr.cloud.ShardRoutingTest.test" -Ptests.jvms=96 "-Ptests.jvmargs=-XX:TieredStopAtLevel=1 -XX:+UseParallelGC -XX:ActiveProcessorCount=1 -XX:ReservedCodeCacheSize=120m" -Ptests.seed=AF8D7EB09B621873 -Ptests.file.encoding=US-ASCII

  - org.apache.solr.cloud.TestOnReconnectListenerSupport.test (:solr:core)
    Test output: /tmp/src/solr/solr/core/build/test-results/test/outputs/OUTPUT-org.apache.solr.cloud.TestOnReconnectListenerSupport.txt
    Reproduce with: gradlew :solr:core:test --tests "org.apache.solr.cloud.TestOnReconnectListenerSupport.test" -Ptests.jvms=96 "-Ptests.jvmargs=-XX:TieredStopAtLevel=1 -XX:+UseParallelGC -XX:ActiveProcessorCount=1 -XX:ReservedCodeCacheSize=120m" -Ptests.seed=AF8D7EB09B621873 -Ptests.file.encoding=US-ASCII

  - org.apache.solr.cloud.MultiThreadedOCPTest.testDeduplicationOfSubmittedTasks (:solr:core)
    Test output: /tmp/src/solr/solr/core/build/test-results/test/outputs/OUTPUT-org.apache.solr.cloud.MultiThreadedOCPTest.txt
    Reproduce with: gradlew :solr:core:test --tests "org.apache.solr.cloud.MultiThreadedOCPTest.testDeduplicationOfSubmittedTasks" -Ptests.jvms=96 "-Ptests.jvmargs=-XX:TieredStopAtLevel=1 -XX:+UseParallelGC -XX:ActiveProcessorCount=1 -XX:ReservedCodeCacheSize=120m" -Ptests.seed=AF8D7EB09B621873 -Ptests.file.encoding=US-ASCII

  - org.apache.solr.cloud.TestRandomRequestDistribution.test (:solr:core)
    Test output: /tmp/src/solr/solr/core/build/test-results/test/outputs/OUTPUT-org.apache.solr.cloud.TestRandomRequestDistribution.txt
    Reproduce with: gradlew :solr:core:test --tests "org.apache.solr.cloud.TestRandomRequestDistribution.test" -Ptests.jvms=96 "-Ptests.jvmargs=-XX:TieredStopAtLevel=1 -XX:+UseParallelGC -XX:ActiveProcessorCount=1 -XX:ReservedCodeCacheSize=120m" -Ptests.seed=AF8D7EB09B621873 -Ptests.file.encoding=US-ASCII

  - org.apache.solr.core.TestCustomStream.testDynamicLoadingCustomStream (:solr:core)
    Test output: /tmp/src/solr/solr/core/build/test-results/test/outputs/OUTPUT-org.apache.solr.core.TestCustomStream.txt
    Reproduce with: gradlew :solr:core:test --tests "org.apache.solr.core.TestCustomStream.testDynamicLoadingCustomStream" -Ptests.jvms=96 "-Ptests.jvmargs=-XX:TieredStopAtLevel=1 -XX:+UseParallelGC -XX:ActiveProcessorCount=1 -XX:ReservedCodeCacheSize=120m" -Ptests.seed=AF8D7EB09B621873 -Ptests.file.encoding=US-ASCII

  - org.apache.solr.cloud.api.collections.SimpleCollectionCreateDeleteTest.testCreateAndDeleteThenCreateAgain (:solr:core)
    Test output: /tmp/src/solr/solr/core/build/test-results/test/outputs/OUTPUT-org.apache.solr.cloud.api.collections.SimpleCollectionCreateDeleteTest.txt
    Reproduce with: gradlew :solr:core:test --tests "org.apache.solr.cloud.api.collections.SimpleCollectionCreateDeleteTest.testCreateAndDeleteThenCreateAgain" -Ptests.jvms=96 "-Ptests.jvmargs=-XX:TieredStopAtLevel=1 -XX:+UseParallelGC -XX:ActiveProcessorCount=1 -XX:ReservedCodeCacheSize=120m" -Ptests.seed=AF8D7EB09B621873 -Ptests.file.encoding=US-ASCII

  - org.apache.solr.cloud.api.collections.TestRequestStatusCollectionAPI.test (:solr:core)
    Test output: /tmp/src/solr/solr/core/build/test-results/test/outputs/OUTPUT-org.apache.solr.cloud.api.collections.TestRequestStatusCollectionAPI.txt
    Reproduce with: gradlew :solr:core:test --tests "org.apache.solr.cloud.api.collections.TestRequestStatusCollectionAPI.test" -Ptests.jvms=96 "-Ptests.jvmargs=-XX:TieredStopAtLevel=1 -XX:+UseParallelGC -XX:ActiveProcessorCount=1 -XX:ReservedCodeCacheSize=120m" -Ptests.seed=AF8D7EB09B621873 -Ptests.file.encoding=US-ASCII

  - org.apache.solr.cloud.api.collections.TestCollectionAPI.testRecreateCollectionAfterFailure (:solr:core)
    Test output: /tmp/src/solr/solr/core/build/test-results/test/outputs/OUTPUT-org.apache.solr.cloud.api.collections.TestCollectionAPI.txt
    Reproduce with: gradlew :solr:core:test --tests "org.apache.solr.cloud.api.collections.TestCollectionAPI.testRecreateCollectionAfterFailure" -Ptests.jvms=96 "-Ptests.jvmargs=-XX:TieredStopAtLevel=1 -XX:+UseParallelGC -XX:ActiveProcessorCount=1 -XX:ReservedCodeCacheSize=120m" -Ptests.seed=AF8D7EB09B621873 -Ptests.file.encoding=US-ASCII

  - org.apache.solr.cloud.MultiThreadedOCPTest.testTaskExclusivity (:solr:core)
    Test output: /tmp/src/solr/solr/core/build/test-results/test/outputs/OUTPUT-org.apache.solr.cloud.MultiThreadedOCPTest.txt
    Reproduce with: gradlew :solr:core:test --tests "org.apache.solr.cloud.MultiThreadedOCPTest.testTaskExclusivity" -Ptests.jvms=96 "-Ptests.jvmargs=-XX:TieredStopAtLevel=1 -XX:+UseParallelGC -XX:ActiveProcessorCount=1 -XX:ReservedCodeCacheSize=120m" -Ptests.seed=AF8D7EB09B621873 -Ptests.file.encoding=US-ASCII

  - org.apache.solr.cloud.api.collections.SimpleCollectionCreateDeleteTest.testDeleteAlsoDeletesAutocreatedConfigSet (:solr:core)
    Test output: /tmp/src/solr/solr/core/build/test-results/test/outputs/OUTPUT-org.apache.solr.cloud.api.collections.SimpleCollectionCreateDeleteTest.txt
    Reproduce with: gradlew :solr:core:test --tests "org.apache.solr.cloud.api.collections.SimpleCollectionCreateDeleteTest.testDeleteAlsoDeletesAutocreatedConfigSet" -Ptests.jvms=96 "-Ptests.jvmargs=-XX:TieredStopAtLevel=1 -XX:+UseParallelGC -XX:ActiveProcessorCount=1 -XX:ReservedCodeCacheSize=120m" -Ptests.seed=AF8D7EB09B621873 -Ptests.file.encoding=US-ASCII

  - org.apache.solr.handler.TestSystemCollAutoCreate.testAutoCreate (:solr:core)
    Test output: /tmp/src/solr/solr/core/build/test-results/test/outputs/OUTPUT-org.apache.solr.handler.TestSystemCollAutoCreate.txt
    Reproduce with: gradlew :solr:core:test --tests "org.apache.solr.handler.TestSystemCollAutoCreate.testAutoCreate" -Ptests.jvms=96 "-Ptests.jvmargs=-XX:TieredStopAtLevel=1 -XX:+UseParallelGC -XX:ActiveProcessorCount=1 -XX:ReservedCodeCacheSize=120m" -Ptests.seed=AF8D7EB09B621873 -Ptests.file.encoding=US-ASCII

  - org.apache.solr.cloud.MultiThreadedOCPTest.testFillWorkQueue (:solr:core)
    Test output: /tmp/src/solr/solr/core/build/test-results/test/outputs/OUTPUT-org.apache.solr.cloud.MultiThreadedOCPTest.txt
    Reproduce with: gradlew :solr:core:test --tests "org.apache.solr.cloud.MultiThreadedOCPTest.testFillWorkQueue" -Ptests.jvms=96 "-Ptests.jvmargs=-XX:TieredStopAtLevel=1 -XX:+UseParallelGC -XX:ActiveProcessorCount=1 -XX:ReservedCodeCacheSize=120m" -Ptests.seed=AF8D7EB09B621873 -Ptests.file.encoding=US-ASCII

  - org.apache.solr.cloud.api.collections.SimpleCollectionCreateDeleteTest.testPropertiesOfReplica (:solr:core)
    Test output: /tmp/src/solr/solr/core/build/test-results/test/outputs/OUTPUT-org.apache.solr.cloud.api.collections.SimpleCollectionCreateDeleteTest.txt
    Reproduce with: gradlew :solr:core:test --tests "org.apache.solr.cloud.api.collections.SimpleCollectionCreateDeleteTest.testPropertiesOfReplica" -Ptests.jvms=96 "-Ptests.jvmargs=-XX:TieredStopAtLevel=1 -XX:+UseParallelGC -XX:ActiveProcessorCount=1 -XX:ReservedCodeCacheSize=120m" -Ptests.seed=AF8D7EB09B621873 -Ptests.file.encoding=US-ASCII

  - org.apache.solr.cloud.TestCloudPivotFacet.test (:solr:core)
    Test output: /tmp/src/solr/solr/core/build/test-results/test/outputs/OUTPUT-org.apache.solr.cloud.TestCloudPivotFacet.txt
    Reproduce with: gradlew :solr:core:test --tests "org.apache.solr.cloud.TestCloudPivotFacet.test" -Ptests.jvms=96 "-Ptests.jvmargs=-XX:TieredStopAtLevel=1 -XX:+UseParallelGC -XX:ActiveProcessorCount=1 -XX:ReservedCodeCacheSize=120m" -Ptests.seed=AF8D7EB09B621873 -Ptests.file.encoding=US-ASCII

  - org.apache.solr.cloud.MultiThreadedOCPTest.testLongAndShortRunningParallelApiCalls (:solr:core)
    Test output: /tmp/src/solr/solr/core/build/test-results/test/outputs/OUTPUT-org.apache.solr.cloud.MultiThreadedOCPTest.txt
    Reproduce with: gradlew :solr:core:test --tests "org.apache.solr.cloud.MultiThreadedOCPTest.testLongAndShortRunningParallelApiCalls" -Ptests.jvms=96 "-Ptests.jvmargs=-XX:TieredStopAtLevel=1 -XX:+UseParallelGC -XX:ActiveProcessorCount=1 -XX:ReservedCodeCacheSize=120m" -Ptests.seed=AF8D7EB09B621873 -Ptests.file.encoding=US-ASCII

  - org.apache.solr.cloud.TestStressInPlaceUpdates.stressTest (:solr:core)
    Test output: /tmp/src/solr/solr/core/build/test-results/test/outputs/OUTPUT-org.apache.solr.cloud.TestStressInPlaceUpdates.txt
    Reproduce with: gradlew :solr:core:test --tests "org.apache.solr.cloud.TestStressInPlaceUpdates.stressTest" -Ptests.jvms=96 "-Ptests.jvmargs=-XX:TieredStopAtLevel=1 -XX:+UseParallelGC -XX:ActiveProcessorCount=1 -XX:ReservedCodeCacheSize=120m" -Ptests.seed=AF8D7EB09B621873 -Ptests.file.encoding=US-ASCII

  - org.apache.solr.handler.TestSolrConfigHandlerCloud.test (:solr:core)
    Test output: /tmp/src/solr/solr/core/build/test-results/test/outputs/OUTPUT-org.apache.solr.handler.TestSolrConfigHandlerCloud.txt
    Reproduce with: gradlew :solr:core:test --tests "org.apache.solr.handler.TestSolrConfigHandlerCloud.test" -Ptests.jvms=96 "-Ptests.jvmargs=-XX:TieredStopAtLevel=1 -XX:+UseParallelGC -XX:ActiveProcessorCount=1 -XX:ReservedCodeCacheSize=120m" -Ptests.seed=AF8D7EB09B621873 -Ptests.file.encoding=US-ASCII

  - org.apache.solr.update.TestInPlaceUpdatesDistrib.test (:solr:core)
    Test output: /tmp/src/solr/solr/core/build/test-results/test/outputs/OUTPUT-org.apache.solr.update.TestInPlaceUpdatesDistrib.txt
    Reproduce with: gradlew :solr:core:test --tests "org.apache.solr.update.TestInPlaceUpdatesDistrib.test" -Ptests.jvms=96 "-Ptests.jvmargs=-XX:TieredStopAtLevel=1 -XX:+UseParallelGC -XX:ActiveProcessorCount=1 -XX:ReservedCodeCacheSize=120m" -Ptests.seed=AF8D7EB09B621873 -Ptests.file.encoding=US-ASCII

  - org.apache.solr.handler.TestSolrConfigHandlerConcurrent.test (:solr:core)
    Test output: /tmp/src/solr/solr/core/build/test-results/test/outputs/OUTPUT-org.apache.solr.handler.TestSolrConfigHandlerConcurrent.txt
    Reproduce with: gradlew :solr:core:test --tests "org.apache.solr.handler.TestSolrConfigHandlerConcurrent.test" -Ptests.jvms=96 "-Ptests.jvmargs=-XX:TieredStopAtLevel=1 -XX:+UseParallelGC -XX:ActiveProcessorCount=1 -XX:ReservedCodeCacheSize=120m" -Ptests.seed=AF8D7EB09B621873 -Ptests.file.encoding=US-ASCII

  - org.apache.solr.schema.TestCloudManagedSchema.test (:solr:core)
    Test output: /tmp/src/solr/solr/core/build/test-results/test/outputs/OUTPUT-org.apache.solr.schema.TestCloudManagedSchema.txt
    Reproduce with: gradlew :solr:core:test --tests "org.apache.solr.schema.TestCloudManagedSchema.test" -Ptests.jvms=96 "-Ptests.jvmargs=-XX:TieredStopAtLevel=1 -XX:+UseParallelGC -XX:ActiveProcessorCount=1 -XX:ReservedCodeCacheSize=120m" -Ptests.seed=AF8D7EB09B621873 -Ptests.file.encoding=US-ASCII

  - org.apache.solr.handler.TestConfigReload.test (:solr:core)
    Test output: /tmp/src/solr/solr/core/build/test-results/test/outputs/OUTPUT-org.apache.solr.handler.TestConfigReload.txt
    Reproduce with: gradlew :solr:core:test --tests "org.apache.solr.handler.TestConfigReload.test" -Ptests.jvms=96 "-Ptests.jvmargs=-XX:TieredStopAtLevel=1 -XX:+UseParallelGC -XX:ActiveProcessorCount=1 -XX:ReservedCodeCacheSize=120m" -Ptests.seed=AF8D7EB09B621873 -Ptests.file.encoding=US-ASCII

  - org.apache.solr.security.TestAuthorizationFramework.authorizationFrameworkTest (:solr:core)
    Test output: /tmp/src/solr/solr/core/build/test-results/test/outputs/OUTPUT-org.apache.solr.security.TestAuthorizationFramework.txt
    Reproduce with: gradlew :solr:core:test --tests "org.apache.solr.security.TestAuthorizationFramework.authorizationFrameworkTest" -Ptests.jvms=96 "-Ptests.jvmargs=-XX:TieredStopAtLevel=1 -XX:+UseParallelGC -XX:ActiveProcessorCount=1 -XX:ReservedCodeCacheSize=120m" -Ptests.seed=AF8D7EB09B621873 -Ptests.file.encoding=US-ASCII

  - org.apache.solr.handler.component.TestTrackingShardHandlerFactory.testRequestTracking (:solr:core)
    Test output: /tmp/src/solr/solr/core/build/test-results/test/outputs/OUTPUT-org.apache.solr.handler.component.TestTrackingShardHandlerFactory.txt
    Reproduce with: gradlew :solr:core:test --tests "org.apache.solr.handler.component.TestTrackingShardHandlerFactory.testRequestTracking" -Ptests.jvms=96 "-Ptests.jvmargs=-XX:TieredStopAtLevel=1 -XX:+UseParallelGC -XX:ActiveProcessorCount=1 -XX:ReservedCodeCacheSize=120m" -Ptests.seed=AF8D7EB09B621873 -Ptests.file.encoding=US-ASCII

  - org.apache.solr.schema.TestCloudSchemaless.test (:solr:core)
    Test output: /tmp/src/solr/solr/core/build/test-results/test/outputs/OUTPUT-org.apache.solr.schema.TestCloudSchemaless.txt
    Reproduce with: gradlew :solr:core:test --tests "org.apache.solr.schema.TestCloudSchemaless.test" -Ptests.jvms=96 "-Ptests.jvmargs=-XX:TieredStopAtLevel=1 -XX:+UseParallelGC -XX:ActiveProcessorCount=1 -XX:ReservedCodeCacheSize=120m" -Ptests.seed=AF8D7EB09B621873 -Ptests.file.encoding=US-ASCII

  - org.apache.solr.handler.TestBlobHandler.doBlobHandlerTest (:solr:core)
    Test output: /tmp/src/solr/solr/core/build/test-results/test/outputs/OUTPUT-org.apache.solr.handler.TestBlobHandler.txt
    Reproduce with: gradlew :solr:core:test --tests "org.apache.solr.handler.TestBlobHandler.doBlobHandlerTest" -Ptests.jvms=96 "-Ptests.jvmargs=-XX:TieredStopAtLevel=1 -XX:+UseParallelGC -XX:ActiveProcessorCount=1 -XX:ReservedCodeCacheSize=120m" -Ptests.seed=AF8D7EB09B621873 -Ptests.file.encoding=US-ASCII

  - org.apache.solr.schema.TestBulkSchemaConcurrent.test (:solr:core)
    Test output: /tmp/src/solr/solr/core/build/test-results/test/outputs/OUTPUT-org.apache.solr.schema.TestBulkSchemaConcurrent.txt
    Reproduce with: gradlew :solr:core:test --tests "org.apache.solr.schema.TestBulkSchemaConcurrent.test" -Ptests.jvms=96 "-Ptests.jvmargs=-XX:TieredStopAtLevel=1 -XX:+UseParallelGC -XX:ActiveProcessorCount=1 -XX:ReservedCodeCacheSize=120m" -Ptests.seed=AF8D7EB09B621873 -Ptests.file.encoding=US-ASCII

WARNING: there were unreferenced files under license folder:
  - /tmp/src/solr/solr/licenses/jakarta.inject-2.6.1.jar.sha1

FAILURE: Build completed with 2 failures.

1: Task failed with an exception.
-----------
* What went wrong:
Execution failed for task ':solr:modules:hdfs:test'.
> There were failing tests. See the results at: file:///tmp/src/solr/solr/modules/hdfs/build/test-results/test/

* Try:
> Run with --scan to get full insights.
==============================================================================

2: Task failed with an exception.
-----------
* What went wrong:
Execution failed for task ':solr:core:test'.
> There were failing tests. See the results at: file:///tmp/src/solr/solr/core/build/test-results/test/

* Try:
> Run with --scan to get full insights.
==============================================================================

BUILD FAILED in 7m 54s
670 actionable tasks: 668 executed, 2 up-to-date
[?12l[?25h
------------------------------------------------------------------------
Build Failed: returned 1

Total time: 8m14.5s
------------------------------------------------------------------------
+ status=1
+ ./crave pull '**/build/**/test/TEST-*.xml'
+ ./crave pull '**/*.events'
+ ./crave pull 'heapdumps/**'
Error: rsync: [sender] change_dir "/tmp/src/solr/heapdumps" failed: No such file or directory (2)
rsync error: some files/attrs were not transferred (see previous errors) (code 23) at main.c(1682) [Receiver=3.1.3]
rsync: [Receiver] write error: Broken pipe (32)

+ ./crave pull '**/hs_err_pid*'
+ exit 1
Build step 'Execute shell' marked build as failure
Archiving artifacts
Recording test results
ERROR: Step ‘Publish JUnit test result report’ failed: No test report files were found. Configuration error?
Email was triggered for: Failure - Any
Sending email for trigger: Failure - Any

[JENKINS] Solr » Solr-Check-9.x (Crave) - Build # 6236 - Still Failing!

Posted by Apache Jenkins Server <je...@builds.apache.org>.
Build: https://ci-builds.apache.org/job/Solr/job/Solr-Check-9.x%20(Crave)/6236/

No tests ran.

Build Log:
[...truncated 2293 lines...]
ERROR: The following test(s) have failed:
  - org.apache.solr.bench.DockMakerTest.testRealisticUnicode (:solr:benchmark)
    Test output: /tmp/src/solr/solr/benchmark/build/test-results/test/outputs/OUTPUT-org.apache.solr.bench.DockMakerTest.txt
    Reproduce with: gradlew :solr:benchmark:test --tests "org.apache.solr.bench.DockMakerTest.testRealisticUnicode" -Ptests.jvms=96 "-Ptests.jvmargs=-XX:TieredStopAtLevel=1 -XX:+UseParallelGC -XX:ActiveProcessorCount=1 -XX:ReservedCodeCacheSize=120m" -Ptests.seed=DC511CCABAB9BBF8 -Ptests.file.encoding=ISO-8859-1

WARNING: there were unreferenced files under license folder:
  - /tmp/src/solr/solr/licenses/jakarta.inject-2.6.1.jar.sha1

FAILURE: Build failed with an exception.

* What went wrong:
Execution failed for task ':solr:benchmark:test'.
> There were failing tests. See the results at: file:///tmp/src/solr/solr/benchmark/build/test-results/test/

* Try:
> Run with --scan to get full insights.

BUILD FAILED in 4m 34s
639 actionable tasks: 637 executed, 2 up-to-date
[?12l[?25h
------------------------------------------------------------------------
Build Failed: returned 1

Total time: 4m59.5s
------------------------------------------------------------------------
+ status=1
+ ./crave pull '**/build/**/test/TEST-*.xml'
+ ./crave pull '**/*.events'
+ ./crave pull 'heapdumps/**'
Error: rsync: [sender] change_dir "/tmp/src/solr/heapdumps" failed: No such file or directory (2)
rsync error: some files/attrs were not transferred (see previous errors) (code 23) at main.c(1675) [Receiver=3.1.2]
rsync: [Receiver] write error: Broken pipe (32)

+ ./crave pull '**/hs_err_pid*'
+ exit 1
Build step 'Execute shell' marked build as failure
Archiving artifacts
Recording test results
ERROR: Step ‘Publish JUnit test result report’ failed: No test report files were found. Configuration error?
Email was triggered for: Failure - Any
Sending email for trigger: Failure - Any