You are viewing a plain text version of this content. The canonical link for it is here.
Posted to dev@jmeter.apache.org by Apache Jenkins Server <je...@builds.apache.org> on 2019/05/25 16:24:53 UTC
Build failed in Jenkins: JMeter Windows #1370
See <https://builds.apache.org/job/JMeter%20Windows/1370/display/redirect?page=changes>
Changes:
[fschumacher] Use correct expectations for the changed Bug52310 tests
[fschumacher] Try to enable check for Bug52310 on travis
[fschumacher] Use a different way to calculate a working IP address for Bug52310
Many modern linux systems are configured to localhost for the first network adapter.
This will break the test plan for Bug52310. Now we are trying to get the first
IPv4 address that is not a loopback address.
Use groovy instead of beanshell to do the calculation.
Remove HC3.1 reference, as JMeter doesn't support this anymore. Use Java client instead,
even if it was not the one that had the bug in the first place.
[fschumacher] Fix NPE on saving proxy auth state
Relates to #397
Bugzilla Id: 62672
[fschumacher] Requant new png images
[fschumacher] Update link to renamed sampler.
Closes #461
[fschumacher] Make boxing/unboxing explicit and silence a few warnings
[fschumacher] Line too long
Make checkstyle -- and me -- happy.
Relates to #397
Bugzilla Id: 62672
[pmouawad] Bug 62672 - HTTP Request send double requests when configure proxy with authentication
This closes #397
Bugzilla Id: 62672
------------------------------------------
[...truncated 157.46 KB...]
[java] org.apache.jmeter.protocol.http.sampler.HTTPSamplerBase#resultProcessing at line:1693
[java] org.apache.jmeter.protocol.http.sampler.HTTPAbstractImpl#resultProcessing at line:556
[java] org.apache.jmeter.protocol.http.sampler.HTTPHC4Impl#sample at line:671
[java] org.apache.jmeter.protocol.http.sampler.HTTPSamplerProxy#sample at line:67
[java] org.apache.jmeter.protocol.http.sampler.HTTPSamplerBase#sample at line:1231
[java] org.apache.jmeter.protocol.http.sampler.SamplingNamingTest#doSample at line:87
[java] org.apache.jmeter.protocol.http.sampler.SamplingNamingTest#testBug63364 at line:54
[java] sun.reflect.NativeMethodAccessorImpl#invoke0
[java] sun.reflect.NativeMethodAccessorImpl#invoke at line:62
[java] sun.reflect.DelegatingMethodAccessorImpl#invoke at line:43
[java] java.lang.reflect.Method#invoke at line:498
[java] org.junit.runners.model.FrameworkMethod$1#runReflectiveCall at line:50
[java] org.junit.internal.runners.model.ReflectiveCallable#run at line:12
[java] org.junit.runners.model.FrameworkMethod#invokeExplosively at line:47
[java] org.junit.internal.runners.statements.InvokeMethod#evaluate at line:17
[java] org.junit.runners.ParentRunner#runLeaf at line:325
[java] org.junit.runners.BlockJUnit4ClassRunner#runChild at line:78
[java] org.junit.runners.BlockJUnit4ClassRunner#runChild at line:57
[java] org.junit.runners.ParentRunner$3#run at line:290
[java] org.junit.runners.ParentRunner$1#schedule at line:71
[java] org.junit.runners.ParentRunner#runChildren at line:288
[java] org.junit.runners.ParentRunner#access$000 at line:58
[java] org.junit.runners.ParentRunner$2#evaluate at line:268
[java] org.junit.runners.ParentRunner#run at line:363
[java] org.junit.runners.Suite#runChild at line:128
[java] org.junit.runners.Suite#runChild at line:27
[java] org.junit.runners.ParentRunner$3#run at line:290
[java] org.junit.runners.ParentRunner$1#schedule at line:71
[java] org.junit.runners.ParentRunner#runChildren at line:288
[java] org.junit.runners.ParentRunner#access$000 at line:58
[java] org.junit.runners.ParentRunner$2#evaluate at line:268
[java] org.junit.runners.ParentRunner#run at line:363
[java] org.junit.runners.Suite#runChild at line:128
[java] org.junit.runners.Suite#runChild at line:27
[java] org.junit.runners.ParentRunner$3#run at line:290
[java] org.junit.runners.ParentRunner$1#schedule at line:71
[java] org.junit.runners.ParentRunner#runChildren at line:288
[java] org.junit.runners.ParentRunner#access$000 at line:58
[java] org.junit.runners.ParentRunner$2#evaluate at line:268
[java] org.junit.runners.ParentRunner#run at line:363
[java] org.junit.runner.JUnitCore#run at line:137
[java] org.junit.runner.JUnitCore#run at line:115
[java] org.apache.jorphan.test.AllTests#main at line:220
[java]
[java] Thread[AWT-Shutdown,5,system], stackTrace:java.lang.Object#wait
[java] sun.awt.AWTAutoShutdown#run at line:314
[java] java.lang.Thread#run at line:748
[java]
[java] .........................
[java] Time: 8.95
[java]
[java] OK (89 tests)
[java]
batchtest:
[echo] Starting BatchTestLocal with file BatchTestLocal.jmx using -X -Jdummy=dummy
[jmeter] SLF4J: Class path contains multiple SLF4J bindings.
[jmeter] SLF4J: Found binding in [jar:file:/F:/jenkins/jenkins-slave/workspace/JMeter%20Windows/trunk/lib/log4j-slf4j-impl-2.11.1.jar!/org/slf4j/impl/StaticLoggerBinder.class]
[jmeter] SLF4J: Found binding in [jar:file:/F:/jenkins/jenkins-slave/workspace/JMeter%20Windows/trunk/lib/opt/activemq-all-5.15.8.jar!/org/slf4j/impl/StaticLoggerBinder.class]
[jmeter] SLF4J: See http://www.slf4j.org/codes.html#multiple_bindings for an explanation.
[jmeter] SLF4J: Actual binding is of type [org.apache.logging.slf4j.Log4jLoggerFactory]
[jmeter] Creating summariser <summary>
[jmeter] Created the tree successfully using testfiles/BatchTestLocal.jmx
[jmeter] Starting the test @ Sat May 25 16:22:00 UTC 2019 (1558801320360)
[jmeter] Waiting for possible Shutdown/StopTestNow/HeapDump/ThreadDump message on port 4445
[jmeter] summary + 1 in 00:00:00 = 3.5/s Avg: 208 Min: 208 Max: 208 Err: 0 (0.00%) Active: 1 Started: 1 Finished: 0
[jmeter] summary + 132 in 00:00:51 = 2.6/s Avg: 126 Min: 0 Max: 256 Err: 16 (12.12%) Active: 0 Started: 1 Finished: 1
[jmeter] summary = 133 in 00:00:52 = 2.6/s Avg: 127 Min: 0 Max: 256 Err: 16 (12.03%)
[jmeter] Tidying up ... @ Sat May 25 16:22:52 UTC 2019 (1558801372958)
[jmeter] ... end of run
[echo] BatchTestLocal output files compared OK
batchtestserver:
[server] SLF4J: Class path contains multiple SLF4J bindings.
[server] SLF4J: Found binding in [jar:file:/F:/jenkins/jenkins-slave/workspace/JMeter%20Windows/trunk/lib/log4j-slf4j-impl-2.11.1.jar!/org/slf4j/impl/StaticLoggerBinder.class]
[server] SLF4J: Found binding in [jar:file:/F:/jenkins/jenkins-slave/workspace/JMeter%20Windows/trunk/lib/opt/activemq-all-5.15.8.jar!/org/slf4j/impl/StaticLoggerBinder.class]
[server] SLF4J: See http://www.slf4j.org/codes.html#multiple_bindings for an explanation.
[server] SLF4J: Actual binding is of type [org.apache.logging.slf4j.Log4jLoggerFactory]
batchtest:
[echo] Starting BatchTestLocal with file BatchTestLocal.jmx using -Rjenkins-win2012-1:2371 -Jdummy=dummy
[client] SLF4J: Class path contains multiple SLF4J bindings.
[client] SLF4J: Found binding in [jar:file:/F:/jenkins/jenkins-slave/workspace/JMeter%20Windows/trunk/lib/log4j-slf4j-impl-2.11.1.jar!/org/slf4j/impl/StaticLoggerBinder.class]
[client] SLF4J: Found binding in [jar:file:/F:/jenkins/jenkins-slave/workspace/JMeter%20Windows/trunk/lib/opt/activemq-all-5.15.8.jar!/org/slf4j/impl/StaticLoggerBinder.class]
[client] SLF4J: See http://www.slf4j.org/codes.html#multiple_bindings for an explanation.
[client] SLF4J: Actual binding is of type [org.apache.logging.slf4j.Log4jLoggerFactory]
[server] Created remote object: UnicastServerRef2 [liveRef: [endpoint:[10.20.2.147:60310,SSLRMIServerSocketFactory(host=jenkins-win2012-1/10.20.2.147, keyStoreLocation=rmi_keystore.jks, type=JKS, trustStoreLocation=rmi_keystore.jks, type=JKS, alias=rmi),SSLRMIClientSocketFactory(keyStoreLocation=rmi_keystore.jks, type=JKS, trustStoreLocation=rmi_keystore.jks, type=JKS, alias=rmi)](local),objID:[-2a454ad6:16aefcd628e:-7fff, 2243137196150555813]]]
[client] Creating summariser <summary>
[client] Created the tree successfully using testfiles/BatchTestLocal.jmx
[client] Configuring remote engine: jenkins-win2012-1:2371
[client] Starting remote engines
[client] Starting the test @ Sat May 25 16:23:01 UTC 2019 (1558801381349)
[server] Starting the test on host jenkins-win2012-1:2371 @ Sat May 25 16:23:05 UTC 2019 (1558801385482)
[client] Remote engines have been started
[client] Waiting for possible Shutdown/StopTestNow/HeapDump/ThreadDump message on port 4445
[server] Finished the test on host jenkins-win2012-1:2371 @ Sat May 25 16:23:58 UTC 2019 (1558801438536) - exit requested.
[client] summary = 133 in 00:00:52 = 2.6/s Avg: 126 Min: 1 Max: 253 Err: 16 (12.03%)
[client] Tidying up remote @ Sat May 25 16:23:58 UTC 2019 (1558801438536)
[client] ... end of run
[echo] BatchTestLocal output files compared OK
batch_scripts:
batchtest:
[echo] Starting BUG_62847 with file BUG_62847.jmx using -X -Jdummy=dummy
[jmeter] SLF4J: Class path contains multiple SLF4J bindings.
[jmeter] SLF4J: Found binding in [jar:file:/F:/jenkins/jenkins-slave/workspace/JMeter%20Windows/trunk/lib/log4j-slf4j-impl-2.11.1.jar!/org/slf4j/impl/StaticLoggerBinder.class]
[jmeter] SLF4J: Found binding in [jar:file:/F:/jenkins/jenkins-slave/workspace/JMeter%20Windows/trunk/lib/opt/activemq-all-5.15.8.jar!/org/slf4j/impl/StaticLoggerBinder.class]
[jmeter] SLF4J: See http://www.slf4j.org/codes.html#multiple_bindings for an explanation.
[jmeter] SLF4J: Actual binding is of type [org.apache.logging.slf4j.Log4jLoggerFactory]
[jmeter] Creating summariser <summary>
[jmeter] Created the tree successfully using testfiles/BUG_62847.jmx
[jmeter] Starting the test @ Sat May 25 16:24:07 UTC 2019 (1558801447760)
[jmeter] Waiting for possible Shutdown/StopTestNow/HeapDump/ThreadDump message on port 4445
[jmeter] summary = 6 in 00:00:01 = 9.9/s Avg: 0 Min: 0 Max: 1 Err: 0 (0.00%)
[jmeter] Tidying up ... @ Sat May 25 16:24:08 UTC 2019 (1558801448690)
[jmeter] ... end of run
[echo] BUG_62847 output files compared OK
batchtest:
[echo] Starting TestResultStatusAction with file TestResultStatusAction.jmx using -X -Jdummy=dummy
[jmeter] SLF4J: Class path contains multiple SLF4J bindings.
[jmeter] SLF4J: Found binding in [jar:file:/F:/jenkins/jenkins-slave/workspace/JMeter%20Windows/trunk/lib/log4j-slf4j-impl-2.11.1.jar!/org/slf4j/impl/StaticLoggerBinder.class]
[jmeter] SLF4J: Found binding in [jar:file:/F:/jenkins/jenkins-slave/workspace/JMeter%20Windows/trunk/lib/opt/activemq-all-5.15.8.jar!/org/slf4j/impl/StaticLoggerBinder.class]
[jmeter] SLF4J: See http://www.slf4j.org/codes.html#multiple_bindings for an explanation.
[jmeter] SLF4J: Actual binding is of type [org.apache.logging.slf4j.Log4jLoggerFactory]
[jmeter] Creating summariser <summary>
[jmeter] Created the tree successfully using testfiles/TestResultStatusAction.jmx
[jmeter] Starting the test @ Sat May 25 16:24:12 UTC 2019 (1558801452309)
[jmeter] Waiting for possible Shutdown/StopTestNow/HeapDump/ThreadDump message on port 4445
[jmeter] summary = 135 in 00:00:01 = 120.5/s Avg: 0 Min: 0 Max: 86 Err: 18 (13.33%)
[jmeter] Tidying up ... @ Sat May 25 16:24:14 UTC 2019 (1558801454975)
[jmeter] ... end of run
[echo] TestResultStatusAction output files compared OK
batchtest:
[echo] Starting TestRedirectionPolicies with file TestRedirectionPolicies.jmx using -X -Jdummy=dummy
[jmeter] SLF4J: Class path contains multiple SLF4J bindings.
[jmeter] SLF4J: Found binding in [jar:file:/F:/jenkins/jenkins-slave/workspace/JMeter%20Windows/trunk/lib/log4j-slf4j-impl-2.11.1.jar!/org/slf4j/impl/StaticLoggerBinder.class]
[jmeter] SLF4J: Found binding in [jar:file:/F:/jenkins/jenkins-slave/workspace/JMeter%20Windows/trunk/lib/opt/activemq-all-5.15.8.jar!/org/slf4j/impl/StaticLoggerBinder.class]
[jmeter] SLF4J: See http://www.slf4j.org/codes.html#multiple_bindings for an explanation.
[jmeter] SLF4J: Actual binding is of type [org.apache.logging.slf4j.Log4jLoggerFactory]
[jmeter] Creating summariser <summary>
[jmeter] Created the tree successfully using testfiles/TestRedirectionPolicies.jmx
[jmeter] Starting the test @ Sat May 25 16:24:18 UTC 2019 (1558801458704)
[jmeter] Waiting for possible Shutdown/StopTestNow/HeapDump/ThreadDump message on port 4445
[jmeter] summary = 6 in 00:00:03 = 2.4/s Avg: 188 Min: 84 Max: 373 Err: 0 (0.00%)
[jmeter] Tidying up ... @ Sat May 25 16:24:22 UTC 2019 (1558801462783)
[jmeter] ... end of run
[echo] TestRedirectionPolicies output files compared OK
batchtest:
[echo] Starting HTMLParserTestFile_2 with file HTMLParserTestFile_2.jmx using -X -Jdummy=dummy
[jmeter] SLF4J: Class path contains multiple SLF4J bindings.
[jmeter] SLF4J: Found binding in [jar:file:/F:/jenkins/jenkins-slave/workspace/JMeter%20Windows/trunk/lib/log4j-slf4j-impl-2.11.1.jar!/org/slf4j/impl/StaticLoggerBinder.class]
[jmeter] SLF4J: Found binding in [jar:file:/F:/jenkins/jenkins-slave/workspace/JMeter%20Windows/trunk/lib/opt/activemq-all-5.15.8.jar!/org/slf4j/impl/StaticLoggerBinder.class]
[jmeter] SLF4J: See http://www.slf4j.org/codes.html#multiple_bindings for an explanation.
[jmeter] SLF4J: Actual binding is of type [org.apache.logging.slf4j.Log4jLoggerFactory]
[jmeter] Creating summariser <summary>
[jmeter] Created the tree successfully using testfiles/HTMLParserTestFile_2.jmx
[jmeter] Starting the test @ Sat May 25 16:24:26 UTC 2019 (1558801466290)
[jmeter] Waiting for possible Shutdown/StopTestNow/HeapDump/ThreadDump message on port 4445
[jmeter] summary = 1 in 00:00:00 = 3.1/s Avg: 200 Min: 200 Max: 200 Err: 0 (0.00%)
[jmeter] Tidying up ... @ Sat May 25 16:24:27 UTC 2019 (1558801467668)
[jmeter] ... end of run
[echo] HTMLParserTestFile_2 output files compared OK
batchtest:
[echo] Starting Bug52310 with file Bug52310.jmx using -X -Jdummy=dummy
[jmeter] SLF4J: Class path contains multiple SLF4J bindings.
[jmeter] SLF4J: Found binding in [jar:file:/F:/jenkins/jenkins-slave/workspace/JMeter%20Windows/trunk/lib/log4j-slf4j-impl-2.11.1.jar!/org/slf4j/impl/StaticLoggerBinder.class]
[jmeter] SLF4J: Found binding in [jar:file:/F:/jenkins/jenkins-slave/workspace/JMeter%20Windows/trunk/lib/opt/activemq-all-5.15.8.jar!/org/slf4j/impl/StaticLoggerBinder.class]
[jmeter] SLF4J: See http://www.slf4j.org/codes.html#multiple_bindings for an explanation.
[jmeter] SLF4J: Actual binding is of type [org.apache.logging.slf4j.Log4jLoggerFactory]
[jmeter] Creating summariser <summary>
[jmeter] Created the tree successfully using testfiles/Bug52310.jmx
[jmeter] Starting the test @ Sat May 25 16:24:31 UTC 2019 (1558801471069)
[jmeter] Waiting for possible Shutdown/StopTestNow/HeapDump/ThreadDump message on port 4445
[jmeter] summary + 1 in 00:00:01 = 0.9/s Avg: 948 Min: 948 Max: 948 Err: 0 (0.00%) Active: 1 Started: 1 Finished: 0
[jmeter] summary + 2 in 00:00:01 = 1.9/s Avg: 256 Min: 67 Max: 445 Err: 1 (50.00%) Active: 0 Started: 1 Finished: 1
[jmeter] summary = 3 in 00:00:02 = 1.3/s Avg: 486 Min: 67 Max: 948 Err: 1 (33.33%)
[jmeter] Tidying up ... @ Sat May 25 16:24:34 UTC 2019 (1558801474765)
[jmeter] ... end of run
Target 'batchtest' failed with message 'CSV Files are not identical.
<https://builds.apache.org/job/JMeter%20Windows/ws/trunk\bin\testfiles\Bug52310.csv>
ComputeIPAddr,200,OK,TG2 1-1,text,true
HTTP-Request-Java,200,OK,TG2 1-1,text,true
HTTP-Request-HC4,200,OK,TG2 1-1,text,true
<https://builds.apache.org/job/JMeter%20Windows/ws/trunk\bin\Bug52310.csv>
ComputeIPAddr,200,OK,TG2 1-1,text,true
HTTP-Request-Java,200,OK,TG2 1-1,text,true
HTTP-Request-HC4,Non HTTP response code: java.net.SocketException,Non HTTP response message: Network is unreachable: connect,TG2 1-1,text,false'.
Target 'batch_scripts' failed with message 'The following error occurred while executing this line:
<https://builds.apache.org/job/JMeter%20Windows/ws/trunk\build.xml>:2882: CSV Files are not identical.
<https://builds.apache.org/job/JMeter%20Windows/ws/trunk\bin\testfiles\Bug52310.csv>
ComputeIPAddr,200,OK,TG2 1-1,text,true
HTTP-Request-Java,200,OK,TG2 1-1,text,true
HTTP-Request-HC4,200,OK,TG2 1-1,text,true
<https://builds.apache.org/job/JMeter%20Windows/ws/trunk\bin\Bug52310.csv>
ComputeIPAddr,200,OK,TG2 1-1,text,true
HTTP-Request-Java,200,OK,TG2 1-1,text,true
HTTP-Request-HC4,Non HTTP response code: java.net.SocketException,Non HTTP response message: Network is unreachable: connect,TG2 1-1,text,false'.
Cannot execute '_allbatchtests' - 'batch_scripts' failed or was not executed.
Cannot execute 'test' - '_allbatchtests' failed or was not executed.
download_checkstyle:
_process_checkstyle_jars:
_check_exists:
_check_jarfile:
[echo] Checking checkstyle-8.8-all.jar
[echo] Deleting checkstyle-8.8-all.jar (excluding checkstyle-8.8-all.jar)
setproxy:
_get_jarfile:
setproxy:
_get_zipfile:
checkstyle:
_process_checkstyle_jars:
_check_exists:
_check_jarfile:
[checkstyle] Running Checkstyle 8.8 on 1770 files
BUILD FAILED
<https://builds.apache.org/job/JMeter%20Windows/ws/trunk\build.xml>:2957: The following error occurred while executing this line:
<https://builds.apache.org/job/JMeter%20Windows/ws/trunk\build.xml>:2882: CSV Files are not identical.
<https://builds.apache.org/job/JMeter%20Windows/ws/trunk\bin\testfiles\Bug52310.csv>
ComputeIPAddr,200,OK,TG2 1-1,text,true
HTTP-Request-Java,200,OK,TG2 1-1,text,true
HTTP-Request-HC4,200,OK,TG2 1-1,text,true
<https://builds.apache.org/job/JMeter%20Windows/ws/trunk\bin\Bug52310.csv>
ComputeIPAddr,200,OK,TG2 1-1,text,true
HTTP-Request-Java,200,OK,TG2 1-1,text,true
HTTP-Request-HC4,Non HTTP response code: java.net.SocketException,Non HTTP response message: Network is unreachable: connect,TG2 1-1,text,false
Total time: 5 minutes 27 seconds
Build step 'Invoke Ant' marked build as failure
Jenkins build is back to normal : JMeter Windows #1373
Posted by Apache Jenkins Server <je...@builds.apache.org>.
See <https://builds.apache.org/job/JMeter%20Windows/1373/display/redirect?page=changes>
Build failed in Jenkins: JMeter Windows #1372
Posted by Apache Jenkins Server <je...@builds.apache.org>.
See <https://builds.apache.org/job/JMeter%20Windows/1372/display/redirect?page=changes>
Changes:
[pmouawad] Bug 63464 - image/svg+xml is wrongly considered as binary
Fix broken test
Bugzilla Id: 63464
[pmouawad] Bug 62672 - HTTP Request send double requests when configure proxy with authentication
Make description more clear
Bugzilla Id: 62672
[pmouawad] Bug 62672 - HTTP Request send double requests when configure proxy with authentication
Fix NPE
Bugzilla Id: 62672
[pmouawad] Bug 63464 - image/svg+xml is wrongly considered as binary
Bugzilla Id: 63464
------------------------------------------
[...truncated 144.99 KB...]
[java] o.a.j.junit.JMeterTest Error creating org.apache.jmeter.gui.MainFrame java.awt.HeadlessException
[java] o.a.j.junit.JMeterTest Error creating org.apache.jmeter.gui.SavePropertyDialog java.awt.HeadlessException
[java] o.a.j.junit.JMeterTest Error creating org.apache.jmeter.gui.action.SearchTreeDialog java.awt.HeadlessException
[java] o.a.j.junit.JMeterTest Error creating org.apache.jmeter.gui.action.SelectTemplatesDialog java.awt.HeadlessException
[java] o.a.j.junit.JMeterTest Error creating org.apache.jmeter.gui.util.EscapeDialog java.awt.HeadlessException
[java] o.a.j.junit.JMeterTest Error creating org.apache.jmeter.gui.util.JSyntaxTextArea java.awt.HeadlessException
[java] o.a.j.junit.JMeterTest Error creating org.apache.jmeter.protocol.http.proxy.gui.RecorderDialog java.awt.HeadlessException
[java] o.a.j.junit.JMeterTest WARN: java.io.Serializable: NoSuchMethodException org.apache.jmeter.rmi.RMIServerSocketFactoryImpl, missing empty Constructor or Constructor with Object parameter
[java] o.a.j.junit.JMeterTest WARN: java.io.Serializable: NoSuchMethodException org.apache.jmeter.rmi.SSLRMIServerSocketFactory, missing empty Constructor or Constructor with Object parameter
[java] java.rmi.server.hostname=null
[java] jenkins-win2012-1/10.20.2.147
[java] isSiteLocalAddress:true
[java] isAnyLocalAddress:false
[java] isLinkLocalAddress:false
[java] isLoopbackAddress:false
[java] isMulticastAddress:false
[java] localhost/127.0.0.1
[java] isSiteLocalAddress:false
[java] isAnyLocalAddress:false
[java] isLinkLocalAddress:false
[java] isLoopbackAddress:true
[java] isMulticastAddress:false
[java] ====================
[java] jenkins-win2012-1/10.20.2.147
[java] isSiteLocalAddress:true
[java] isAnyLocalAddress:false
[java] isLinkLocalAddress:false
[java] isLoopbackAddress:false
[java] isMulticastAddress:false
[java] ====================
[java] jenkins-win2012-1/fe80:0:0:0:581f:7c50:9fc8:f309%14
[java] isSiteLocalAddress:false
[java] isAnyLocalAddress:false
[java] isLinkLocalAddress:true
[java] isLoopbackAddress:false
[java] isMulticastAddress:false
[java] ............................................................................................................................................................I...........................................................Throwing on Engine creation to simulate failure
[java] Throwing on Engine creation to simulate failure
[java] Interfaces: {name:lo (Software Loopback Interface 1) => [/127.0.0.1/8 [/127.255.255.255], /0:0:0:0:0:0:0:1/128 [null]], name:net0 (WAN Miniport (L2TP)) => [], name:net1 (WAN Miniport (SSTP)) => [], name:net2 (WAN Miniport (IKEv2)) => [], name:net3 (WAN Miniport (PPTP)) => [], name:ppp0 (WAN Miniport (PPPOE)) => [], name:eth0 (WAN Miniport (IP)) => [], name:eth1 (WAN Miniport (IPv6)) => [], name:eth2 (WAN Miniport (Network Monitor)) => [], name:eth3 (Microsoft Kernel Debug Network Adapter) => [], name:ppp1 (RAS Async Adapter) => [], name:net4 (Microsoft ISATAP Adapter) => [/fe80:0:0:0:0:5efe:a14:293%net4/128 [null]], name:eth4 (Microsoft Hyper-V Network Switch Default Miniport) => [], name:eth5 (Intel(R) PRO/1000 MT Network Connection) => [/10.20.2.147/24 [/10.20.2.255], /fe80:0:0:0:581f:7c50:9fc8:f309%eth5/64 [null]], name:eth6 (Intel(R) PRO/1000 MT Network Connection-WFP Native MAC Layer LightWeight Filter-0000) => [], name:eth7 (Intel(R) PRO/1000 MT Network Connection-QoS Packet Scheduler-0000) => [], name:eth8 (Intel(R) PRO/1000 MT Network Connection-WFP 802.3 MAC Layer LightWeight Filter-0000) => [], name:eth9 (WAN Miniport (IP)-WFP Native MAC Layer LightWeight Filter-0000) => [], name:eth10 (WAN Miniport (IP)-QoS Packet Scheduler-0000) => [], name:eth11 (WAN Miniport (IPv6)-WFP Native MAC Layer LightWeight Filter-0000) => [], name:eth12 (WAN Miniport (IPv6)-QoS Packet Scheduler-0000) => [], name:eth13 (WAN Miniport (Network Monitor)-WFP Native MAC Layer LightWeight Filter-0000) => [], name:eth14 (WAN Miniport (Network Monitor)-QoS Packet Scheduler-0000) => []}
[java] Choose 10.20.2.147 to talk to external services
[java] java.rmi.server.hostname=null
[java] .........................................................................................................................................................I.I....................................................................................................................................................................................................................................................................................................................II.........................................................................................................................................................................................................................................................................................................................................................................................................................................................................................................................................................................................................................................................................................................................................................................................................................................................................................................................................................................................................................................................................................................................................................................................................................................................................................................................................................................................................................................................................................................................................................................................................................................................................................................................................................................................................................................................................................................................................................................................................................................................................................................................................................................................................................................................................................................................................................................................................................................................................................................................................................................................................................................I..I.................................................................................................................
[java] Time: 65.465
[java]
[java] OK (3329 tests)
[java]
[java] .........................................................................................
[java] Time: 12.466
[java]
[java] OK (89 tests)
[java]
batchtest:
[echo] Starting BatchTestLocal with file BatchTestLocal.jmx using -X -Jdummy=dummy
[jmeter] SLF4J: Class path contains multiple SLF4J bindings.
[jmeter] SLF4J: Found binding in [jar:file:/F:/jenkins/jenkins-slave/workspace/JMeter%20Windows/trunk/lib/log4j-slf4j-impl-2.11.1.jar!/org/slf4j/impl/StaticLoggerBinder.class]
[jmeter] SLF4J: Found binding in [jar:file:/F:/jenkins/jenkins-slave/workspace/JMeter%20Windows/trunk/lib/opt/activemq-all-5.15.8.jar!/org/slf4j/impl/StaticLoggerBinder.class]
[jmeter] SLF4J: See http://www.slf4j.org/codes.html#multiple_bindings for an explanation.
[jmeter] SLF4J: Actual binding is of type [org.apache.logging.slf4j.Log4jLoggerFactory]
[jmeter] Creating summariser <summary>
[jmeter] Created the tree successfully using testfiles/BatchTestLocal.jmx
[jmeter] Starting the test @ Sun May 26 14:19:25 UTC 2019 (1558880365696)
[jmeter] Waiting for possible Shutdown/StopTestNow/HeapDump/ThreadDump message on port 4445
[jmeter] summary + 24 in 00:00:04 = 6.5/s Avg: 130 Min: 28 Max: 252 Err: 4 (16.67%) Active: 1 Started: 1 Finished: 0
[jmeter] summary + 109 in 00:00:46 = 2.4/s Avg: 120 Min: 1 Max: 252 Err: 12 (11.01%) Active: 0 Started: 1 Finished: 1
[jmeter] summary = 133 in 00:00:50 = 2.7/s Avg: 122 Min: 1 Max: 252 Err: 16 (12.03%)
[jmeter] Tidying up ... @ Sun May 26 14:20:16 UTC 2019 (1558880416300)
[jmeter] ... end of run
[echo] BatchTestLocal output files compared OK
batchtestserver:
[server] SLF4J: Class path contains multiple SLF4J bindings.
[server] SLF4J: Found binding in [jar:file:/F:/jenkins/jenkins-slave/workspace/JMeter%20Windows/trunk/lib/log4j-slf4j-impl-2.11.1.jar!/org/slf4j/impl/StaticLoggerBinder.class]
[server] SLF4J: Found binding in [jar:file:/F:/jenkins/jenkins-slave/workspace/JMeter%20Windows/trunk/lib/opt/activemq-all-5.15.8.jar!/org/slf4j/impl/StaticLoggerBinder.class]
[server] SLF4J: See http://www.slf4j.org/codes.html#multiple_bindings for an explanation.
[server] SLF4J: Actual binding is of type [org.apache.logging.slf4j.Log4jLoggerFactory]
batchtest:
[echo] Starting BatchTestLocal with file BatchTestLocal.jmx using -Rjenkins-win2012-1:2699 -Jdummy=dummy
[client] SLF4J: Class path contains multiple SLF4J bindings.
[client] SLF4J: Found binding in [jar:file:/F:/jenkins/jenkins-slave/workspace/JMeter%20Windows/trunk/lib/log4j-slf4j-impl-2.11.1.jar!/org/slf4j/impl/StaticLoggerBinder.class]
[client] SLF4J: Found binding in [jar:file:/F:/jenkins/jenkins-slave/workspace/JMeter%20Windows/trunk/lib/opt/activemq-all-5.15.8.jar!/org/slf4j/impl/StaticLoggerBinder.class]
[client] SLF4J: See http://www.slf4j.org/codes.html#multiple_bindings for an explanation.
[client] SLF4J: Actual binding is of type [org.apache.logging.slf4j.Log4jLoggerFactory]
[server] Created remote object: UnicastServerRef2 [liveRef: [endpoint:[10.20.2.147:58560,SSLRMIServerSocketFactory(host=jenkins-win2012-1/10.20.2.147, keyStoreLocation=rmi_keystore.jks, type=JKS, trustStoreLocation=rmi_keystore.jks, type=JKS, alias=rmi),SSLRMIClientSocketFactory(keyStoreLocation=rmi_keystore.jks, type=JKS, trustStoreLocation=rmi_keystore.jks, type=JKS, alias=rmi)](local),objID:[30085c98:16af4837d5c:-7fff, 2468313033827987931]]]
[client] Creating summariser <summary>
[client] Created the tree successfully using testfiles/BatchTestLocal.jmx
[client] Configuring remote engine: jenkins-win2012-1:2699
[client] Starting remote engines
[client] Starting the test @ Sun May 26 14:20:24 UTC 2019 (1558880424448)
[client] Remote engines have been started
[client] Waiting for possible Shutdown/StopTestNow/HeapDump/ThreadDump message on port 4445
[server] Starting the test on host jenkins-win2012-1:2699 @ Sun May 26 14:20:28 UTC 2019 (1558880428436)
[client] summary + 4 in 00:00:01 = 5.8/s Avg: 89 Min: 0 Max: 180 Err: 0 (0.00%) Active: 1 Started: 2 Finished: 1
[client] summary + 129 in 00:00:51 = 2.5/s Avg: 124 Min: 1 Max: 255 Err: 16 (12.40%) Active: 0 Started: 11 Finished: 11
[client] summary = 133 in 00:00:52 = 2.6/s Avg: 123 Min: 0 Max: 255 Err: 16 (12.03%)
[client] Tidying up remote @ Sun May 26 14:21:21 UTC 2019 (1558880481465)
[server] Finished the test on host jenkins-win2012-1:2699 @ Sun May 26 14:21:21 UTC 2019 (1558880481465) - exit requested.
[client] ... end of run
[echo] BatchTestLocal output files compared OK
batch_scripts:
batchtest:
[echo] Starting BUG_62847 with file BUG_62847.jmx using -X -Jdummy=dummy
[jmeter] SLF4J: Class path contains multiple SLF4J bindings.
[jmeter] SLF4J: Found binding in [jar:file:/F:/jenkins/jenkins-slave/workspace/JMeter%20Windows/trunk/lib/log4j-slf4j-impl-2.11.1.jar!/org/slf4j/impl/StaticLoggerBinder.class]
[jmeter] SLF4J: Found binding in [jar:file:/F:/jenkins/jenkins-slave/workspace/JMeter%20Windows/trunk/lib/opt/activemq-all-5.15.8.jar!/org/slf4j/impl/StaticLoggerBinder.class]
[jmeter] SLF4J: See http://www.slf4j.org/codes.html#multiple_bindings for an explanation.
[jmeter] SLF4J: Actual binding is of type [org.apache.logging.slf4j.Log4jLoggerFactory]
[jmeter] Creating summariser <summary>
[jmeter] Created the tree successfully using testfiles/BUG_62847.jmx
[jmeter] Starting the test @ Sun May 26 14:21:30 UTC 2019 (1558880490765)
[jmeter] Waiting for possible Shutdown/StopTestNow/HeapDump/ThreadDump message on port 4445
[jmeter] summary + 1 in 00:00:00 = 2.3/s Avg: 1 Min: 1 Max: 1 Err: 0 (0.00%) Active: 1 Started: 1 Finished: 0
[jmeter] summary + 5 in 00:00:00 = 30.1/s Avg: 0 Min: 0 Max: 3 Err: 0 (0.00%) Active: 0 Started: 3 Finished: 3
[jmeter] summary = 6 in 00:00:01 = 9.9/s Avg: 0 Min: 0 Max: 3 Err: 0 (0.00%)
[jmeter] Tidying up ... @ Sun May 26 14:21:31 UTC 2019 (1558880491703)
[jmeter] ... end of run
[echo] BUG_62847 output files compared OK
batchtest:
[echo] Starting TestResultStatusAction with file TestResultStatusAction.jmx using -X -Jdummy=dummy
[jmeter] SLF4J: Class path contains multiple SLF4J bindings.
[jmeter] SLF4J: Found binding in [jar:file:/F:/jenkins/jenkins-slave/workspace/JMeter%20Windows/trunk/lib/log4j-slf4j-impl-2.11.1.jar!/org/slf4j/impl/StaticLoggerBinder.class]
[jmeter] SLF4J: Found binding in [jar:file:/F:/jenkins/jenkins-slave/workspace/JMeter%20Windows/trunk/lib/opt/activemq-all-5.15.8.jar!/org/slf4j/impl/StaticLoggerBinder.class]
[jmeter] SLF4J: See http://www.slf4j.org/codes.html#multiple_bindings for an explanation.
[jmeter] SLF4J: Actual binding is of type [org.apache.logging.slf4j.Log4jLoggerFactory]
[jmeter] Creating summariser <summary>
[jmeter] Created the tree successfully using testfiles/TestResultStatusAction.jmx
[jmeter] Starting the test @ Sun May 26 14:21:35 UTC 2019 (1558880495203)
[jmeter] Waiting for possible Shutdown/StopTestNow/HeapDump/ThreadDump message on port 4445
[jmeter] summary = 135 in 00:00:01 = 122.1/s Avg: 0 Min: 0 Max: 83 Err: 18 (13.33%)
[jmeter] Tidying up ... @ Sun May 26 14:21:37 UTC 2019 (1558880497809)
[jmeter] ... end of run
[echo] TestResultStatusAction output files compared OK
batchtest:
[echo] Starting TestRedirectionPolicies with file TestRedirectionPolicies.jmx using -X -Jdummy=dummy
[jmeter] SLF4J: Class path contains multiple SLF4J bindings.
[jmeter] SLF4J: Found binding in [jar:file:/F:/jenkins/jenkins-slave/workspace/JMeter%20Windows/trunk/lib/log4j-slf4j-impl-2.11.1.jar!/org/slf4j/impl/StaticLoggerBinder.class]
[jmeter] SLF4J: Found binding in [jar:file:/F:/jenkins/jenkins-slave/workspace/JMeter%20Windows/trunk/lib/opt/activemq-all-5.15.8.jar!/org/slf4j/impl/StaticLoggerBinder.class]
[jmeter] SLF4J: See http://www.slf4j.org/codes.html#multiple_bindings for an explanation.
[jmeter] SLF4J: Actual binding is of type [org.apache.logging.slf4j.Log4jLoggerFactory]
[jmeter] Creating summariser <summary>
[jmeter] Created the tree successfully using testfiles/TestRedirectionPolicies.jmx
[jmeter] Starting the test @ Sun May 26 14:21:41 UTC 2019 (1558880501563)
[jmeter] Waiting for possible Shutdown/StopTestNow/HeapDump/ThreadDump message on port 4445
[jmeter] summary = 6 in 00:00:03 = 2.4/s Avg: 188 Min: 84 Max: 372 Err: 0 (0.00%)
[jmeter] Tidying up ... @ Sun May 26 14:21:45 UTC 2019 (1558880505549)
[jmeter] ... end of run
[echo] TestRedirectionPolicies output files compared OK
batchtest:
[echo] Starting HTMLParserTestFile_2 with file HTMLParserTestFile_2.jmx using -X -Jdummy=dummy
[jmeter] SLF4J: Class path contains multiple SLF4J bindings.
[jmeter] SLF4J: Found binding in [jar:file:/F:/jenkins/jenkins-slave/workspace/JMeter%20Windows/trunk/lib/log4j-slf4j-impl-2.11.1.jar!/org/slf4j/impl/StaticLoggerBinder.class]
[jmeter] SLF4J: Found binding in [jar:file:/F:/jenkins/jenkins-slave/workspace/JMeter%20Windows/trunk/lib/opt/activemq-all-5.15.8.jar!/org/slf4j/impl/StaticLoggerBinder.class]
[jmeter] SLF4J: See http://www.slf4j.org/codes.html#multiple_bindings for an explanation.
[jmeter] SLF4J: Actual binding is of type [org.apache.logging.slf4j.Log4jLoggerFactory]
[jmeter] Creating summariser <summary>
[jmeter] Created the tree successfully using testfiles/HTMLParserTestFile_2.jmx
[jmeter] Starting the test @ Sun May 26 14:21:49 UTC 2019 (1558880509121)
[jmeter] Waiting for possible Shutdown/StopTestNow/HeapDump/ThreadDump message on port 4445
[jmeter] summary = 1 in 00:00:00 = 3.0/s Avg: 211 Min: 211 Max: 211 Err: 0 (0.00%)
[jmeter] Tidying up ... @ Sun May 26 14:21:50 UTC 2019 (1558880510524)
[jmeter] ... end of run
[echo] HTMLParserTestFile_2 output files compared OK
batchtest:
[echo] Starting Bug52310 with file Bug52310.jmx using -X -Jdummy=dummy
[jmeter] SLF4J: Class path contains multiple SLF4J bindings.
[jmeter] SLF4J: Found binding in [jar:file:/F:/jenkins/jenkins-slave/workspace/JMeter%20Windows/trunk/lib/log4j-slf4j-impl-2.11.1.jar!/org/slf4j/impl/StaticLoggerBinder.class]
[jmeter] SLF4J: Found binding in [jar:file:/F:/jenkins/jenkins-slave/workspace/JMeter%20Windows/trunk/lib/opt/activemq-all-5.15.8.jar!/org/slf4j/impl/StaticLoggerBinder.class]
[jmeter] SLF4J: See http://www.slf4j.org/codes.html#multiple_bindings for an explanation.
[jmeter] SLF4J: Actual binding is of type [org.apache.logging.slf4j.Log4jLoggerFactory]
[jmeter] Creating summariser <summary>
[jmeter] Created the tree successfully using testfiles/Bug52310.jmx
[jmeter] Starting the test @ Sun May 26 14:21:54 UTC 2019 (1558880514256)
[jmeter] Waiting for possible Shutdown/StopTestNow/HeapDump/ThreadDump message on port 4445
[jmeter] summary = 3 in 00:00:02 = 1.3/s Avg: 564 Min: 77 Max: 927 Err: 1 (33.33%)
[jmeter] Tidying up ... @ Sun May 26 14:21:58 UTC 2019 (1558880518113)
[jmeter] ... end of run
Target 'batchtest' failed with message 'CSV Files are not identical.
<https://builds.apache.org/job/JMeter%20Windows/ws/trunk\bin\testfiles\Bug52310.csv>
ComputeIPAddr,200,OK,TG2 1-1,text,true
HTTP-Request-Java,200,OK,TG2 1-1,text,true
HTTP-Request-HC4,200,OK,TG2 1-1,text,true
<https://builds.apache.org/job/JMeter%20Windows/ws/trunk\bin\Bug52310.csv>
ComputeIPAddr,200,OK,TG2 1-1,text,true
HTTP-Request-Java,200,OK,TG2 1-1,text,true
HTTP-Request-HC4,Non HTTP response code: java.net.SocketException,Non HTTP response message: Network is unreachable: connect,TG2 1-1,text,false'.
Target 'batch_scripts' failed with message 'The following error occurred while executing this line:
<https://builds.apache.org/job/JMeter%20Windows/ws/trunk\build.xml>:2882: CSV Files are not identical.
<https://builds.apache.org/job/JMeter%20Windows/ws/trunk\bin\testfiles\Bug52310.csv>
ComputeIPAddr,200,OK,TG2 1-1,text,true
HTTP-Request-Java,200,OK,TG2 1-1,text,true
HTTP-Request-HC4,200,OK,TG2 1-1,text,true
<https://builds.apache.org/job/JMeter%20Windows/ws/trunk\bin\Bug52310.csv>
ComputeIPAddr,200,OK,TG2 1-1,text,true
HTTP-Request-Java,200,OK,TG2 1-1,text,true
HTTP-Request-HC4,Non HTTP response code: java.net.SocketException,Non HTTP response message: Network is unreachable: connect,TG2 1-1,text,false'.
Cannot execute '_allbatchtests' - 'batch_scripts' failed or was not executed.
Cannot execute 'test' - '_allbatchtests' failed or was not executed.
download_checkstyle:
_process_checkstyle_jars:
_check_exists:
_check_jarfile:
[echo] Checking checkstyle-8.8-all.jar
[echo] Deleting checkstyle-8.8-all.jar (excluding checkstyle-8.8-all.jar)
setproxy:
_get_jarfile:
setproxy:
_get_zipfile:
checkstyle:
_process_checkstyle_jars:
_check_exists:
_check_jarfile:
[checkstyle] Running Checkstyle 8.8 on 1770 files
BUILD FAILED
<https://builds.apache.org/job/JMeter%20Windows/ws/trunk\build.xml>:2957: The following error occurred while executing this line:
<https://builds.apache.org/job/JMeter%20Windows/ws/trunk\build.xml>:2882: CSV Files are not identical.
<https://builds.apache.org/job/JMeter%20Windows/ws/trunk\bin\testfiles\Bug52310.csv>
ComputeIPAddr,200,OK,TG2 1-1,text,true
HTTP-Request-Java,200,OK,TG2 1-1,text,true
HTTP-Request-HC4,200,OK,TG2 1-1,text,true
<https://builds.apache.org/job/JMeter%20Windows/ws/trunk\bin\Bug52310.csv>
ComputeIPAddr,200,OK,TG2 1-1,text,true
HTTP-Request-Java,200,OK,TG2 1-1,text,true
HTTP-Request-HC4,Non HTTP response code: java.net.SocketException,Non HTTP response message: Network is unreachable: connect,TG2 1-1,text,false
Total time: 5 minutes 25 seconds
Build step 'Invoke Ant' marked build as failure
Build failed in Jenkins: JMeter Windows #1371
Posted by Apache Jenkins Server <je...@builds.apache.org>.
See <https://builds.apache.org/job/JMeter%20Windows/1371/display/redirect?page=changes>
Changes:
[fschumacher] Shorten lambda expressions by using references and anyMatch
[fschumacher] Revert unwanted changes from last commit
[fschumacher] Try to find a network device to use for Bug52310 test
------------------------------------------
[...truncated 477.11 KB...]
[java] ====================
[java] jenkins-win2016-3/fe80:0:0:0:1cd2:e47:f5eb:fdd0%5
[java] isSiteLocalAddress:false
[java] isAnyLocalAddress:false
[java] isLinkLocalAddress:true
[java] isLoopbackAddress:false
[java] isMulticastAddress:false
[java] ====================
[java] jenkins-win2016-3/2001:0:2851:782c:1cd2:e47:f5eb:fdd0
[java] isSiteLocalAddress:false
[java] isAnyLocalAddress:false
[java] isLinkLocalAddress:false
[java] isLoopbackAddress:false
[java] isMulticastAddress:false
[java] Interfaces: {name:lo (Software Loopback Interface 1) => [/127.0.0.1/8 [/127.255.255.255], /0:0:0:0:0:0:0:1/128 [null]], name:eth0 (Red Hat VirtIO Ethernet Adapter) => [/10.20.2.47/24 [/10.20.2.255], /fe80:0:0:0:9981:9637:8a00:fc65%eth0/64 [null]], name:net0 (Microsoft ISATAP Adapter) => [/fe80:0:0:0:0:5efe:a14:22f%net0/128 [null]], name:eth1 (Microsoft Kernel Debug Network Adapter) => [], name:net1 (Teredo Tunneling Pseudo-Interface) => [/2001:0:2851:782c:1cd2:e47:f5eb:fdd0/0 [null], /fe80:0:0:0:1cd2:e47:f5eb:fdd0%net1/32 [null]], name:eth2 (Red Hat VirtIO Ethernet Adapter-WFP Native MAC Layer LightWeight Filter-0000) => [], name:eth3 (Red Hat VirtIO Ethernet Adapter-QoS Packet Scheduler-0000) => [], name:eth4 (Red Hat VirtIO Ethernet Adapter-WFP 802.3 MAC Layer LightWeight Filter-0000) => []}
[java] Choose 10.20.2.47 to talk to external services
[java] java.rmi.server.hostname=null
[java] ........................................................................................................................................................I...............................................................Throwing on Engine creation to simulate failure
[java] .........................................................................................................................................................I.I....................................................................................................................................................................................................................................................................................................................II.........................................................................................................................................................................................................................................................................................................................................................................................................................................................................................................................................................................................................................................................................................................................................................................................................................................................................................................................................................................................................................................................................................................................................................................................................................................................................................................................................................................................................................................................................................................................................................................................................................................................................................................................................................................................................................................................................................................................................................................................................................................................................................................................................................................................................................................................................................................................................................................................................................................................................................................................................................................................................................................I.I..................................................................................................................
[java] Time: 70.639
[java]
[java] OK (3329 tests)
[java]
[java] .........................................................................................
[java] Time: 8.839
[java]
[java] OK (89 tests)
[java]
batchtest:
[echo] Starting BatchTestLocal with file BatchTestLocal.jmx using -X -Jdummy=dummy
[jmeter] SLF4J: Class path contains multiple SLF4J bindings.
[jmeter] SLF4J: Found binding in [jar:file:/F:/jenkins/jenkins-slave/workspace/JMeter%20Windows/trunk/lib/log4j-slf4j-impl-2.11.1.jar!/org/slf4j/impl/StaticLoggerBinder.class]
[jmeter] SLF4J: Found binding in [jar:file:/F:/jenkins/jenkins-slave/workspace/JMeter%20Windows/trunk/lib/opt/activemq-all-5.15.8.jar!/org/slf4j/impl/StaticLoggerBinder.class]
[jmeter] SLF4J: See http://www.slf4j.org/codes.html#multiple_bindings for an explanation.
[jmeter] SLF4J: Actual binding is of type [org.apache.logging.slf4j.Log4jLoggerFactory]
[jmeter] May 26, 2019 4:26:07 AM java.util.prefs.WindowsPreferences <init>
[jmeter] WARNING: Could not open/create prefs root node Software\JavaSoft\Prefs at root 0x80000002. Windows RegCreateKeyEx(...) returned error code 5.
[jmeter] Creating summariser <summary>
[jmeter] Created the tree successfully using testfiles/BatchTestLocal.jmx
[jmeter] Starting the test @ Sun May 26 04:26:07 PDT 2019 (1558869967307)
[jmeter] Waiting for possible Shutdown/StopTestNow/HeapDump/ThreadDump message on port 4445
[jmeter] summary = 133 in 00:00:50 = 2.6/s Avg: 136 Min: 0 Max: 255 Err: 16 (12.03%)
[jmeter] Tidying up ... @ Sun May 26 04:26:58 PDT 2019 (1558870018616)
[jmeter] ... end of run
[echo] BatchTestLocal output files compared OK
batchtestserver:
[server] SLF4J: Class path contains multiple SLF4J bindings.
[server] SLF4J: Found binding in [jar:file:/F:/jenkins/jenkins-slave/workspace/JMeter%20Windows/trunk/lib/log4j-slf4j-impl-2.11.1.jar!/org/slf4j/impl/StaticLoggerBinder.class]
[server] SLF4J: Found binding in [jar:file:/F:/jenkins/jenkins-slave/workspace/JMeter%20Windows/trunk/lib/opt/activemq-all-5.15.8.jar!/org/slf4j/impl/StaticLoggerBinder.class]
[server] SLF4J: See http://www.slf4j.org/codes.html#multiple_bindings for an explanation.
[server] SLF4J: Actual binding is of type [org.apache.logging.slf4j.Log4jLoggerFactory]
batchtest:
[echo] Starting BatchTestLocal with file BatchTestLocal.jmx using -Rjenkins-win2016-3:2063 -Jdummy=dummy
[client] SLF4J: Class path contains multiple SLF4J bindings.
[client] SLF4J: Found binding in [jar:file:/F:/jenkins/jenkins-slave/workspace/JMeter%20Windows/trunk/lib/log4j-slf4j-impl-2.11.1.jar!/org/slf4j/impl/StaticLoggerBinder.class]
[client] SLF4J: Found binding in [jar:file:/F:/jenkins/jenkins-slave/workspace/JMeter%20Windows/trunk/lib/opt/activemq-all-5.15.8.jar!/org/slf4j/impl/StaticLoggerBinder.class]
[client] SLF4J: See http://www.slf4j.org/codes.html#multiple_bindings for an explanation.
[client] SLF4J: Actual binding is of type [org.apache.logging.slf4j.Log4jLoggerFactory]
[server] Created remote object: UnicastServerRef2 [liveRef: [endpoint:[10.20.2.47:49541,SSLRMIServerSocketFactory(host=jenkins-win2016-3/10.20.2.47, keyStoreLocation=rmi_keystore.jks, type=JKS, trustStoreLocation=rmi_keystore.jks, type=JKS, alias=rmi),SSLRMIClientSocketFactory(keyStoreLocation=rmi_keystore.jks, type=JKS, trustStoreLocation=rmi_keystore.jks, type=JKS, alias=rmi)](local),objID:[-2b01eff8:16af3e4d61f:-7fff, -7718816804418765462]]]
[client] May 26, 2019 4:27:06 AM java.util.prefs.WindowsPreferences <init>
[client] WARNING: Could not open/create prefs root node Software\JavaSoft\Prefs at root 0x80000002. Windows RegCreateKeyEx(...) returned error code 5.
[client] Creating summariser <summary>
[client] Created the tree successfully using testfiles/BatchTestLocal.jmx
[client] Configuring remote engine: jenkins-win2016-3:2063
[client] Starting remote engines
[client] Starting the test @ Sun May 26 04:27:07 PDT 2019 (1558870027427)
[server] Starting the test on host jenkins-win2016-3:2063 @ Sun May 26 04:27:11 PDT 2019 (1558870031213)
[client] Remote engines have been started
[client] Waiting for possible Shutdown/StopTestNow/HeapDump/ThreadDump message on port 4445
[server] May 26, 2019 4:27:12 AM java.util.prefs.WindowsPreferences <init>
[server] WARNING: Could not open/create prefs root node Software\JavaSoft\Prefs at root 0x80000002. Windows RegCreateKeyEx(...) returned error code 5.
[client] summary + 106 in 00:00:48 = 2.2/s Avg: 141 Min: 2 Max: 245 Err: 16 (15.09%) Active: 1 Started: 3 Finished: 2
[client] summary + 27 in 00:00:04 = 7.4/s Avg: 95 Min: 0 Max: 251 Err: 0 (0.00%) Active: 0 Started: 11 Finished: 11
[client] summary = 133 in 00:00:52 = 2.6/s Avg: 132 Min: 0 Max: 251 Err: 16 (12.03%)
[client] Tidying up remote @ Sun May 26 04:28:03 PDT 2019 (1558870083694)
[server] Finished the test on host jenkins-win2016-3:2063 @ Sun May 26 04:28:03 PDT 2019 (1558870083694) - exit requested.
[client] ... end of run
[echo] BatchTestLocal output files compared OK
batch_scripts:
batchtest:
[echo] Starting BUG_62847 with file BUG_62847.jmx using -X -Jdummy=dummy
[jmeter] SLF4J: Class path contains multiple SLF4J bindings.
[jmeter] SLF4J: Found binding in [jar:file:/F:/jenkins/jenkins-slave/workspace/JMeter%20Windows/trunk/lib/log4j-slf4j-impl-2.11.1.jar!/org/slf4j/impl/StaticLoggerBinder.class]
[jmeter] SLF4J: Found binding in [jar:file:/F:/jenkins/jenkins-slave/workspace/JMeter%20Windows/trunk/lib/opt/activemq-all-5.15.8.jar!/org/slf4j/impl/StaticLoggerBinder.class]
[jmeter] SLF4J: See http://www.slf4j.org/codes.html#multiple_bindings for an explanation.
[jmeter] SLF4J: Actual binding is of type [org.apache.logging.slf4j.Log4jLoggerFactory]
[jmeter] May 26, 2019 4:28:13 AM java.util.prefs.WindowsPreferences <init>
[jmeter] WARNING: Could not open/create prefs root node Software\JavaSoft\Prefs at root 0x80000002. Windows RegCreateKeyEx(...) returned error code 5.
[jmeter] Creating summariser <summary>
[jmeter] Created the tree successfully using testfiles/BUG_62847.jmx
[jmeter] Starting the test @ Sun May 26 04:28:13 PDT 2019 (1558870093171)
[jmeter] Waiting for possible Shutdown/StopTestNow/HeapDump/ThreadDump message on port 4445
[jmeter] summary = 6 in 00:00:01 = 8.3/s Avg: 0 Min: 0 Max: 2 Err: 0 (0.00%)
[jmeter] Tidying up ... @ Sun May 26 04:28:14 PDT 2019 (1558870094239)
[jmeter] ... end of run
[echo] BUG_62847 output files compared OK
batchtest:
[echo] Starting TestResultStatusAction with file TestResultStatusAction.jmx using -X -Jdummy=dummy
[jmeter] SLF4J: Class path contains multiple SLF4J bindings.
[jmeter] SLF4J: Found binding in [jar:file:/F:/jenkins/jenkins-slave/workspace/JMeter%20Windows/trunk/lib/log4j-slf4j-impl-2.11.1.jar!/org/slf4j/impl/StaticLoggerBinder.class]
[jmeter] SLF4J: Found binding in [jar:file:/F:/jenkins/jenkins-slave/workspace/JMeter%20Windows/trunk/lib/opt/activemq-all-5.15.8.jar!/org/slf4j/impl/StaticLoggerBinder.class]
[jmeter] SLF4J: See http://www.slf4j.org/codes.html#multiple_bindings for an explanation.
[jmeter] SLF4J: Actual binding is of type [org.apache.logging.slf4j.Log4jLoggerFactory]
[jmeter] May 26, 2019 4:28:17 AM java.util.prefs.WindowsPreferences <init>
[jmeter] WARNING: Could not open/create prefs root node Software\JavaSoft\Prefs at root 0x80000002. Windows RegCreateKeyEx(...) returned error code 5.
[jmeter] Creating summariser <summary>
[jmeter] Created the tree successfully using testfiles/TestResultStatusAction.jmx
[jmeter] Starting the test @ Sun May 26 04:28:17 PDT 2019 (1558870097705)
[jmeter] Waiting for possible Shutdown/StopTestNow/HeapDump/ThreadDump message on port 4445
[jmeter] summary = 135 in 00:00:01 = 117.4/s Avg: 0 Min: 0 Max: 91 Err: 18 (13.33%)
[jmeter] Tidying up ... @ Sun May 26 04:28:20 PDT 2019 (1558870100304)
[jmeter] ... end of run
[echo] TestResultStatusAction output files compared OK
batchtest:
[echo] Starting TestRedirectionPolicies with file TestRedirectionPolicies.jmx using -X -Jdummy=dummy
[jmeter] SLF4J: Class path contains multiple SLF4J bindings.
[jmeter] SLF4J: Found binding in [jar:file:/F:/jenkins/jenkins-slave/workspace/JMeter%20Windows/trunk/lib/log4j-slf4j-impl-2.11.1.jar!/org/slf4j/impl/StaticLoggerBinder.class]
[jmeter] SLF4J: Found binding in [jar:file:/F:/jenkins/jenkins-slave/workspace/JMeter%20Windows/trunk/lib/opt/activemq-all-5.15.8.jar!/org/slf4j/impl/StaticLoggerBinder.class]
[jmeter] SLF4J: See http://www.slf4j.org/codes.html#multiple_bindings for an explanation.
[jmeter] SLF4J: Actual binding is of type [org.apache.logging.slf4j.Log4jLoggerFactory]
[jmeter] Creating summariser <summary>
[jmeter] Created the tree successfully using testfiles/TestRedirectionPolicies.jmx
[jmeter] Starting the test @ Sun May 26 04:28:23 PDT 2019 (1558870103853)
[jmeter] May 26, 2019 4:28:23 AM java.util.prefs.WindowsPreferences <init>
[jmeter] WARNING: Could not open/create prefs root node Software\JavaSoft\Prefs at root 0x80000002. Windows RegCreateKeyEx(...) returned error code 5.
[jmeter] Waiting for possible Shutdown/StopTestNow/HeapDump/ThreadDump message on port 4445
[jmeter] summary = 6 in 00:00:02 = 2.5/s Avg: 186 Min: 84 Max: 367 Err: 0 (0.00%)
[jmeter] Tidying up ... @ Sun May 26 04:28:27 PDT 2019 (1558870107766)
[jmeter] ... end of run
[echo] TestRedirectionPolicies output files compared OK
batchtest:
[echo] Starting HTMLParserTestFile_2 with file HTMLParserTestFile_2.jmx using -X -Jdummy=dummy
[jmeter] SLF4J: Class path contains multiple SLF4J bindings.
[jmeter] SLF4J: Found binding in [jar:file:/F:/jenkins/jenkins-slave/workspace/JMeter%20Windows/trunk/lib/log4j-slf4j-impl-2.11.1.jar!/org/slf4j/impl/StaticLoggerBinder.class]
[jmeter] SLF4J: Found binding in [jar:file:/F:/jenkins/jenkins-slave/workspace/JMeter%20Windows/trunk/lib/opt/activemq-all-5.15.8.jar!/org/slf4j/impl/StaticLoggerBinder.class]
[jmeter] SLF4J: See http://www.slf4j.org/codes.html#multiple_bindings for an explanation.
[jmeter] SLF4J: Actual binding is of type [org.apache.logging.slf4j.Log4jLoggerFactory]
[jmeter] Creating summariser <summary>
[jmeter] Created the tree successfully using testfiles/HTMLParserTestFile_2.jmx
[jmeter] Starting the test @ Sun May 26 04:28:31 PDT 2019 (1558870111195)
[jmeter] May 26, 2019 4:28:31 AM java.util.prefs.WindowsPreferences <init>
[jmeter] WARNING: Could not open/create prefs root node Software\JavaSoft\Prefs at root 0x80000002. Windows RegCreateKeyEx(...) returned error code 5.
[jmeter] Waiting for possible Shutdown/StopTestNow/HeapDump/ThreadDump message on port 4445
[jmeter] summary + 1 in 00:00:00 = 3.0/s Avg: 186 Min: 186 Max: 186 Err: 0 (0.00%) Active: 1 Started: 1 Finished: 0
[jmeter] summary = 1 in 00:00:00 = 2.9/s Avg: 186 Min: 186 Max: 186 Err: 0 (0.00%)
[jmeter] Tidying up ... @ Sun May 26 04:28:32 PDT 2019 (1558870112565)
[jmeter] ... end of run
[echo] HTMLParserTestFile_2 output files compared OK
batchtest:
[echo] Starting Bug52310 with file Bug52310.jmx using -X -Jdummy=dummy
[jmeter] SLF4J: Class path contains multiple SLF4J bindings.
[jmeter] SLF4J: Found binding in [jar:file:/F:/jenkins/jenkins-slave/workspace/JMeter%20Windows/trunk/lib/log4j-slf4j-impl-2.11.1.jar!/org/slf4j/impl/StaticLoggerBinder.class]
[jmeter] SLF4J: Found binding in [jar:file:/F:/jenkins/jenkins-slave/workspace/JMeter%20Windows/trunk/lib/opt/activemq-all-5.15.8.jar!/org/slf4j/impl/StaticLoggerBinder.class]
[jmeter] SLF4J: See http://www.slf4j.org/codes.html#multiple_bindings for an explanation.
[jmeter] SLF4J: Actual binding is of type [org.apache.logging.slf4j.Log4jLoggerFactory]
[jmeter] Creating summariser <summary>
[jmeter] Created the tree successfully using testfiles/Bug52310.jmx
[jmeter] Starting the test @ Sun May 26 04:28:36 PDT 2019 (1558870116095)
[jmeter] Waiting for possible Shutdown/StopTestNow/HeapDump/ThreadDump message on port 4445
[jmeter] May 26, 2019 4:28:36 AM java.util.prefs.WindowsPreferences <init>
[jmeter] WARNING: Could not open/create prefs root node Software\JavaSoft\Prefs at root 0x80000002. Windows RegCreateKeyEx(...) returned error code 5.
[jmeter] summary = 3 in 00:00:02 = 1.4/s Avg: 458 Min: 79 Max: 878 Err: 1 (33.33%)
[jmeter] Tidying up ... @ Sun May 26 04:28:39 PDT 2019 (1558870119623)
[jmeter] ... end of run
Target 'batchtest' failed with message 'CSV Files are not identical.
<https://builds.apache.org/job/JMeter%20Windows/ws/trunk\bin\testfiles\Bug52310.csv>
ComputeIPAddr,200,OK,TG2 1-1,text,true
HTTP-Request-Java,200,OK,TG2 1-1,text,true
HTTP-Request-HC4,200,OK,TG2 1-1,text,true
<https://builds.apache.org/job/JMeter%20Windows/ws/trunk\bin\Bug52310.csv>
ComputeIPAddr,200,OK,TG2 1-1,text,true
HTTP-Request-Java,200,OK,TG2 1-1,text,true
HTTP-Request-HC4,Non HTTP response code: java.net.SocketException,Non HTTP response message: Network is unreachable: connect,TG2 1-1,text,false'.
Target 'batch_scripts' failed with message 'The following error occurred while executing this line:
<https://builds.apache.org/job/JMeter%20Windows/ws/trunk\build.xml>:2882: CSV Files are not identical.
<https://builds.apache.org/job/JMeter%20Windows/ws/trunk\bin\testfiles\Bug52310.csv>
ComputeIPAddr,200,OK,TG2 1-1,text,true
HTTP-Request-Java,200,OK,TG2 1-1,text,true
HTTP-Request-HC4,200,OK,TG2 1-1,text,true
<https://builds.apache.org/job/JMeter%20Windows/ws/trunk\bin\Bug52310.csv>
ComputeIPAddr,200,OK,TG2 1-1,text,true
HTTP-Request-Java,200,OK,TG2 1-1,text,true
HTTP-Request-HC4,Non HTTP response code: java.net.SocketException,Non HTTP response message: Network is unreachable: connect,TG2 1-1,text,false'.
Cannot execute '_allbatchtests' - 'batch_scripts' failed or was not executed.
Cannot execute 'test' - '_allbatchtests' failed or was not executed.
download_checkstyle:
_process_checkstyle_jars:
_check_exists:
_check_jarfile:
[echo] Checking checkstyle-8.8-all.jar
[echo] Deleting checkstyle-8.8-all.jar (excluding checkstyle-8.8-all.jar)
setproxy:
_get_jarfile:
[echo] Fetching: lib/opt/checkstyle-8.8-all.jar
[get] Getting: https://downloads.sourceforge.net/checkstyle/checkstyle/8.8/checkstyle-8.8-all.jar?ts=1558869757381&use_mirror=autoselect/checkstyle-8.8-all.jar
[get] To: <https://builds.apache.org/job/JMeter%20Windows/ws/trunk\build\checkstyle-8.8-all.jar>
[get] https://downloads.sourceforge.net/checkstyle/checkstyle/8.8/checkstyle-8.8-all.jar?ts=1558869757381&use_mirror=autoselect/checkstyle-8.8-all.jar permanently moved to https://downloads.sourceforge.net/project/checkstyle/OldFiles/8.8/checkstyle-8.8-all.jar?use_mirror=autoselect%2Fcheckstyle-8.8-all.jar
[get] https://downloads.sourceforge.net/project/checkstyle/OldFiles/8.8/checkstyle-8.8-all.jar?use_mirror=autoselect%2Fcheckstyle-8.8-all.jar moved to https://master.dl.sourceforge.net/project/checkstyle/OldFiles/8.8/checkstyle-8.8-all.jar
_checkSHA512:
[echo] Checksum OK: checkstyle-8.8-all.jar
[move] Moving 1 file to <https://builds.apache.org/job/JMeter%20Windows/ws/trunk\lib\opt>
[move] Attempting to rename: <https://builds.apache.org/job/JMeter%20Windows/ws/trunk\build\checkstyle-8.8-all.jar> to <https://builds.apache.org/job/JMeter%20Windows/ws/trunk\lib\opt\checkstyle-8.8-all.jar>
setproxy:
_get_zipfile:
checkstyle:
_process_checkstyle_jars:
_check_exists:
_check_jarfile:
[checkstyle] Running Checkstyle 8.8 on 1770 files
BUILD FAILED
<https://builds.apache.org/job/JMeter%20Windows/ws/trunk\build.xml>:2957: The following error occurred while executing this line:
<https://builds.apache.org/job/JMeter%20Windows/ws/trunk\build.xml>:2882: CSV Files are not identical.
<https://builds.apache.org/job/JMeter%20Windows/ws/trunk\bin\testfiles\Bug52310.csv>
ComputeIPAddr,200,OK,TG2 1-1,text,true
HTTP-Request-Java,200,OK,TG2 1-1,text,true
HTTP-Request-HC4,200,OK,TG2 1-1,text,true
<https://builds.apache.org/job/JMeter%20Windows/ws/trunk\bin\Bug52310.csv>
ComputeIPAddr,200,OK,TG2 1-1,text,true
HTTP-Request-Java,200,OK,TG2 1-1,text,true
HTTP-Request-HC4,Non HTTP response code: java.net.SocketException,Non HTTP response message: Network is unreachable: connect,TG2 1-1,text,false
Total time: 6 minutes 23 seconds
Build step 'Invoke Ant' marked build as failure