You are viewing a plain text version of this content. The canonical link for it is here.
Posted to commits@sling.apache.org by Apache Jenkins Server <je...@builds.apache.org> on 2016/10/06 16:01:17 UTC

Jenkins build is still unstable: sling-contrib-1.7 #1145

See <https://builds.apache.org/job/sling-contrib-1.7/changes>


Jenkins build is still unstable: sling-contrib-1.7 #1165

Posted by Apache Jenkins Server <je...@builds.apache.org>.
See <https://builds.apache.org/job/sling-contrib-1.7/changes>


Jenkins build is still unstable: sling-contrib-1.7 #1164

Posted by Apache Jenkins Server <je...@builds.apache.org>.
See <https://builds.apache.org/job/sling-contrib-1.7/1164/>


Jenkins build is still unstable: sling-contrib-1.7 #1163

Posted by Apache Jenkins Server <je...@builds.apache.org>.
See <https://builds.apache.org/job/sling-contrib-1.7/changes>


Jenkins build is still unstable: sling-contrib-1.7 #1162

Posted by Apache Jenkins Server <je...@builds.apache.org>.
See <https://builds.apache.org/job/sling-contrib-1.7/changes>


Jenkins build is still unstable: sling-contrib-1.7 #1161

Posted by Apache Jenkins Server <je...@builds.apache.org>.
See <https://builds.apache.org/job/sling-contrib-1.7/changes>


Jenkins build is unstable: sling-contrib-1.7 #1160

Posted by Apache Jenkins Server <je...@builds.apache.org>.
See <https://builds.apache.org/job/sling-contrib-1.7/1160/changes>


Build failed in Jenkins: sling-contrib-1.7 #1159

Posted by Apache Jenkins Server <je...@builds.apache.org>.
See <https://builds.apache.org/job/sling-contrib-1.7/1159/changes>

Changes:

[sseifert] SLING-6117 remove "with"/"has" prefix from ResourceMatchers method names as well
add "path" to resource collection/iterator matchers

------------------------------------------
[...truncated 3324 lines...]
[ERROR] <https://builds.apache.org/job/sling-contrib-1.7/ws/trunk/extensions/resourcemerger/src/test/java/org/apache/sling/resourcemerger/impl/CommonMergedResourceProviderTest.java>:[199,134] cannot find symbol
  symbol:   method nameAndProps(java.lang.String,java.util.Map<java.lang.String,java.lang.Object>)
  location: class org.apache.sling.hamcrest.ResourceMatchers
[ERROR] <https://builds.apache.org/job/sling-contrib-1.7/ws/trunk/extensions/resourcemerger/src/test/java/org/apache/sling/resourcemerger/impl/CommonMergedResourceProviderTest.java>:[220,59] cannot find symbol
  symbol:   method props(java.util.Map<java.lang.String,java.lang.Object>)
  location: class org.apache.sling.hamcrest.ResourceMatchers
[ERROR] <https://builds.apache.org/job/sling-contrib-1.7/ws/trunk/extensions/resourcemerger/src/test/java/org/apache/sling/resourcemerger/impl/CommonMergedResourceProviderTest.java>:[222,72] cannot find symbol
  symbol:   method props(org.apache.sling.api.resource.ModifiableValueMap)
  location: class org.apache.sling.hamcrest.ResourceMatchers
[ERROR] <https://builds.apache.org/job/sling-contrib-1.7/ws/trunk/extensions/resourcemerger/src/test/java/org/apache/sling/resourcemerger/impl/CommonMergedResourceProviderTest.java>:[233,59] cannot find symbol
  symbol:   method props(java.util.Map<java.lang.String,java.lang.Object>)
  location: class org.apache.sling.hamcrest.ResourceMatchers
[ERROR] <https://builds.apache.org/job/sling-contrib-1.7/ws/trunk/extensions/resourcemerger/src/test/java/org/apache/sling/resourcemerger/impl/CommonMergedResourceProviderTest.java>:[235,72] cannot find symbol
  symbol:   method props(java.util.Map<java.lang.String,java.lang.Object>)
  location: class org.apache.sling.hamcrest.ResourceMatchers
[ERROR] <https://builds.apache.org/job/sling-contrib-1.7/ws/trunk/extensions/resourcemerger/src/test/java/org/apache/sling/resourcemerger/impl/CommonMergedResourceProviderTest.java>:[260,71] cannot find symbol
  symbol:   method name(java.lang.String)
  location: class org.apache.sling.hamcrest.ResourceMatchers
[ERROR] <https://builds.apache.org/job/sling-contrib-1.7/ws/trunk/extensions/resourcemerger/src/test/java/org/apache/sling/resourcemerger/impl/CommonMergedResourceProviderTest.java>:[260,103] cannot find symbol
  symbol:   method name(java.lang.String)
  location: class org.apache.sling.hamcrest.ResourceMatchers
[ERROR] <https://builds.apache.org/job/sling-contrib-1.7/ws/trunk/extensions/resourcemerger/src/test/java/org/apache/sling/resourcemerger/impl/CommonMergedResourceProviderTest.java>:[260,136] cannot find symbol
  symbol:   method name(java.lang.String)
  location: class org.apache.sling.hamcrest.ResourceMatchers
[ERROR] <https://builds.apache.org/job/sling-contrib-1.7/ws/trunk/extensions/resourcemerger/src/test/java/org/apache/sling/resourcemerger/impl/CommonMergedResourceProviderTest.java>:[260,169] cannot find symbol
  symbol:   method name(java.lang.String)
  location: class org.apache.sling.hamcrest.ResourceMatchers
[ERROR] <https://builds.apache.org/job/sling-contrib-1.7/ws/trunk/extensions/resourcemerger/src/test/java/org/apache/sling/resourcemerger/impl/CommonMergedResourceProviderTest.java>:[276,71] cannot find symbol
  symbol:   method name(java.lang.String)
  location: class org.apache.sling.hamcrest.ResourceMatchers
[ERROR] <https://builds.apache.org/job/sling-contrib-1.7/ws/trunk/extensions/resourcemerger/src/test/java/org/apache/sling/resourcemerger/impl/CommonMergedResourceProviderTest.java>:[276,103] cannot find symbol
  symbol:   method name(java.lang.String)
  location: class org.apache.sling.hamcrest.ResourceMatchers
[ERROR] <https://builds.apache.org/job/sling-contrib-1.7/ws/trunk/extensions/resourcemerger/src/test/java/org/apache/sling/resourcemerger/impl/CommonMergedResourceProviderTest.java>:[276,136] cannot find symbol
  symbol:   method name(java.lang.String)
  location: class org.apache.sling.hamcrest.ResourceMatchers
[ERROR] <https://builds.apache.org/job/sling-contrib-1.7/ws/trunk/extensions/resourcemerger/src/test/java/org/apache/sling/resourcemerger/impl/CommonMergedResourceProviderTest.java>:[276,169] cannot find symbol
  symbol:   method name(java.lang.String)
  location: class org.apache.sling.hamcrest.ResourceMatchers
[ERROR] <https://builds.apache.org/job/sling-contrib-1.7/ws/trunk/extensions/resourcemerger/src/test/java/org/apache/sling/resourcemerger/impl/CommonMergedResourceProviderTest.java>:[291,71] cannot find symbol
  symbol:   method name(java.lang.String)
  location: class org.apache.sling.hamcrest.ResourceMatchers
[ERROR] <https://builds.apache.org/job/sling-contrib-1.7/ws/trunk/extensions/resourcemerger/src/test/java/org/apache/sling/resourcemerger/impl/CommonMergedResourceProviderTest.java>:[291,103] cannot find symbol
  symbol:   method name(java.lang.String)
  location: class org.apache.sling.hamcrest.ResourceMatchers
[ERROR] <https://builds.apache.org/job/sling-contrib-1.7/ws/trunk/extensions/resourcemerger/src/test/java/org/apache/sling/resourcemerger/impl/CommonMergedResourceProviderTest.java>:[291,136] cannot find symbol
  symbol:   method name(java.lang.String)
  location: class org.apache.sling.hamcrest.ResourceMatchers
[INFO] 23 errors 
[INFO] -------------------------------------------------------------
[JENKINS] Archiving disabled
[JENKINS] Archiving disabled
[JENKINS] Archiving disabled
[JENKINS] Archiving disabled
[JENKINS] Archiving disabled
[JENKINS] Archiving disabled
[JENKINS] Archiving disabled
[JENKINS] Archiving disabled
[JENKINS] Archiving disabled
[JENKINS] Archiving disabled
[JENKINS] Archiving disabled
[JENKINS] Archiving disabled
[JENKINS] Archiving disabled
[JENKINS] Archiving disabled
[JENKINS] Archiving disabled
[JENKINS] Archiving disabled
[JENKINS] Archiving disabled
[JENKINS] Archiving disabled
[JENKINS] Archiving disabled
[JENKINS] Archiving disabled
[JENKINS] Archiving disabled
[JENKINS] Archiving disabled
[JENKINS] Archiving disabled
[JENKINS] Archiving disabled
[JENKINS] Archiving disabled
[JENKINS] Archiving disabled
[JENKINS] Archiving disabled
[JENKINS] Archiving disabled
[JENKINS] Archiving disabled
[JENKINS] Archiving disabled
[JENKINS] Archiving disabled
[JENKINS] Archiving disabled
[JENKINS] Archiving disabled
[JENKINS] Archiving disabled
[JENKINS] Archiving disabled
[JENKINS] Archiving disabled
[JENKINS] Archiving disabled
[JENKINS] Archiving disabled
[JENKINS] Archiving disabled
[JENKINS] Archiving disabled
[JENKINS] Archiving disabled
[JENKINS] Archiving disabled
[JENKINS] Archiving disabled
[JENKINS] Archiving disabled
[JENKINS] Archiving disabled
[JENKINS] Archiving disabled
[JENKINS] Archiving disabled
[JENKINS] Archiving disabled
[JENKINS] Archiving disabled
[JENKINS] Archiving disabled
[JENKINS] Archiving disabled
[JENKINS] Archiving disabled
[JENKINS] Archiving disabled
[JENKINS] Archiving disabled[INFO] ------------------------------------------------------------------------
[INFO] Reactor Summary:
[INFO] 
[INFO] Apache Sling Authentication XING API ............... SUCCESS [ 34.796 s]
[INFO] Apache Sling Authentication XING Login ............. SUCCESS [ 16.984 s]
[INFO] Apache Sling Authentication XING OAuth ............. SUCCESS [  8.485 s]
[INFO] Apache Sling Commons HTML Utilities ................ SUCCESS [  6.790 s]
[INFO] Apache Sling APT parser ............................ SUCCESS [ 44.717 s]
[INFO] Apache Sling APT servlet ........................... SUCCESS [  9.283 s]
[INFO] Apache Sling Resource Collection API ............... SUCCESS [  9.483 s]
[INFO] Apache Sling DataSource Provider ................... SUCCESS [ 20.636 s]
[INFO] Apache Sling Dojo JavaScript Library ............... SUCCESS [ 14.518 s]
[INFO] Apache Sling Dojo Data Extension ................... SUCCESS [  8.394 s]
[INFO] Apache Sling FTP Server ............................ SUCCESS [ 14.340 s]
[INFO] Apache Sling Google Web Toolkit Servlet Library .... SUCCESS [ 12.993 s]
[INFO] Apache Sling Google Web Toolkit Sample ............. SUCCESS [ 46.068 s]
[INFO] Apache Sling JMX Resource Provider ................. SUCCESS [  5.111 s]
[INFO] Apache Sling ClassLoader Leak Detector ............. SUCCESS [  8.427 s]
[INFO] Apache Sling MongoDB Resource Provider ............. SUCCESS [ 10.717 s]
[INFO] Apache Sling OSGi Bundle Repository ................ SUCCESS [ 13.747 s]
[INFO] Apache Sling Log Tail Implementation ............... SUCCESS [  9.960 s]
[INFO] S3 dependencies for Oak ............................ SUCCESS [ 12.587 s]
[INFO] Apache Sling Request Processing Analyzer ........... SUCCESS [  8.782 s]
[INFO] Apache Sling Resource Merger ....................... FAILURE [ 10.028 s]
[INFO] Apache Sling Inventory Printer Based on Resources .. SKIPPED
[INFO] Apache Sling Security .............................. SKIPPED
[INFO] Apache Sling SLF4J MDC Filter ...................... SKIPPED
[INFO] Apache Sling Query ................................. SKIPPED
[INFO] Apache Sling Oak Restrictions ...................... SKIPPED
[INFO] Apache Sling Superimposing Resource Provider ....... SKIPPED
[INFO] Apache Sling Tenant ................................ SKIPPED
[INFO] Apache Sling Log Tracer ............................ SKIPPED
[INFO] Apache Sling URL Rewriter .......................... SKIPPED
[INFO] Apache Sling Dynamic Include ....................... SKIPPED
[INFO] Apache Sling Startup Filter ........................ SKIPPED
[INFO] Apache Sling Startup Filter Disabler ............... SKIPPED
[INFO] Apache Sling JCR Java Compiler ..................... SKIPPED
[INFO] Apache Sling Repository Accessor ................... SKIPPED
[INFO] Apache Sling Object Content Mapping ................ SKIPPED
[INFO] Apache Sling JCR Prefs ............................. SKIPPED
[INFO] Apache Sling JCR Resource Security ................. SKIPPED
[INFO] Apache Sling Script Console ........................ SKIPPED
[INFO] Apache Sling Atom Tag Library ...................... SKIPPED
[INFO] Apache Sling Scripting Groovy Support .............. SKIPPED
[INFO] Apache Sling Scripting Java Support ................ SKIPPED
[INFO] Apache Sling Scripting JST Support ................. SKIPPED
[INFO] Apache Sling Scripting Python Support .............. SKIPPED
[INFO] Apache Sling Scripting Ruby Support ................ SKIPPED
[INFO] Scala Script Engine ................................ SKIPPED
[INFO] Apache Sling Scala Scripting Configuration ......... SKIPPED
[INFO] Scala for Sling Demo Application - Hello World ..... SKIPPED
[INFO] Scala for Sling Demo Application - Forum ........... SKIPPED
[INFO] Apache Sling Scripting Velocity Support ............ SKIPPED
[INFO] Apache Sling Scripting W3C XML Processing Support .. SKIPPED
[INFO] Apache Sling Launchpad Contrib Testing ............. SKIPPED
[INFO] Apache Sling Contrib (Builder) ..................... SKIPPED
[INFO] ------------------------------------------------------------------------
[INFO] BUILD FAILURE
[INFO] ------------------------------------------------------------------------
[INFO] Total time: 08:42 min
[INFO] Finished at: 2016-10-10T23:24:20+00:00
[INFO] Final Memory: 128M/486M
[INFO] ------------------------------------------------------------------------

Waiting for Jenkins to finish collecting data
[ERROR] Failed to execute goal org.apache.maven.plugins:maven-compiler-plugin:3.2:testCompile (default-testCompile) on project org.apache.sling.resourcemerger: Compilation failure: Compilation failure:
[ERROR] <https://builds.apache.org/job/sling-contrib-1.7/ws/trunk/extensions/resourcemerger/src/test/java/org/apache/sling/resourcemerger/impl/CommonMergedResourceProviderTest.java>:[136,33] cannot find symbol
[ERROR] symbol:   method nameAndProps(java.lang.String,java.util.Map<java.lang.String,java.lang.Object>)
[ERROR] location: class org.apache.sling.hamcrest.ResourceMatchers
[ERROR] <https://builds.apache.org/job/sling-contrib-1.7/ws/trunk/extensions/resourcemerger/src/test/java/org/apache/sling/resourcemerger/impl/CommonMergedResourceProviderTest.java>:[137,33] cannot find symbol
[ERROR] symbol:   method nameAndProps(java.lang.String,java.util.Map<java.lang.String,java.lang.Object>)
[ERROR] location: class org.apache.sling.hamcrest.ResourceMatchers
[ERROR] <https://builds.apache.org/job/sling-contrib-1.7/ws/trunk/extensions/resourcemerger/src/test/java/org/apache/sling/resourcemerger/impl/CommonMergedResourceProviderTest.java>:[147,33] cannot find symbol
[ERROR] symbol:   method name(java.lang.String)
[ERROR] location: class org.apache.sling.hamcrest.ResourceMatchers
[ERROR] <https://builds.apache.org/job/sling-contrib-1.7/ws/trunk/extensions/resourcemerger/src/test/java/org/apache/sling/resourcemerger/impl/CommonMergedResourceProviderTest.java>:[148,33] cannot find symbol
[ERROR] symbol:   method name(java.lang.String)
[ERROR] location: class org.apache.sling.hamcrest.ResourceMatchers
[ERROR] <https://builds.apache.org/job/sling-contrib-1.7/ws/trunk/extensions/resourcemerger/src/test/java/org/apache/sling/resourcemerger/impl/CommonMergedResourceProviderTest.java>:[156,33] cannot find symbol
[ERROR] symbol:   method name(java.lang.String)
[ERROR] location: class org.apache.sling.hamcrest.ResourceMatchers
[ERROR] <https://builds.apache.org/job/sling-contrib-1.7/ws/trunk/extensions/resourcemerger/src/test/java/org/apache/sling/resourcemerger/impl/CommonMergedResourceProviderTest.java>:[157,33] cannot find symbol
[ERROR] symbol:   method nameAndProps(java.lang.String,java.util.Map<java.lang.String,java.lang.Object>)
[ERROR] location: class org.apache.sling.hamcrest.ResourceMatchers
[ERROR] <https://builds.apache.org/job/sling-contrib-1.7/ws/trunk/extensions/resourcemerger/src/test/java/org/apache/sling/resourcemerger/impl/CommonMergedResourceProviderTest.java>:[180,71] cannot find symbol
[ERROR] symbol:   method nameAndProps(java.lang.String,java.util.Map<java.lang.String,java.lang.Object>)
[ERROR] location: class org.apache.sling.hamcrest.ResourceMatchers
[ERROR] <https://builds.apache.org/job/sling-contrib-1.7/ws/trunk/extensions/resourcemerger/src/test/java/org/apache/sling/resourcemerger/impl/CommonMergedResourceProviderTest.java>:[199,134] cannot find symbol
[ERROR] symbol:   method nameAndProps(java.lang.String,java.util.Map<java.lang.String,java.lang.Object>)
[ERROR] location: class org.apache.sling.hamcrest.ResourceMatchers
[ERROR] <https://builds.apache.org/job/sling-contrib-1.7/ws/trunk/extensions/resourcemerger/src/test/java/org/apache/sling/resourcemerger/impl/CommonMergedResourceProviderTest.java>:[220,59] cannot find symbol
[ERROR] symbol:   method props(java.util.Map<java.lang.String,java.lang.Object>)
[ERROR] location: class org.apache.sling.hamcrest.ResourceMatchers
[ERROR] <https://builds.apache.org/job/sling-contrib-1.7/ws/trunk/extensions/resourcemerger/src/test/java/org/apache/sling/resourcemerger/impl/CommonMergedResourceProviderTest.java>:[222,72] cannot find symbol
[ERROR] symbol:   method props(org.apache.sling.api.resource.ModifiableValueMap)
[ERROR] location: class org.apache.sling.hamcrest.ResourceMatchers
[ERROR] <https://builds.apache.org/job/sling-contrib-1.7/ws/trunk/extensions/resourcemerger/src/test/java/org/apache/sling/resourcemerger/impl/CommonMergedResourceProviderTest.java>:[233,59] cannot find symbol
[ERROR] symbol:   method props(java.util.Map<java.lang.String,java.lang.Object>)
[ERROR] location: class org.apache.sling.hamcrest.ResourceMatchers
[ERROR] <https://builds.apache.org/job/sling-contrib-1.7/ws/trunk/extensions/resourcemerger/src/test/java/org/apache/sling/resourcemerger/impl/CommonMergedResourceProviderTest.java>:[235,72] cannot find symbol
[ERROR] symbol:   method props(java.util.Map<java.lang.String,java.lang.Object>)
[ERROR] location: class org.apache.sling.hamcrest.ResourceMatchers
[ERROR] <https://builds.apache.org/job/sling-contrib-1.7/ws/trunk/extensions/resourcemerger/src/test/java/org/apache/sling/resourcemerger/impl/CommonMergedResourceProviderTest.java>:[260,71] cannot find symbol
[ERROR] symbol:   method name(java.lang.String)
[ERROR] location: class org.apache.sling.hamcrest.ResourceMatchers
[ERROR] <https://builds.apache.org/job/sling-contrib-1.7/ws/trunk/extensions/resourcemerger/src/test/java/org/apache/sling/resourcemerger/impl/CommonMergedResourceProviderTest.java>:[260,103] cannot find symbol
[ERROR] symbol:   method name(java.lang.String)
[ERROR] location: class org.apache.sling.hamcrest.ResourceMatchers
[ERROR] <https://builds.apache.org/job/sling-contrib-1.7/ws/trunk/extensions/resourcemerger/src/test/java/org/apache/sling/resourcemerger/impl/CommonMergedResourceProviderTest.java>:[260,136] cannot find symbol
[ERROR] symbol:   method name(java.lang.String)
[ERROR] location: class org.apache.sling.hamcrest.ResourceMatchers
[ERROR] <https://builds.apache.org/job/sling-contrib-1.7/ws/trunk/extensions/resourcemerger/src/test/java/org/apache/sling/resourcemerger/impl/CommonMergedResourceProviderTest.java>:[260,169] cannot find symbol
[ERROR] symbol:   method name(java.lang.String)
[ERROR] location: class org.apache.sling.hamcrest.ResourceMatchers
[ERROR] <https://builds.apache.org/job/sling-contrib-1.7/ws/trunk/extensions/resourcemerger/src/test/java/org/apache/sling/resourcemerger/impl/CommonMergedResourceProviderTest.java>:[276,71] cannot find symbol
[ERROR] symbol:   method name(java.lang.String)
[ERROR] location: class org.apache.sling.hamcrest.ResourceMatchers
[ERROR] <https://builds.apache.org/job/sling-contrib-1.7/ws/trunk/extensions/resourcemerger/src/test/java/org/apache/sling/resourcemerger/impl/CommonMergedResourceProviderTest.java>:[276,103] cannot find symbol
[ERROR] symbol:   method name(java.lang.String)
[ERROR] location: class org.apache.sling.hamcrest.ResourceMatchers
[ERROR] <https://builds.apache.org/job/sling-contrib-1.7/ws/trunk/extensions/resourcemerger/src/test/java/org/apache/sling/resourcemerger/impl/CommonMergedResourceProviderTest.java>:[276,136] cannot find symbol
[ERROR] symbol:   method name(java.lang.String)
[ERROR] location: class org.apache.sling.hamcrest.ResourceMatchers
[ERROR] <https://builds.apache.org/job/sling-contrib-1.7/ws/trunk/extensions/resourcemerger/src/test/java/org/apache/sling/resourcemerger/impl/CommonMergedResourceProviderTest.java>:[276,169] cannot find symbol
[ERROR] symbol:   method name(java.lang.String)
[ERROR] location: class org.apache.sling.hamcrest.ResourceMatchers
[ERROR] <https://builds.apache.org/job/sling-contrib-1.7/ws/trunk/extensions/resourcemerger/src/test/java/org/apache/sling/resourcemerger/impl/CommonMergedResourceProviderTest.java>:[291,71] cannot find symbol
[ERROR] symbol:   method name(java.lang.String)
[ERROR] location: class org.apache.sling.hamcrest.ResourceMatchers
[ERROR] <https://builds.apache.org/job/sling-contrib-1.7/ws/trunk/extensions/resourcemerger/src/test/java/org/apache/sling/resourcemerger/impl/CommonMergedResourceProviderTest.java>:[291,103] cannot find symbol
[ERROR] symbol:   method name(java.lang.String)
[ERROR] location: class org.apache.sling.hamcrest.ResourceMatchers
[ERROR] <https://builds.apache.org/job/sling-contrib-1.7/ws/trunk/extensions/resourcemerger/src/test/java/org/apache/sling/resourcemerger/impl/CommonMergedResourceProviderTest.java>:[291,136] cannot find symbol
[ERROR] symbol:   method name(java.lang.String)
[ERROR] location: class org.apache.sling.hamcrest.ResourceMatchers
[ERROR] -> [Help 1]
[ERROR] 
[ERROR] To see the full stack trace of the errors, re-run Maven with the -e switch.
[ERROR] Re-run Maven using the -X switch to enable full debug logging.
[ERROR] 
[ERROR] For more information about the errors and possible solutions, please read the following articles:
[ERROR] [Help 1] http://cwiki.apache.org/confluence/display/MAVEN/MojoFailureException
[ERROR] 
[ERROR] After correcting the problems, you can resume the build with the command
[ERROR]   mvn <goals> -rf :org.apache.sling.resourcemerger
channel stopped

Jenkins build is still unstable: sling-contrib-1.7 #1158

Posted by Apache Jenkins Server <je...@builds.apache.org>.
See <https://builds.apache.org/job/sling-contrib-1.7/changes>


Jenkins build is still unstable: sling-contrib-1.7 #1157

Posted by Apache Jenkins Server <je...@builds.apache.org>.
See <https://builds.apache.org/job/sling-contrib-1.7/1157/>


Jenkins build is still unstable: sling-contrib-1.7 #1156

Posted by Apache Jenkins Server <je...@builds.apache.org>.
See <https://builds.apache.org/job/sling-contrib-1.7/1156/>


Jenkins build is still unstable: sling-contrib-1.7 #1155

Posted by Apache Jenkins Server <je...@builds.apache.org>.
See <https://builds.apache.org/job/sling-contrib-1.7/changes>


Jenkins build is still unstable: sling-contrib-1.7 #1154

Posted by Apache Jenkins Server <je...@builds.apache.org>.
See <https://builds.apache.org/job/sling-contrib-1.7/changes>


Jenkins build is still unstable: sling-contrib-1.7 #1153

Posted by Apache Jenkins Server <je...@builds.apache.org>.
See <https://builds.apache.org/job/sling-contrib-1.7/changes>


Jenkins build is still unstable: sling-contrib-1.7 #1152

Posted by Apache Jenkins Server <je...@builds.apache.org>.
See <https://builds.apache.org/job/sling-contrib-1.7/changes>


Jenkins build is still unstable: sling-contrib-1.7 #1151

Posted by Apache Jenkins Server <je...@builds.apache.org>.
See <https://builds.apache.org/job/sling-contrib-1.7/changes>


Jenkins build is still unstable: sling-contrib-1.7 #1150

Posted by Apache Jenkins Server <je...@builds.apache.org>.
See <https://builds.apache.org/job/sling-contrib-1.7/changes>


Jenkins build is still unstable: sling-contrib-1.7 #1149

Posted by Apache Jenkins Server <je...@builds.apache.org>.
See <https://builds.apache.org/job/sling-contrib-1.7/changes>


Jenkins build is still unstable: sling-contrib-1.7 #1148

Posted by Apache Jenkins Server <je...@builds.apache.org>.
See <https://builds.apache.org/job/sling-contrib-1.7/changes>


Jenkins build is still unstable: sling-contrib-1.7 #1147

Posted by Apache Jenkins Server <je...@builds.apache.org>.
See <https://builds.apache.org/job/sling-contrib-1.7/changes>


Jenkins build is still unstable: sling-contrib-1.7 #1146

Posted by Apache Jenkins Server <je...@builds.apache.org>.
See <https://builds.apache.org/job/sling-contrib-1.7/changes>