You are viewing a plain text version of this content. The canonical link for it is here.
Posted to yarn-dev@hadoop.apache.org by Apache Jenkins Server <je...@builds.apache.org> on 2016/02/12 05:52:47 UTC
Hadoop-Yarn-trunk-Java8 - Build # 1048 - Still Failing
See https://builds.apache.org/job/Hadoop-Yarn-trunk-Java8/1048/
###################################################################################
########################## LAST 60 LINES OF THE CONSOLE ###########################
[...truncated 4583 lines...]
Java HotSpot(TM) 64-Bit Server VM warning: ignoring option MaxPermSize=768m; support was removed in 8.0
Running org.apache.hadoop.yarn.server.webproxy.TestAppReportFetcher
Tests run: 2, Failures: 0, Errors: 0, Skipped: 0, Time elapsed: 0.584 sec - in org.apache.hadoop.yarn.server.webproxy.TestAppReportFetcher
Results :
Tests in error:
TestWebAppProxyServlet.testAppReportForEmptyTrackingUrl:270 ยป Protocol Server ...
Tests run: 20, Failures: 0, Errors: 1, Skipped: 0
[INFO] ------------------------------------------------------------------------
[INFO] Reactor Summary:
[INFO]
[INFO] Apache Hadoop YARN ................................ SUCCESS [ 3.278 s]
[INFO] Apache Hadoop YARN API ............................ SUCCESS [01:24 min]
[INFO] Apache Hadoop YARN Common ......................... SUCCESS [02:34 min]
[INFO] Apache Hadoop YARN Server ......................... SUCCESS [ 0.059 s]
[INFO] Apache Hadoop YARN Server Common .................. SUCCESS [ 36.532 s]
[INFO] Apache Hadoop YARN NodeManager .................... SUCCESS [09:52 min]
[INFO] Apache Hadoop YARN Web Proxy ...................... FAILURE [ 8.820 s]
[INFO] Apache Hadoop YARN ApplicationHistoryService ...... SKIPPED
[INFO] Apache Hadoop YARN ResourceManager ................ SKIPPED
[INFO] Apache Hadoop YARN Server Tests ................... SKIPPED
[INFO] Apache Hadoop YARN Client ......................... SKIPPED
[INFO] Apache Hadoop YARN SharedCacheManager ............. SKIPPED
[INFO] Apache Hadoop YARN Timeline Plugin Storage ........ SKIPPED
[INFO] Apache Hadoop YARN Applications ................... SKIPPED
[INFO] Apache Hadoop YARN DistributedShell ............... SKIPPED
[INFO] Apache Hadoop YARN Unmanaged Am Launcher .......... SKIPPED
[INFO] Apache Hadoop YARN Site ........................... SKIPPED
[INFO] Apache Hadoop YARN Registry ....................... SKIPPED
[INFO] Apache Hadoop YARN Project ........................ SKIPPED
[INFO] ------------------------------------------------------------------------
[INFO] BUILD FAILURE
[INFO] ------------------------------------------------------------------------
[INFO] Total time: 14:41 min
[INFO] Finished at: 2016-02-12T04:52:49+00:00
[INFO] Final Memory: 95M/1111M
[INFO] ------------------------------------------------------------------------
[ERROR] Failed to execute goal org.apache.maven.plugins:maven-surefire-plugin:2.17:test (default-test) on project hadoop-yarn-server-web-proxy: There are test failures.
[ERROR]
[ERROR] Please refer to /home/jenkins/jenkins-slave/workspace/Hadoop-Yarn-trunk-Java8/hadoop-yarn-project/hadoop-yarn/hadoop-yarn-server/hadoop-yarn-server-web-proxy/target/surefire-reports for the individual test results.
[ERROR] -> [Help 1]
[ERROR]
[ERROR] To see the full stack trace of the errors, re-run Maven with the -e switch.
[ERROR] Re-run Maven using the -X switch to enable full debug logging.
[ERROR]
[ERROR] For more information about the errors and possible solutions, please read the following articles:
[ERROR] [Help 1] http://cwiki.apache.org/confluence/display/MAVEN/MojoFailureException
[ERROR]
[ERROR] After correcting the problems, you can resume the build with the command
[ERROR] mvn <goals> -rf :hadoop-yarn-server-web-proxy
Build step 'Execute shell' marked build as failure
Archiving artifacts
Recording test results
Sending e-mails to: yarn-dev@hadoop.apache.org
Email was triggered for: Failure - Any
Sending email for trigger: Failure - Any
###################################################################################
############################## FAILED TESTS (if any) ##############################
1 tests failed.
FAILED: org.apache.hadoop.yarn.server.webproxy.TestWebAppProxyServlet.testAppReportForEmptyTrackingUrl
Error Message:
Server redirected too many times (20)
Stack Trace:
java.net.ProtocolException: Server redirected too many times (20)
at sun.net.www.protocol.http.HttpURLConnection.getInputStream0(HttpURLConnection.java:1846)
at sun.net.www.protocol.http.HttpURLConnection.getInputStream(HttpURLConnection.java:1439)
at java.net.HttpURLConnection.getResponseCode(HttpURLConnection.java:480)
at org.apache.hadoop.yarn.server.webproxy.TestWebAppProxyServlet.testAppReportForEmptyTrackingUrl(TestWebAppProxyServlet.java:270)