You are viewing a plain text version of this content. The canonical link for it is here.
Posted to builds@hbase.apache.org by Apache Jenkins Server <je...@builds.apache.org> on 2015/01/03 00:36:30 UTC

Build failed in Jenkins: HBase-1.1 #45

See <https://builds.apache.org/job/HBase-1.1/45/changes>

Changes:

[enis] HBASE-12028 Abort the RegionServer, when it's handler threads die (Alicia Ying Shu)

------------------------------------------
[...truncated 1814 lines...]
Running org.apache.hadoop.hbase.client.replication.TestReplicationAdmin
Tests run: 5, Failures: 0, Errors: 0, Skipped: 0, Time elapsed: 0.33 sec - in org.apache.hadoop.hbase.client.replication.TestReplicationAdmin
Tests run: 1, Failures: 0, Errors: 0, Skipped: 0, Time elapsed: 1.345 sec - in org.apache.hadoop.hbase.client.TestPutWithDelete
Running org.apache.hadoop.hbase.client.TestHCM
Running org.apache.hadoop.hbase.client.TestRpcControllerFactory
Running org.apache.hadoop.hbase.client.TestFromClientSideNoCodec
Tests run: 2, Failures: 0, Errors: 0, Skipped: 0, Time elapsed: 1.903 sec - in org.apache.hadoop.hbase.client.TestFromClientSideNoCodec
Tests run: 1, Failures: 0, Errors: 0, Skipped: 0, Time elapsed: 2.489 sec - in org.apache.hadoop.hbase.client.TestRpcControllerFactory
Running org.apache.hadoop.hbase.client.TestHTableMultiplexer
Running org.apache.hadoop.hbase.client.TestHTablePool$TestHTableThreadLocalPool
Tests run: 9, Failures: 0, Errors: 0, Skipped: 0, Time elapsed: 3.329 sec - in org.apache.hadoop.hbase.client.TestHTablePool$TestHTableThreadLocalPool
Tests run: 1, Failures: 0, Errors: 0, Skipped: 0, Time elapsed: 8.097 sec - in org.apache.hadoop.hbase.client.TestHTableMultiplexer
Running org.apache.hadoop.hbase.client.TestTableSnapshotScanner
Running org.apache.hadoop.hbase.client.TestRestoreSnapshotFromClientWithRegionReplicas
Tests run: 5, Failures: 0, Errors: 0, Skipped: 0, Time elapsed: 58.002 sec - in org.apache.hadoop.hbase.client.TestRestoreSnapshotFromClient
Running org.apache.hadoop.hbase.client.TestClientScannerRPCTimeout
Tests run: 1, Failures: 0, Errors: 0, Skipped: 0, Time elapsed: 8.194 sec - in org.apache.hadoop.hbase.client.TestClientScannerRPCTimeout
Running org.apache.hadoop.hbase.client.TestAdmin2
Tests run: 3, Failures: 0, Errors: 0, Skipped: 0, Time elapsed: 38.496 sec - in org.apache.hadoop.hbase.client.TestTableSnapshotScanner
Running org.apache.hadoop.hbase.client.TestHTableUtil
Tests run: 2, Failures: 0, Errors: 0, Skipped: 0, Time elapsed: 2.07 sec - in org.apache.hadoop.hbase.client.TestHTableUtil
Running org.apache.hadoop.hbase.client.TestUpdateConfiguration
Tests run: 2, Failures: 0, Errors: 0, Skipped: 0, Time elapsed: 0.198 sec - in org.apache.hadoop.hbase.client.TestUpdateConfiguration
Tests run: 13, Failures: 0, Errors: 0, Skipped: 0, Time elapsed: 102.775 sec - in org.apache.hadoop.hbase.client.TestReplicasClient
Running org.apache.hadoop.hbase.client.TestScannersFromClientSide
Tests run: 5, Failures: 0, Errors: 0, Skipped: 0, Time elapsed: 65.883 sec - in org.apache.hadoop.hbase.client.TestRestoreSnapshotFromClientWithRegionReplicas
Running org.apache.hadoop.hbase.client.TestFromClientSide
Tests run: 5, Failures: 0, Errors: 0, Skipped: 0, Time elapsed: 5.478 sec - in org.apache.hadoop.hbase.client.TestScannersFromClientSide
Running org.apache.hadoop.hbase.client.TestSnapshotFromClientWithRegionReplicas
Running org.apache.hadoop.hbase.client.TestCheckAndMutate
Tests run: 1, Failures: 0, Errors: 0, Skipped: 0, Time elapsed: 1.653 sec - in org.apache.hadoop.hbase.client.TestCheckAndMutate
Tests run: 5, Failures: 0, Errors: 0, Skipped: 0, Time elapsed: 11.732 sec - in org.apache.hadoop.hbase.client.TestSnapshotFromClientWithRegionReplicas
Tests run: 23, Failures: 0, Errors: 0, Skipped: 0, Time elapsed: 57.09 sec - in org.apache.hadoop.hbase.client.TestAdmin2
Running org.apache.hadoop.hbase.client.TestSnapshotMetadata
Running org.apache.hadoop.hbase.client.TestClientOperationInterrupt
Running org.apache.hadoop.hbase.client.TestFromClientSideWithCoprocessor
Tests run: 4, Failures: 0, Errors: 0, Skipped: 0, Time elapsed: 12.182 sec - in org.apache.hadoop.hbase.client.TestSnapshotMetadata
Running org.apache.hadoop.hbase.TestDrainingServer
Tests run: 2, Failures: 0, Errors: 0, Skipped: 0, Time elapsed: 1.62 sec - in org.apache.hadoop.hbase.TestDrainingServer
Running org.apache.hadoop.hbase.TestMetaTableAccessor
Tests run: 21, Failures: 0, Errors: 0, Skipped: 3, Time elapsed: 145.22 sec - in org.apache.hadoop.hbase.client.TestHCM
Running org.apache.hadoop.hbase.util.hbck.TestOfflineMetaRebuildBase
Tests run: 8, Failures: 0, Errors: 0, Skipped: 0, Time elapsed: 9.078 sec - in org.apache.hadoop.hbase.TestMetaTableAccessor
Tests run: 1, Failures: 0, Errors: 0, Skipped: 0, Time elapsed: 29.548 sec - in org.apache.hadoop.hbase.client.TestClientOperationInterrupt
Running org.apache.hadoop.hbase.util.hbck.TestOfflineMetaRebuildOverlap
Running org.apache.hadoop.hbase.util.hbck.TestOfflineMetaRebuildHole
Tests run: 1, Failures: 0, Errors: 0, Skipped: 0, Time elapsed: 20.148 sec - in org.apache.hadoop.hbase.util.hbck.TestOfflineMetaRebuildBase
Running org.apache.hadoop.hbase.util.TestTableName
Tests run: 5, Failures: 0, Errors: 0, Skipped: 0, Time elapsed: 0.493 sec - in org.apache.hadoop.hbase.util.TestTableName
Tests run: 1, Failures: 0, Errors: 0, Skipped: 0, Time elapsed: 20.34 sec - in org.apache.hadoop.hbase.util.hbck.TestOfflineMetaRebuildHole
Tests run: 1, Failures: 0, Errors: 0, Skipped: 0, Time elapsed: 21.097 sec - in org.apache.hadoop.hbase.util.hbck.TestOfflineMetaRebuildOverlap
Running org.apache.hadoop.hbase.util.TestMiniClusterLoadEncoded
Running org.apache.hadoop.hbase.util.TestMiniClusterLoadSequential
Running org.apache.hadoop.hbase.util.TestCoprocessorScanPolicy
Tests run: 4, Failures: 0, Errors: 0, Skipped: 0, Time elapsed: 4.571 sec - in org.apache.hadoop.hbase.util.TestCoprocessorScanPolicy
Running org.apache.hadoop.hbase.util.TestIdLock
Tests run: 80, Failures: 0, Errors: 0, Skipped: 4, Time elapsed: 96.641 sec - in org.apache.hadoop.hbase.client.TestFromClientSide
Running org.apache.hadoop.hbase.util.TestMergeTable
Tests run: 1, Failures: 0, Errors: 0, Skipped: 0, Time elapsed: 15.365 sec - in org.apache.hadoop.hbase.util.TestIdLock
Running org.apache.hadoop.hbase.util.TestHBaseFsckEncryption
Tests run: 1, Failures: 0, Errors: 0, Skipped: 0, Time elapsed: 21.108 sec - in org.apache.hadoop.hbase.util.TestMergeTable
Running org.apache.hadoop.hbase.util.TestMiniClusterLoadParallel
Tests run: 1, Failures: 0, Errors: 0, Skipped: 0, Time elapsed: 11.97 sec - in org.apache.hadoop.hbase.util.TestHBaseFsckEncryption
Tests run: 4, Failures: 0, Errors: 0, Skipped: 0, Time elapsed: 41.306 sec - in org.apache.hadoop.hbase.util.TestMiniClusterLoadSequential
Tests run: 5, Failures: 0, Errors: 0, Skipped: 0, Time elapsed: 42.66 sec - in org.apache.hadoop.hbase.util.TestMiniClusterLoadEncoded
Running org.apache.hadoop.hbase.util.TestProcessBasedCluster
Tests run: 1, Failures: 0, Errors: 0, Skipped: 0, Time elapsed: 0.149 sec - in org.apache.hadoop.hbase.util.TestProcessBasedCluster
Running org.apache.hadoop.hbase.util.TestMergeTool
Running org.apache.hadoop.hbase.util.TestFSTableDescriptors
Tests run: 15, Failures: 0, Errors: 0, Skipped: 0, Time elapsed: 2.655 sec - in org.apache.hadoop.hbase.util.TestFSTableDescriptors
Running org.apache.hadoop.hbase.util.TestHBaseFsck
Tests run: 80, Failures: 0, Errors: 0, Skipped: 4, Time elapsed: 99.739 sec - in org.apache.hadoop.hbase.client.TestFromClientSideWithCoprocessor
Running org.apache.hadoop.hbase.util.TestFSHDFSUtils
Running org.apache.hadoop.hbase.util.TestFSVisitor
Tests run: 3, Failures: 0, Errors: 0, Skipped: 0, Time elapsed: 5.346 sec - in org.apache.hadoop.hbase.util.TestFSHDFSUtils
Tests run: 3, Failures: 0, Errors: 0, Skipped: 0, Time elapsed: 3.603 sec - in org.apache.hadoop.hbase.util.TestFSVisitor
Running org.apache.hadoop.hbase.util.TestFSUtils
Running org.apache.hadoop.hbase.util.TestDefaultEnvironmentEdge
Tests run: 1, Failures: 0, Errors: 0, Skipped: 0, Time elapsed: 0.365 sec - in org.apache.hadoop.hbase.util.TestDefaultEnvironmentEdge
Tests run: 1, Failures: 0, Errors: 0, Skipped: 0, Time elapsed: 21.32 sec - in org.apache.hadoop.hbase.util.TestMergeTool
Running org.apache.hadoop.hbase.util.TestRegionSplitter
Running org.apache.hadoop.hbase.wal.TestWALFiltering
Tests run: 7, Failures: 0, Errors: 0, Skipped: 0, Time elapsed: 12.953 sec - in org.apache.hadoop.hbase.util.TestFSUtils
Tests run: 6, Failures: 0, Errors: 0, Skipped: 0, Time elapsed: 5.982 sec - in org.apache.hadoop.hbase.util.TestRegionSplitter
Running org.apache.hadoop.hbase.wal.TestWALReaderOnSecureWAL
Running org.apache.hadoop.hbase.wal.TestDefaultWALProviderWithHLogKey
Tests run: 2, Failures: 0, Errors: 0, Skipped: 0, Time elapsed: 1.75 sec - in org.apache.hadoop.hbase.wal.TestWALReaderOnSecureWAL
Tests run: 4, Failures: 0, Errors: 0, Skipped: 0, Time elapsed: 40.015 sec - in org.apache.hadoop.hbase.util.TestMiniClusterLoadParallel
Running org.apache.hadoop.hbase.wal.TestSecureWAL
Tests run: 1, Failures: 0, Errors: 0, Skipped: 0, Time elapsed: 1.41 sec - in org.apache.hadoop.hbase.wal.TestSecureWAL
Running org.apache.hadoop.hbase.wal.TestWALSplit
Tests run: 5, Failures: 0, Errors: 0, Skipped: 0, Time elapsed: 6.59 sec - in org.apache.hadoop.hbase.wal.TestDefaultWALProviderWithHLogKey
Running org.apache.hadoop.hbase.wal.TestWALSplitCompressed
Running org.apache.hadoop.hbase.wal.TestDefaultWALProvider
Tests run: 1, Failures: 0, Errors: 0, Skipped: 0, Time elapsed: 24.295 sec - in org.apache.hadoop.hbase.wal.TestWALFiltering
Tests run: 5, Failures: 0, Errors: 0, Skipped: 0, Time elapsed: 6.661 sec - in org.apache.hadoop.hbase.wal.TestDefaultWALProvider
Running org.apache.hadoop.hbase.wal.TestWALFactory
Running org.apache.hadoop.hbase.wal.TestBoundedRegionGroupingProvider
Tests run: 9, Failures: 0, Errors: 0, Skipped: 0, Time elapsed: 11.449 sec - in org.apache.hadoop.hbase.wal.TestWALFactory
Tests run: 5, Failures: 0, Errors: 0, Skipped: 0, Time elapsed: 17.676 sec - in org.apache.hadoop.hbase.wal.TestBoundedRegionGroupingProvider
Running org.apache.hadoop.hbase.constraint.TestConstraint
Tests run: 5, Failures: 0, Errors: 0, Skipped: 0, Time elapsed: 6.991 sec - in org.apache.hadoop.hbase.constraint.TestConstraint
Running org.apache.hadoop.hbase.TestNamespace
Tests run: 9, Failures: 0, Errors: 0, Skipped: 1, Time elapsed: 6.795 sec - in org.apache.hadoop.hbase.TestNamespace
Running org.apache.hadoop.hbase.TestMetaMigrationConvertingToPB
Tests run: 3, Failures: 0, Errors: 0, Skipped: 0, Time elapsed: 2.159 sec - in org.apache.hadoop.hbase.TestMetaMigrationConvertingToPB
Running org.apache.hadoop.hbase.TestRegionRebalancing
Running org.apache.hadoop.hbase.TestInfoServers
Tests run: 3, Failures: 0, Errors: 0, Skipped: 0, Time elapsed: 2.55 sec - in org.apache.hadoop.hbase.TestInfoServers
Running org.apache.hadoop.hbase.filter.TestScanRowPrefix
Tests run: 1, Failures: 0, Errors: 0, Skipped: 0, Time elapsed: 2.465 sec - in org.apache.hadoop.hbase.filter.TestScanRowPrefix
Tests run: 2, Failures: 0, Errors: 0, Skipped: 0, Time elapsed: 27.119 sec - in org.apache.hadoop.hbase.TestRegionRebalancing
Running org.apache.hadoop.hbase.filter.TestFilterWrapper
Tests run: 1, Failures: 0, Errors: 0, Skipped: 0, Time elapsed: 1.965 sec - in org.apache.hadoop.hbase.filter.TestFilterWrapper
Running org.apache.hadoop.hbase.filter.TestFuzzyRowAndColumnRangeFilter
Running org.apache.hadoop.hbase.filter.TestColumnRangeFilter
Tests run: 1, Failures: 0, Errors: 0, Skipped: 0, Time elapsed: 2.397 sec - in org.apache.hadoop.hbase.filter.TestFuzzyRowAndColumnRangeFilter
Tests run: 1, Failures: 0, Errors: 0, Skipped: 0, Time elapsed: 7.568 sec - in org.apache.hadoop.hbase.filter.TestColumnRangeFilter
Running org.apache.hadoop.hbase.filter.TestFilterWithScanLimits
Running org.apache.hadoop.hbase.io.TestFileLink
Tests run: 1, Failures: 0, Errors: 0, Skipped: 0, Time elapsed: 1.879 sec - in org.apache.hadoop.hbase.filter.TestFilterWithScanLimits
Running org.apache.hadoop.hbase.io.hfile.TestScannerSelectionUsingTTL
Tests run: 3, Failures: 0, Errors: 0, Skipped: 0, Time elapsed: 14.232 sec - in org.apache.hadoop.hbase.io.TestFileLink
Running org.apache.hadoop.hbase.io.hfile.TestCacheConfig
Tests run: 6, Failures: 0, Errors: 0, Skipped: 0, Time elapsed: 1.714 sec - in org.apache.hadoop.hbase.io.hfile.TestCacheConfig
Running org.apache.hadoop.hbase.io.hfile.TestHFileSeek
Tests run: 1, Failures: 0, Errors: 0, Skipped: 0, Time elapsed: 1.768 sec - in org.apache.hadoop.hbase.io.hfile.TestHFileSeek
Running org.apache.hadoop.hbase.io.hfile.TestForceCacheImportantBlocks
Tests run: 4, Failures: 0, Errors: 0, Skipped: 0, Time elapsed: 38.905 sec - in org.apache.hadoop.hbase.io.hfile.TestForceCacheImportantBlocks
Running org.apache.hadoop.hbase.io.hfile.TestCacheOnWrite
Tests run: 6, Failures: 0, Errors: 0, Skipped: 0, Time elapsed: 62.577 sec - in org.apache.hadoop.hbase.io.hfile.TestScannerSelectionUsingTTL
Running org.apache.hadoop.hbase.io.hfile.TestHFileBlock
Tests run: 31, Failures: 0, Errors: 0, Skipped: 0, Time elapsed: 186.022 sec - in org.apache.hadoop.hbase.wal.TestWALSplit
Tests run: 31, Failures: 0, Errors: 0, Skipped: 0, Time elapsed: 189.167 sec - in org.apache.hadoop.hbase.wal.TestWALSplitCompressed
Running org.apache.hadoop.hbase.io.hfile.TestHFileBlockIndex
Tests run: 2, Failures: 0, Errors: 0, Skipped: 0, Time elapsed: 0.994 sec - in org.apache.hadoop.hbase.io.hfile.TestHFileBlockIndex
Running org.apache.hadoop.hbase.io.encoding.TestLoadAndSwitchEncodeOnDisk
Running org.apache.hadoop.hbase.io.encoding.TestPrefixTree
Tests run: 1, Failures: 0, Errors: 0, Skipped: 0, Time elapsed: 2.485 sec - in org.apache.hadoop.hbase.io.encoding.TestPrefixTree
Running org.apache.hadoop.hbase.io.encoding.TestBufferedDataBlockEncoder
Tests run: 1, Failures: 0, Errors: 0, Skipped: 0, Time elapsed: 24.095 sec - in org.apache.hadoop.hbase.io.encoding.TestLoadAndSwitchEncodeOnDisk
Tests run: 45, Failures: 0, Errors: 0, Skipped: 1, Time elapsed: 256.139 sec - in org.apache.hadoop.hbase.util.TestHBaseFsck
Running org.apache.hadoop.hbase.io.encoding.TestEncodedSeekers
Running org.apache.hadoop.hbase.io.encoding.TestDataBlockEncoders
Tests run: 1, Failures: 0, Errors: 0, Skipped: 0, Time elapsed: 28.226 sec - in org.apache.hadoop.hbase.io.encoding.TestBufferedDataBlockEncoder
Running org.apache.hadoop.hbase.io.encoding.TestChangingEncoding
Tests run: 28, Failures: 0, Errors: 0, Skipped: 0, Time elapsed: 93.604 sec - in org.apache.hadoop.hbase.io.hfile.TestHFileBlock
Running org.apache.hadoop.hbase.TestClusterBootOrder
Tests run: 2, Failures: 0, Errors: 0, Skipped: 0, Time elapsed: 26.433 sec - in org.apache.hadoop.hbase.TestClusterBootOrder
Tests run: 20, Failures: 0, Errors: 0, Skipped: 0, Time elapsed: 98.883 sec - in org.apache.hadoop.hbase.io.encoding.TestEncodedSeekers
Tests run: 3, Failures: 0, Errors: 0, Skipped: 0, Time elapsed: 103.823 sec - in org.apache.hadoop.hbase.io.encoding.TestChangingEncoding
Tests run: 28, Failures: 0, Errors: 0, Skipped: 0, Time elapsed: 230.367 sec - in org.apache.hadoop.hbase.io.encoding.TestDataBlockEncoders
Tests run: 216, Failures: 0, Errors: 0, Skipped: 0, Time elapsed: 333.593 sec - in org.apache.hadoop.hbase.io.hfile.TestCacheOnWrite

Results :


Tests in error: 
  TestDistributedLogSplitting.testSameVersionUpdatesRecovery:1217->installTable:1427->installTable:1437->Object.wait:-2 » 


Tests run: 2304, Failures: 0, Errors: 1, Skipped: 18

[INFO] ------------------------------------------------------------------------
[INFO] Reactor Summary:
[INFO] 
[INFO] HBase ............................................. SUCCESS [2.985s]
[INFO] HBase - Checkstyle ................................ SUCCESS [0.734s]
[INFO] HBase - Annotations ............................... SUCCESS [0.831s]
[INFO] HBase - Common .................................... SUCCESS [58.277s]
[INFO] HBase - Protocol .................................. SUCCESS [9.066s]
[INFO] HBase - Client .................................... SUCCESS [1:12.350s]
[INFO] HBase - Hadoop Compatibility ...................... SUCCESS [6.979s]
[INFO] HBase - Hadoop Two Compatibility .................. SUCCESS [6.063s]
[INFO] HBase - Prefix Tree ............................... SUCCESS [8.187s]
[INFO] HBase - Server .................................... FAILURE [1:04:24.461s]
[INFO] HBase - Testing Util .............................. SKIPPED
[INFO] HBase - Thrift .................................... SKIPPED
[INFO] HBase - Rest ...................................... SKIPPED
[INFO] HBase - Shell ..................................... SKIPPED
[INFO] HBase - Integration Tests ......................... SKIPPED
[INFO] HBase - Examples .................................. SKIPPED
[INFO] HBase - Assembly .................................. SKIPPED
[INFO] ------------------------------------------------------------------------
[INFO] BUILD FAILURE
[INFO] ------------------------------------------------------------------------
[INFO] Total time: 1:07:10.721s
[INFO] Finished at: Fri Jan 02 23:33:32 UTC 2015
[INFO] Final Memory: 46M/788M
[INFO] ------------------------------------------------------------------------
[ERROR] Failed to execute goal org.apache.maven.plugins:maven-surefire-plugin:2.18:test (secondPartTestsExecution) on project hbase-server: There are test failures.
[ERROR] 
[ERROR] Please refer to <https://builds.apache.org/job/HBase-1.1/ws/hbase-server/target/surefire-reports> for the individual test results.
[ERROR] -> [Help 1]
[ERROR] 
[ERROR] To see the full stack trace of the errors, re-run Maven with the -e switch.
[ERROR] Re-run Maven using the -X switch to enable full debug logging.
[ERROR] 
[ERROR] For more information about the errors and possible solutions, please read the following articles:
[ERROR] [Help 1] http://cwiki.apache.org/confluence/display/MAVEN/MojoFailureException
[ERROR] 
[ERROR] After correcting the problems, you can resume the build with the command
[ERROR]   mvn <goals> -rf :hbase-server
Build step 'Invoke top-level Maven targets' marked build as failure
Performing Post build task...
Match found for :.* : True
Logical operation result is TRUE
Running script  :   ZOMBIE_TESTS_COUNT=`jps | grep surefirebooter | wc -l`
  if [[ $ZOMBIE_TESTS_COUNT != 0 ]] ; then
    #It seems sometimes the tests are not dying immediately. Let's give them 10s
    echo "Suspicious java process found - waiting 10s to see if there are just slow to stop"
    sleep 10   
    ZOMBIE_TESTS_COUNT=`jps | grep surefirebooter | wc -l`
    if [[ $ZOMBIE_TESTS_COUNT != 0 ]] ; then
      echo "There are $ZOMBIE_TESTS_COUNT zombie tests, they should have been killed by surefire but survived"
      echo "************ BEGIN zombies jstack extract"
      ZB_STACK=`jps | grep surefirebooter | cut -d ' ' -f 1 | xargs -n 1 jstack | grep ".test" | grep "\.java"`
      jps | grep surefirebooter | cut -d ' ' -f 1 | xargs -n 1 jstack
      echo "************ END  zombies jstack extract"
      JIRA_COMMENT="$JIRA_COMMENT

     {color:red}-1 core zombie tests{color}.  There are ${ZOMBIE_TESTS_COUNT} zombie test(s): ${ZB_STACK}"
      BAD=1
      jps | grep surefirebooter | cut -d ' ' -f 1 | xargs kill -9
    else
      echo "We're ok: there is no zombie test, but some tests took some time to stop"
    fi
  else
    echo "We're ok: there is no zombie test"
  fi
[HBase-1.1] $ /bin/bash -xe /tmp/hudson2751556127004177077.sh
++ jps
++ grep surefirebooter
++ wc -l
+ ZOMBIE_TESTS_COUNT=0
+ [[ 0 != 0 ]]
+ echo 'We'\''re ok: there is no zombie test'
We're ok: there is no zombie test
POST BUILD TASK : SUCCESS
END OF POST BUILD TASK : 0
Archiving artifacts
Sending artifact delta relative to HBase-1.1 #38
Archived 1836 artifacts
Archive block size is 32768
Received 26 blocks and 406590485 bytes
Compression is 0.2%
Took 2 min 31 sec
Recording test results
Updating HBASE-12028

Jenkins build is back to normal : HBase-1.1 #50

Posted by Apache Jenkins Server <je...@builds.apache.org>.
See <https://builds.apache.org/job/HBase-1.1/50/>


Build failed in Jenkins: HBase-1.1 #49

Posted by Apache Jenkins Server <je...@builds.apache.org>.
See <https://builds.apache.org/job/HBase-1.1/49/changes>

Changes:

[tedyu] HBASE-12783 Revert - two tests in TestAssignmentManager fail

------------------------------------------
[...truncated 1801 lines...]
Running org.apache.hadoop.hbase.client.replication.TestReplicationAdmin
Tests run: 1, Failures: 0, Errors: 0, Skipped: 0, Time elapsed: 1.771 sec - in org.apache.hadoop.hbase.client.TestPutWithDelete
Tests run: 5, Failures: 0, Errors: 0, Skipped: 0, Time elapsed: 0.403 sec - in org.apache.hadoop.hbase.client.replication.TestReplicationAdmin
Running org.apache.hadoop.hbase.client.TestHCM
Running org.apache.hadoop.hbase.client.TestFromClientSideNoCodec
Running org.apache.hadoop.hbase.client.TestRpcControllerFactory
Tests run: 2, Failures: 0, Errors: 0, Skipped: 0, Time elapsed: 2.42 sec - in org.apache.hadoop.hbase.client.TestFromClientSideNoCodec
Tests run: 1, Failures: 0, Errors: 0, Skipped: 0, Time elapsed: 2.389 sec - in org.apache.hadoop.hbase.client.TestRpcControllerFactory
Running org.apache.hadoop.hbase.client.TestHTableMultiplexer
Running org.apache.hadoop.hbase.client.TestHTablePool$TestHTableThreadLocalPool
Tests run: 9, Failures: 0, Errors: 0, Skipped: 0, Time elapsed: 2.791 sec - in org.apache.hadoop.hbase.client.TestHTablePool$TestHTableThreadLocalPool
Tests run: 1, Failures: 0, Errors: 0, Skipped: 0, Time elapsed: 7.956 sec - in org.apache.hadoop.hbase.client.TestHTableMultiplexer
Running org.apache.hadoop.hbase.client.TestTableSnapshotScanner
Running org.apache.hadoop.hbase.client.TestRestoreSnapshotFromClientWithRegionReplicas
Tests run: 5, Failures: 0, Errors: 0, Skipped: 0, Time elapsed: 60.932 sec - in org.apache.hadoop.hbase.client.TestRestoreSnapshotFromClient
Running org.apache.hadoop.hbase.client.TestClientScannerRPCTimeout
Tests run: 1, Failures: 0, Errors: 0, Skipped: 0, Time elapsed: 7.803 sec - in org.apache.hadoop.hbase.client.TestClientScannerRPCTimeout
Running org.apache.hadoop.hbase.client.TestAdmin2
Tests run: 3, Failures: 0, Errors: 0, Skipped: 0, Time elapsed: 39.596 sec - in org.apache.hadoop.hbase.client.TestTableSnapshotScanner
Running org.apache.hadoop.hbase.client.TestHTableUtil
Tests run: 2, Failures: 0, Errors: 0, Skipped: 0, Time elapsed: 2.466 sec - in org.apache.hadoop.hbase.client.TestHTableUtil
Running org.apache.hadoop.hbase.client.TestUpdateConfiguration
Tests run: 13, Failures: 0, Errors: 0, Skipped: 0, Time elapsed: 103.417 sec - in org.apache.hadoop.hbase.client.TestReplicasClient
Tests run: 2, Failures: 0, Errors: 0, Skipped: 0, Time elapsed: 0.201 sec - in org.apache.hadoop.hbase.client.TestUpdateConfiguration
Running org.apache.hadoop.hbase.client.TestScannersFromClientSide
Running org.apache.hadoop.hbase.client.TestFromClientSide
Tests run: 5, Failures: 0, Errors: 0, Skipped: 0, Time elapsed: 66.065 sec - in org.apache.hadoop.hbase.client.TestRestoreSnapshotFromClientWithRegionReplicas
Tests run: 5, Failures: 0, Errors: 0, Skipped: 0, Time elapsed: 5.553 sec - in org.apache.hadoop.hbase.client.TestScannersFromClientSide
Running org.apache.hadoop.hbase.client.TestSnapshotFromClientWithRegionReplicas
Running org.apache.hadoop.hbase.client.TestCheckAndMutate
Tests run: 1, Failures: 0, Errors: 0, Skipped: 0, Time elapsed: 2.049 sec - in org.apache.hadoop.hbase.client.TestCheckAndMutate
Tests run: 23, Failures: 0, Errors: 0, Skipped: 0, Time elapsed: 55.981 sec - in org.apache.hadoop.hbase.client.TestAdmin2
Tests run: 5, Failures: 0, Errors: 0, Skipped: 0, Time elapsed: 11.745 sec - in org.apache.hadoop.hbase.client.TestSnapshotFromClientWithRegionReplicas
Running org.apache.hadoop.hbase.client.TestSnapshotMetadata
Running org.apache.hadoop.hbase.client.TestClientOperationInterrupt
Running org.apache.hadoop.hbase.client.TestFromClientSideWithCoprocessor
Tests run: 4, Failures: 0, Errors: 0, Skipped: 0, Time elapsed: 12.768 sec - in org.apache.hadoop.hbase.client.TestSnapshotMetadata
Running org.apache.hadoop.hbase.TestDrainingServer
Tests run: 2, Failures: 0, Errors: 0, Skipped: 0, Time elapsed: 1.77 sec - in org.apache.hadoop.hbase.TestDrainingServer
Tests run: 21, Failures: 0, Errors: 0, Skipped: 3, Time elapsed: 144.917 sec - in org.apache.hadoop.hbase.client.TestHCM
Running org.apache.hadoop.hbase.TestMetaTableAccessor
Running org.apache.hadoop.hbase.util.hbck.TestOfflineMetaRebuildBase
Tests run: 1, Failures: 0, Errors: 0, Skipped: 0, Time elapsed: 30.085 sec - in org.apache.hadoop.hbase.client.TestClientOperationInterrupt
Running org.apache.hadoop.hbase.util.hbck.TestOfflineMetaRebuildOverlap
Tests run: 8, Failures: 0, Errors: 0, Skipped: 0, Time elapsed: 8.979 sec - in org.apache.hadoop.hbase.TestMetaTableAccessor
Running org.apache.hadoop.hbase.util.hbck.TestOfflineMetaRebuildHole
Tests run: 1, Failures: 0, Errors: 0, Skipped: 0, Time elapsed: 22.038 sec - in org.apache.hadoop.hbase.util.hbck.TestOfflineMetaRebuildBase
Running org.apache.hadoop.hbase.util.TestTableName
Tests run: 5, Failures: 0, Errors: 0, Skipped: 0, Time elapsed: 0.492 sec - in org.apache.hadoop.hbase.util.TestTableName
Tests run: 1, Failures: 0, Errors: 0, Skipped: 0, Time elapsed: 19.987 sec - in org.apache.hadoop.hbase.util.hbck.TestOfflineMetaRebuildOverlap
Running org.apache.hadoop.hbase.util.TestMiniClusterLoadEncoded
Tests run: 1, Failures: 0, Errors: 0, Skipped: 0, Time elapsed: 20.364 sec - in org.apache.hadoop.hbase.util.hbck.TestOfflineMetaRebuildHole
Running org.apache.hadoop.hbase.util.TestMiniClusterLoadSequential
Running org.apache.hadoop.hbase.util.TestCoprocessorScanPolicy
Tests run: 4, Failures: 0, Errors: 0, Skipped: 0, Time elapsed: 4.736 sec - in org.apache.hadoop.hbase.util.TestCoprocessorScanPolicy
Running org.apache.hadoop.hbase.util.TestIdLock
Tests run: 80, Failures: 0, Errors: 0, Skipped: 4, Time elapsed: 97.833 sec - in org.apache.hadoop.hbase.client.TestFromClientSide
Running org.apache.hadoop.hbase.util.TestMergeTable
Tests run: 1, Failures: 0, Errors: 0, Skipped: 0, Time elapsed: 15.302 sec - in org.apache.hadoop.hbase.util.TestIdLock
Running org.apache.hadoop.hbase.util.TestHBaseFsckEncryption
Tests run: 1, Failures: 0, Errors: 0, Skipped: 0, Time elapsed: 19.138 sec - in org.apache.hadoop.hbase.util.TestMergeTable
Running org.apache.hadoop.hbase.util.TestMiniClusterLoadParallel
Tests run: 1, Failures: 0, Errors: 0, Skipped: 0, Time elapsed: 12.062 sec - in org.apache.hadoop.hbase.util.TestHBaseFsckEncryption
Tests run: 5, Failures: 0, Errors: 0, Skipped: 0, Time elapsed: 41.929 sec - in org.apache.hadoop.hbase.util.TestMiniClusterLoadEncoded
Running org.apache.hadoop.hbase.util.TestProcessBasedCluster
Tests run: 1, Failures: 0, Errors: 0, Skipped: 0, Time elapsed: 0.113 sec - in org.apache.hadoop.hbase.util.TestProcessBasedCluster
Tests run: 4, Failures: 0, Errors: 0, Skipped: 0, Time elapsed: 41.892 sec - in org.apache.hadoop.hbase.util.TestMiniClusterLoadSequential
Running org.apache.hadoop.hbase.util.TestMergeTool
Running org.apache.hadoop.hbase.util.TestFSTableDescriptors
Tests run: 15, Failures: 0, Errors: 0, Skipped: 0, Time elapsed: 2.446 sec - in org.apache.hadoop.hbase.util.TestFSTableDescriptors
Running org.apache.hadoop.hbase.util.TestHBaseFsck
Tests run: 80, Failures: 0, Errors: 0, Skipped: 4, Time elapsed: 98.63 sec - in org.apache.hadoop.hbase.client.TestFromClientSideWithCoprocessor
Running org.apache.hadoop.hbase.util.TestFSHDFSUtils
Running org.apache.hadoop.hbase.util.TestFSVisitor
Tests run: 3, Failures: 0, Errors: 0, Skipped: 0, Time elapsed: 3.548 sec - in org.apache.hadoop.hbase.util.TestFSVisitor
Tests run: 3, Failures: 0, Errors: 0, Skipped: 0, Time elapsed: 5.194 sec - in org.apache.hadoop.hbase.util.TestFSHDFSUtils
Running org.apache.hadoop.hbase.util.TestFSUtils
Running org.apache.hadoop.hbase.util.TestDefaultEnvironmentEdge
Tests run: 1, Failures: 0, Errors: 0, Skipped: 0, Time elapsed: 0.328 sec - in org.apache.hadoop.hbase.util.TestDefaultEnvironmentEdge
Tests run: 1, Failures: 0, Errors: 0, Skipped: 0, Time elapsed: 20.682 sec - in org.apache.hadoop.hbase.util.TestMergeTool
Running org.apache.hadoop.hbase.util.TestRegionSplitter
Running org.apache.hadoop.hbase.wal.TestWALFiltering
Tests run: 7, Failures: 0, Errors: 0, Skipped: 0, Time elapsed: 12.897 sec - in org.apache.hadoop.hbase.util.TestFSUtils
Tests run: 6, Failures: 0, Errors: 0, Skipped: 0, Time elapsed: 5.332 sec - in org.apache.hadoop.hbase.util.TestRegionSplitter
Running org.apache.hadoop.hbase.wal.TestWALReaderOnSecureWAL
Tests run: 2, Failures: 0, Errors: 0, Skipped: 0, Time elapsed: 1.692 sec - in org.apache.hadoop.hbase.wal.TestWALReaderOnSecureWAL
Running org.apache.hadoop.hbase.wal.TestDefaultWALProviderWithHLogKey
Tests run: 4, Failures: 0, Errors: 0, Skipped: 0, Time elapsed: 40.41 sec - in org.apache.hadoop.hbase.util.TestMiniClusterLoadParallel
Running org.apache.hadoop.hbase.wal.TestWALSplit
Running org.apache.hadoop.hbase.wal.TestSecureWAL
Tests run: 5, Failures: 0, Errors: 0, Skipped: 0, Time elapsed: 6.55 sec - in org.apache.hadoop.hbase.wal.TestDefaultWALProviderWithHLogKey
Tests run: 1, Failures: 0, Errors: 0, Skipped: 0, Time elapsed: 1.312 sec - in org.apache.hadoop.hbase.wal.TestSecureWAL
Running org.apache.hadoop.hbase.wal.TestWALSplitCompressed
Running org.apache.hadoop.hbase.wal.TestDefaultWALProvider
Tests run: 1, Failures: 0, Errors: 0, Skipped: 0, Time elapsed: 24.301 sec - in org.apache.hadoop.hbase.wal.TestWALFiltering
Tests run: 5, Failures: 0, Errors: 0, Skipped: 0, Time elapsed: 6.297 sec - in org.apache.hadoop.hbase.wal.TestDefaultWALProvider
Running org.apache.hadoop.hbase.wal.TestWALFactory
Running org.apache.hadoop.hbase.wal.TestBoundedRegionGroupingProvider
Tests run: 9, Failures: 0, Errors: 0, Skipped: 0, Time elapsed: 15.354 sec - in org.apache.hadoop.hbase.wal.TestWALFactory
Tests run: 5, Failures: 0, Errors: 0, Skipped: 0, Time elapsed: 17.928 sec - in org.apache.hadoop.hbase.wal.TestBoundedRegionGroupingProvider
Running org.apache.hadoop.hbase.constraint.TestConstraint
Running org.apache.hadoop.hbase.TestNamespace
Tests run: 5, Failures: 0, Errors: 0, Skipped: 0, Time elapsed: 5.429 sec - in org.apache.hadoop.hbase.constraint.TestConstraint
Tests run: 9, Failures: 0, Errors: 0, Skipped: 1, Time elapsed: 7.004 sec - in org.apache.hadoop.hbase.TestNamespace
Running org.apache.hadoop.hbase.TestMetaMigrationConvertingToPB
Tests run: 3, Failures: 0, Errors: 0, Skipped: 0, Time elapsed: 2.221 sec - in org.apache.hadoop.hbase.TestMetaMigrationConvertingToPB
Running org.apache.hadoop.hbase.TestRegionRebalancing
Running org.apache.hadoop.hbase.TestInfoServers
Tests run: 3, Failures: 0, Errors: 0, Skipped: 0, Time elapsed: 2.181 sec - in org.apache.hadoop.hbase.TestInfoServers
Running org.apache.hadoop.hbase.filter.TestScanRowPrefix
Tests run: 1, Failures: 0, Errors: 0, Skipped: 0, Time elapsed: 2.118 sec - in org.apache.hadoop.hbase.filter.TestScanRowPrefix
Running org.apache.hadoop.hbase.filter.TestFilterWrapper
Tests run: 1, Failures: 0, Errors: 0, Skipped: 0, Time elapsed: 1.944 sec - in org.apache.hadoop.hbase.filter.TestFilterWrapper
Tests run: 2, Failures: 0, Errors: 0, Skipped: 0, Time elapsed: 29.61 sec - in org.apache.hadoop.hbase.TestRegionRebalancing
Running org.apache.hadoop.hbase.filter.TestFuzzyRowAndColumnRangeFilter
Running org.apache.hadoop.hbase.filter.TestColumnRangeFilter
Tests run: 1, Failures: 0, Errors: 0, Skipped: 0, Time elapsed: 2.208 sec - in org.apache.hadoop.hbase.filter.TestFuzzyRowAndColumnRangeFilter
Tests run: 1, Failures: 0, Errors: 0, Skipped: 0, Time elapsed: 7.28 sec - in org.apache.hadoop.hbase.filter.TestColumnRangeFilter
Running org.apache.hadoop.hbase.filter.TestFilterWithScanLimits
Running org.apache.hadoop.hbase.io.TestFileLink
Tests run: 1, Failures: 0, Errors: 0, Skipped: 0, Time elapsed: 2.014 sec - in org.apache.hadoop.hbase.filter.TestFilterWithScanLimits
Running org.apache.hadoop.hbase.io.hfile.TestScannerSelectionUsingTTL
Tests run: 3, Failures: 0, Errors: 0, Skipped: 0, Time elapsed: 14.945 sec - in org.apache.hadoop.hbase.io.TestFileLink
Running org.apache.hadoop.hbase.io.hfile.TestCacheConfig
Tests run: 6, Failures: 0, Errors: 0, Skipped: 0, Time elapsed: 1.61 sec - in org.apache.hadoop.hbase.io.hfile.TestCacheConfig
Running org.apache.hadoop.hbase.io.hfile.TestHFileSeek
Tests run: 1, Failures: 0, Errors: 0, Skipped: 0, Time elapsed: 1.761 sec - in org.apache.hadoop.hbase.io.hfile.TestHFileSeek
Running org.apache.hadoop.hbase.io.hfile.TestForceCacheImportantBlocks
Tests run: 4, Failures: 0, Errors: 0, Skipped: 0, Time elapsed: 39.517 sec - in org.apache.hadoop.hbase.io.hfile.TestForceCacheImportantBlocks
Running org.apache.hadoop.hbase.io.hfile.TestCacheOnWrite
Tests run: 6, Failures: 0, Errors: 0, Skipped: 0, Time elapsed: 62.558 sec - in org.apache.hadoop.hbase.io.hfile.TestScannerSelectionUsingTTL
Running org.apache.hadoop.hbase.io.hfile.TestHFileBlock
Tests run: 31, Failures: 0, Errors: 0, Skipped: 0, Time elapsed: 185.668 sec - in org.apache.hadoop.hbase.wal.TestWALSplit
Running org.apache.hadoop.hbase.io.hfile.TestHFileBlockIndex
Tests run: 2, Failures: 0, Errors: 0, Skipped: 0, Time elapsed: 0.928 sec - in org.apache.hadoop.hbase.io.hfile.TestHFileBlockIndex
Tests run: 31, Failures: 0, Errors: 0, Skipped: 0, Time elapsed: 194.411 sec - in org.apache.hadoop.hbase.wal.TestWALSplitCompressed
Running org.apache.hadoop.hbase.io.encoding.TestLoadAndSwitchEncodeOnDisk
Running org.apache.hadoop.hbase.io.encoding.TestPrefixTree
Tests run: 1, Failures: 0, Errors: 0, Skipped: 0, Time elapsed: 2.789 sec - in org.apache.hadoop.hbase.io.encoding.TestPrefixTree
Running org.apache.hadoop.hbase.io.encoding.TestBufferedDataBlockEncoder
Tests run: 1, Failures: 0, Errors: 0, Skipped: 0, Time elapsed: 23.311 sec - in org.apache.hadoop.hbase.io.encoding.TestLoadAndSwitchEncodeOnDisk
Running org.apache.hadoop.hbase.io.encoding.TestEncodedSeekers
Tests run: 45, Failures: 0, Errors: 0, Skipped: 1, Time elapsed: 259.208 sec - in org.apache.hadoop.hbase.util.TestHBaseFsck
Running org.apache.hadoop.hbase.io.encoding.TestDataBlockEncoders
Tests run: 1, Failures: 0, Errors: 0, Skipped: 0, Time elapsed: 27.039 sec - in org.apache.hadoop.hbase.io.encoding.TestBufferedDataBlockEncoder
Running org.apache.hadoop.hbase.io.encoding.TestChangingEncoding
Tests run: 28, Failures: 0, Errors: 0, Skipped: 0, Time elapsed: 94.065 sec - in org.apache.hadoop.hbase.io.hfile.TestHFileBlock
Running org.apache.hadoop.hbase.TestClusterBootOrder
Tests run: 2, Failures: 0, Errors: 0, Skipped: 0, Time elapsed: 26.03 sec - in org.apache.hadoop.hbase.TestClusterBootOrder
Tests run: 20, Failures: 0, Errors: 0, Skipped: 0, Time elapsed: 96.541 sec - in org.apache.hadoop.hbase.io.encoding.TestEncodedSeekers
Tests run: 3, Failures: 0, Errors: 0, Skipped: 0, Time elapsed: 100.647 sec - in org.apache.hadoop.hbase.io.encoding.TestChangingEncoding
Tests run: 28, Failures: 0, Errors: 0, Skipped: 0, Time elapsed: 228.379 sec - in org.apache.hadoop.hbase.io.encoding.TestDataBlockEncoders
Tests run: 216, Failures: 0, Errors: 0, Skipped: 0, Time elapsed: 338.822 sec - in org.apache.hadoop.hbase.io.hfile.TestCacheOnWrite

Results :

Failed tests: 
  TestFastFail.testFastFail:270 Only few thread should ideally be waiting for the dead regionserver to be coming back. numBlockedWorkers:24 threads that retried : 8



Tests run: 2304, Failures: 1, Errors: 0, Skipped: 18

[INFO] ------------------------------------------------------------------------
[INFO] Reactor Summary:
[INFO] 
[INFO] HBase ............................................. SUCCESS [2.999s]
[INFO] HBase - Checkstyle ................................ SUCCESS [0.700s]
[INFO] HBase - Annotations ............................... SUCCESS [0.801s]
[INFO] HBase - Common .................................... SUCCESS [57.720s]
[INFO] HBase - Protocol .................................. SUCCESS [9.079s]
[INFO] HBase - Client .................................... SUCCESS [1:12.564s]
[INFO] HBase - Hadoop Compatibility ...................... SUCCESS [6.966s]
[INFO] HBase - Hadoop Two Compatibility .................. SUCCESS [5.984s]
[INFO] HBase - Prefix Tree ............................... SUCCESS [8.171s]
[INFO] HBase - Server .................................... FAILURE [1:02:48.562s]
[INFO] HBase - Testing Util .............................. SKIPPED
[INFO] HBase - Thrift .................................... SKIPPED
[INFO] HBase - Rest ...................................... SKIPPED
[INFO] HBase - Shell ..................................... SKIPPED
[INFO] HBase - Integration Tests ......................... SKIPPED
[INFO] HBase - Examples .................................. SKIPPED
[INFO] HBase - Assembly .................................. SKIPPED
[INFO] ------------------------------------------------------------------------
[INFO] BUILD FAILURE
[INFO] ------------------------------------------------------------------------
[INFO] Total time: 1:05:34.353s
[INFO] Finished at: Sat Jan 03 16:31:51 UTC 2015
[INFO] Final Memory: 46M/696M
[INFO] ------------------------------------------------------------------------
[ERROR] Failed to execute goal org.apache.maven.plugins:maven-surefire-plugin:2.18:test (secondPartTestsExecution) on project hbase-server: There are test failures.
[ERROR] 
[ERROR] Please refer to <https://builds.apache.org/job/HBase-1.1/ws/hbase-server/target/surefire-reports> for the individual test results.
[ERROR] -> [Help 1]
[ERROR] 
[ERROR] To see the full stack trace of the errors, re-run Maven with the -e switch.
[ERROR] Re-run Maven using the -X switch to enable full debug logging.
[ERROR] 
[ERROR] For more information about the errors and possible solutions, please read the following articles:
[ERROR] [Help 1] http://cwiki.apache.org/confluence/display/MAVEN/MojoFailureException
[ERROR] 
[ERROR] After correcting the problems, you can resume the build with the command
[ERROR]   mvn <goals> -rf :hbase-server
Build step 'Invoke top-level Maven targets' marked build as failure
Performing Post build task...
Match found for :.* : True
Logical operation result is TRUE
Running script  :   ZOMBIE_TESTS_COUNT=`jps | grep surefirebooter | wc -l`
  if [[ $ZOMBIE_TESTS_COUNT != 0 ]] ; then
    #It seems sometimes the tests are not dying immediately. Let's give them 10s
    echo "Suspicious java process found - waiting 10s to see if there are just slow to stop"
    sleep 10   
    ZOMBIE_TESTS_COUNT=`jps | grep surefirebooter | wc -l`
    if [[ $ZOMBIE_TESTS_COUNT != 0 ]] ; then
      echo "There are $ZOMBIE_TESTS_COUNT zombie tests, they should have been killed by surefire but survived"
      echo "************ BEGIN zombies jstack extract"
      ZB_STACK=`jps | grep surefirebooter | cut -d ' ' -f 1 | xargs -n 1 jstack | grep ".test" | grep "\.java"`
      jps | grep surefirebooter | cut -d ' ' -f 1 | xargs -n 1 jstack
      echo "************ END  zombies jstack extract"
      JIRA_COMMENT="$JIRA_COMMENT

     {color:red}-1 core zombie tests{color}.  There are ${ZOMBIE_TESTS_COUNT} zombie test(s): ${ZB_STACK}"
      BAD=1
      jps | grep surefirebooter | cut -d ' ' -f 1 | xargs kill -9
    else
      echo "We're ok: there is no zombie test, but some tests took some time to stop"
    fi
  else
    echo "We're ok: there is no zombie test"
  fi
[HBase-1.1] $ /bin/bash -xe /tmp/hudson3417081547230891854.sh
++ jps
++ wc -l
++ grep surefirebooter
+ ZOMBIE_TESTS_COUNT=0
+ [[ 0 != 0 ]]
+ echo 'We'\''re ok: there is no zombie test'
We're ok: there is no zombie test
POST BUILD TASK : SUCCESS
END OF POST BUILD TASK : 0
Archiving artifacts
Sending artifact delta relative to HBase-1.1 #38
Archived 1836 artifacts
Archive block size is 32768
Received 26 blocks and 411366024 bytes
Compression is 0.2%
Took 2 min 20 sec
Recording test results
Updating HBASE-12783

Build failed in Jenkins: HBase-1.1 #48

Posted by Apache Jenkins Server <je...@builds.apache.org>.
See <https://builds.apache.org/job/HBase-1.1/48/>

------------------------------------------
[...truncated 1832 lines...]
Tests run: 5, Failures: 0, Errors: 0, Skipped: 0, Time elapsed: 62.697 sec - in org.apache.hadoop.hbase.client.TestCloneSnapshotFromClientWithRegionReplicas
Running org.apache.hadoop.hbase.client.replication.TestReplicationAdmin
Tests run: 5, Failures: 0, Errors: 0, Skipped: 0, Time elapsed: 0.425 sec - in org.apache.hadoop.hbase.client.replication.TestReplicationAdmin
Running org.apache.hadoop.hbase.client.TestHCM
Running org.apache.hadoop.hbase.client.TestFromClientSideNoCodec
Running org.apache.hadoop.hbase.client.TestRpcControllerFactory
Tests run: 2, Failures: 0, Errors: 0, Skipped: 0, Time elapsed: 1.965 sec - in org.apache.hadoop.hbase.client.TestFromClientSideNoCodec
Tests run: 1, Failures: 0, Errors: 0, Skipped: 0, Time elapsed: 1.989 sec - in org.apache.hadoop.hbase.client.TestRpcControllerFactory
Running org.apache.hadoop.hbase.client.TestHTableMultiplexer
Running org.apache.hadoop.hbase.client.TestHTablePool$TestHTableThreadLocalPool
Tests run: 9, Failures: 0, Errors: 0, Skipped: 0, Time elapsed: 2.782 sec - in org.apache.hadoop.hbase.client.TestHTablePool$TestHTableThreadLocalPool
Tests run: 1, Failures: 0, Errors: 0, Skipped: 0, Time elapsed: 7.712 sec - in org.apache.hadoop.hbase.client.TestHTableMultiplexer
Running org.apache.hadoop.hbase.client.TestTableSnapshotScanner
Running org.apache.hadoop.hbase.client.TestRestoreSnapshotFromClientWithRegionReplicas
Tests run: 5, Failures: 0, Errors: 0, Skipped: 0, Time elapsed: 60.021 sec - in org.apache.hadoop.hbase.client.TestRestoreSnapshotFromClient
Running org.apache.hadoop.hbase.client.TestClientScannerRPCTimeout
Tests run: 1, Failures: 0, Errors: 0, Skipped: 0, Time elapsed: 7.645 sec - in org.apache.hadoop.hbase.client.TestClientScannerRPCTimeout
Running org.apache.hadoop.hbase.client.TestAdmin2
Tests run: 3, Failures: 0, Errors: 0, Skipped: 0, Time elapsed: 38.044 sec - in org.apache.hadoop.hbase.client.TestTableSnapshotScanner
Running org.apache.hadoop.hbase.client.TestHTableUtil
Tests run: 2, Failures: 0, Errors: 0, Skipped: 0, Time elapsed: 1.782 sec - in org.apache.hadoop.hbase.client.TestHTableUtil
Running org.apache.hadoop.hbase.client.TestUpdateConfiguration
Tests run: 2, Failures: 0, Errors: 0, Skipped: 0, Time elapsed: 0.203 sec - in org.apache.hadoop.hbase.client.TestUpdateConfiguration
Tests run: 13, Failures: 0, Errors: 0, Skipped: 0, Time elapsed: 103.102 sec - in org.apache.hadoop.hbase.client.TestReplicasClient
Running org.apache.hadoop.hbase.client.TestScannersFromClientSide
Running org.apache.hadoop.hbase.client.TestFromClientSide
Tests run: 5, Failures: 0, Errors: 0, Skipped: 0, Time elapsed: 5.618 sec - in org.apache.hadoop.hbase.client.TestScannersFromClientSide
Tests run: 5, Failures: 0, Errors: 0, Skipped: 0, Time elapsed: 68.996 sec - in org.apache.hadoop.hbase.client.TestRestoreSnapshotFromClientWithRegionReplicas
Running org.apache.hadoop.hbase.client.TestSnapshotFromClientWithRegionReplicas
Running org.apache.hadoop.hbase.client.TestCheckAndMutate
Tests run: 1, Failures: 0, Errors: 0, Skipped: 0, Time elapsed: 1.516 sec - in org.apache.hadoop.hbase.client.TestCheckAndMutate
Tests run: 23, Failures: 0, Errors: 0, Skipped: 0, Time elapsed: 55.93 sec - in org.apache.hadoop.hbase.client.TestAdmin2
Running org.apache.hadoop.hbase.client.TestSnapshotMetadata
Tests run: 5, Failures: 0, Errors: 0, Skipped: 0, Time elapsed: 11.862 sec - in org.apache.hadoop.hbase.client.TestSnapshotFromClientWithRegionReplicas
Running org.apache.hadoop.hbase.client.TestClientOperationInterrupt
Running org.apache.hadoop.hbase.client.TestFromClientSideWithCoprocessor
Tests run: 4, Failures: 0, Errors: 0, Skipped: 0, Time elapsed: 12.219 sec - in org.apache.hadoop.hbase.client.TestSnapshotMetadata
Running org.apache.hadoop.hbase.TestDrainingServer
Tests run: 2, Failures: 0, Errors: 0, Skipped: 0, Time elapsed: 1.594 sec - in org.apache.hadoop.hbase.TestDrainingServer
Running org.apache.hadoop.hbase.TestMetaTableAccessor
Tests run: 21, Failures: 0, Errors: 0, Skipped: 3, Time elapsed: 145.16 sec - in org.apache.hadoop.hbase.client.TestHCM
Running org.apache.hadoop.hbase.util.hbck.TestOfflineMetaRebuildBase
Tests run: 8, Failures: 0, Errors: 0, Skipped: 0, Time elapsed: 9.044 sec - in org.apache.hadoop.hbase.TestMetaTableAccessor
Running org.apache.hadoop.hbase.util.hbck.TestOfflineMetaRebuildOverlap
Tests run: 1, Failures: 0, Errors: 0, Skipped: 0, Time elapsed: 29.399 sec - in org.apache.hadoop.hbase.client.TestClientOperationInterrupt
Running org.apache.hadoop.hbase.util.hbck.TestOfflineMetaRebuildHole
Tests run: 1, Failures: 0, Errors: 0, Skipped: 0, Time elapsed: 20.882 sec - in org.apache.hadoop.hbase.util.hbck.TestOfflineMetaRebuildBase
Running org.apache.hadoop.hbase.util.TestTableName
Tests run: 5, Failures: 0, Errors: 0, Skipped: 0, Time elapsed: 0.498 sec - in org.apache.hadoop.hbase.util.TestTableName
Tests run: 1, Failures: 0, Errors: 0, Skipped: 0, Time elapsed: 21.243 sec - in org.apache.hadoop.hbase.util.hbck.TestOfflineMetaRebuildOverlap
Running org.apache.hadoop.hbase.util.TestMiniClusterLoadEncoded
Tests run: 1, Failures: 0, Errors: 0, Skipped: 0, Time elapsed: 21.304 sec - in org.apache.hadoop.hbase.util.hbck.TestOfflineMetaRebuildHole
Running org.apache.hadoop.hbase.util.TestMiniClusterLoadSequential
Running org.apache.hadoop.hbase.util.TestCoprocessorScanPolicy
Tests run: 4, Failures: 0, Errors: 0, Skipped: 0, Time elapsed: 4.545 sec - in org.apache.hadoop.hbase.util.TestCoprocessorScanPolicy
Running org.apache.hadoop.hbase.util.TestIdLock
Tests run: 80, Failures: 0, Errors: 0, Skipped: 4, Time elapsed: 96.647 sec - in org.apache.hadoop.hbase.client.TestFromClientSide
Running org.apache.hadoop.hbase.util.TestMergeTable
Tests run: 1, Failures: 0, Errors: 0, Skipped: 0, Time elapsed: 15.353 sec - in org.apache.hadoop.hbase.util.TestIdLock
Running org.apache.hadoop.hbase.util.TestHBaseFsckEncryption
Tests run: 1, Failures: 0, Errors: 0, Skipped: 0, Time elapsed: 19.675 sec - in org.apache.hadoop.hbase.util.TestMergeTable
Running org.apache.hadoop.hbase.util.TestMiniClusterLoadParallel
Tests run: 1, Failures: 0, Errors: 0, Skipped: 0, Time elapsed: 12.08 sec - in org.apache.hadoop.hbase.util.TestHBaseFsckEncryption
Tests run: 4, Failures: 0, Errors: 0, Skipped: 0, Time elapsed: 40.473 sec - in org.apache.hadoop.hbase.util.TestMiniClusterLoadSequential
Tests run: 5, Failures: 0, Errors: 0, Skipped: 0, Time elapsed: 43.281 sec - in org.apache.hadoop.hbase.util.TestMiniClusterLoadEncoded
Running org.apache.hadoop.hbase.util.TestProcessBasedCluster
Tests run: 1, Failures: 0, Errors: 0, Skipped: 0, Time elapsed: 0.132 sec - in org.apache.hadoop.hbase.util.TestProcessBasedCluster
Running org.apache.hadoop.hbase.util.TestMergeTool
Running org.apache.hadoop.hbase.util.TestFSTableDescriptors
Tests run: 15, Failures: 0, Errors: 0, Skipped: 0, Time elapsed: 4.004 sec - in org.apache.hadoop.hbase.util.TestFSTableDescriptors
Running org.apache.hadoop.hbase.util.TestHBaseFsck
Running org.apache.hadoop.hbase.util.TestFSHDFSUtils
Tests run: 80, Failures: 0, Errors: 0, Skipped: 4, Time elapsed: 99.38 sec - in org.apache.hadoop.hbase.client.TestFromClientSideWithCoprocessor
Running org.apache.hadoop.hbase.util.TestFSVisitor
Tests run: 3, Failures: 0, Errors: 0, Skipped: 0, Time elapsed: 4.915 sec - in org.apache.hadoop.hbase.util.TestFSHDFSUtils
Running org.apache.hadoop.hbase.util.TestFSUtils
Tests run: 3, Failures: 0, Errors: 0, Skipped: 0, Time elapsed: 3.898 sec - in org.apache.hadoop.hbase.util.TestFSVisitor
Running org.apache.hadoop.hbase.util.TestDefaultEnvironmentEdge
Tests run: 1, Failures: 0, Errors: 0, Skipped: 0, Time elapsed: 0.466 sec - in org.apache.hadoop.hbase.util.TestDefaultEnvironmentEdge
Tests run: 1, Failures: 0, Errors: 0, Skipped: 0, Time elapsed: 21.711 sec - in org.apache.hadoop.hbase.util.TestMergeTool
Running org.apache.hadoop.hbase.wal.TestWALFiltering
Running org.apache.hadoop.hbase.util.TestRegionSplitter
Tests run: 7, Failures: 0, Errors: 0, Skipped: 0, Time elapsed: 12.593 sec - in org.apache.hadoop.hbase.util.TestFSUtils
Tests run: 6, Failures: 0, Errors: 0, Skipped: 0, Time elapsed: 5.207 sec - in org.apache.hadoop.hbase.util.TestRegionSplitter
Running org.apache.hadoop.hbase.wal.TestWALReaderOnSecureWAL
Running org.apache.hadoop.hbase.wal.TestDefaultWALProviderWithHLogKey
Tests run: 2, Failures: 0, Errors: 0, Skipped: 0, Time elapsed: 1.656 sec - in org.apache.hadoop.hbase.wal.TestWALReaderOnSecureWAL
Tests run: 4, Failures: 0, Errors: 0, Skipped: 0, Time elapsed: 41.6 sec - in org.apache.hadoop.hbase.util.TestMiniClusterLoadParallel
Running org.apache.hadoop.hbase.wal.TestSecureWAL
Tests run: 1, Failures: 0, Errors: 0, Skipped: 0, Time elapsed: 1.524 sec - in org.apache.hadoop.hbase.wal.TestSecureWAL
Running org.apache.hadoop.hbase.wal.TestWALSplit
Tests run: 5, Failures: 0, Errors: 0, Skipped: 0, Time elapsed: 6.514 sec - in org.apache.hadoop.hbase.wal.TestDefaultWALProviderWithHLogKey
Running org.apache.hadoop.hbase.wal.TestWALSplitCompressed
Running org.apache.hadoop.hbase.wal.TestDefaultWALProvider
Tests run: 1, Failures: 0, Errors: 0, Skipped: 0, Time elapsed: 23.607 sec - in org.apache.hadoop.hbase.wal.TestWALFiltering
Tests run: 5, Failures: 0, Errors: 0, Skipped: 0, Time elapsed: 6.486 sec - in org.apache.hadoop.hbase.wal.TestDefaultWALProvider
Running org.apache.hadoop.hbase.wal.TestWALFactory
Running org.apache.hadoop.hbase.wal.TestBoundedRegionGroupingProvider
Tests run: 9, Failures: 0, Errors: 0, Skipped: 0, Time elapsed: 11.605 sec - in org.apache.hadoop.hbase.wal.TestWALFactory
Tests run: 5, Failures: 0, Errors: 0, Skipped: 0, Time elapsed: 17.834 sec - in org.apache.hadoop.hbase.wal.TestBoundedRegionGroupingProvider
Running org.apache.hadoop.hbase.constraint.TestConstraint
Tests run: 5, Failures: 0, Errors: 0, Skipped: 0, Time elapsed: 6.128 sec - in org.apache.hadoop.hbase.constraint.TestConstraint
Running org.apache.hadoop.hbase.TestNamespace
Tests run: 9, Failures: 0, Errors: 0, Skipped: 1, Time elapsed: 6.829 sec - in org.apache.hadoop.hbase.TestNamespace
Running org.apache.hadoop.hbase.TestMetaMigrationConvertingToPB
Tests run: 3, Failures: 0, Errors: 0, Skipped: 0, Time elapsed: 2.201 sec - in org.apache.hadoop.hbase.TestMetaMigrationConvertingToPB
Running org.apache.hadoop.hbase.TestRegionRebalancing
Running org.apache.hadoop.hbase.TestInfoServers
Tests run: 3, Failures: 0, Errors: 0, Skipped: 0, Time elapsed: 2.359 sec - in org.apache.hadoop.hbase.TestInfoServers
Running org.apache.hadoop.hbase.filter.TestScanRowPrefix
Tests run: 1, Failures: 0, Errors: 0, Skipped: 0, Time elapsed: 2.516 sec - in org.apache.hadoop.hbase.filter.TestScanRowPrefix
Running org.apache.hadoop.hbase.filter.TestFilterWrapper
Tests run: 2, Failures: 0, Errors: 0, Skipped: 0, Time elapsed: 29.365 sec - in org.apache.hadoop.hbase.TestRegionRebalancing
Tests run: 1, Failures: 0, Errors: 0, Skipped: 0, Time elapsed: 1.811 sec - in org.apache.hadoop.hbase.filter.TestFilterWrapper
Running org.apache.hadoop.hbase.filter.TestFuzzyRowAndColumnRangeFilter
Running org.apache.hadoop.hbase.filter.TestColumnRangeFilter
Tests run: 1, Failures: 0, Errors: 0, Skipped: 0, Time elapsed: 2.001 sec - in org.apache.hadoop.hbase.filter.TestFuzzyRowAndColumnRangeFilter
Tests run: 1, Failures: 0, Errors: 0, Skipped: 0, Time elapsed: 7.158 sec - in org.apache.hadoop.hbase.filter.TestColumnRangeFilter
Running org.apache.hadoop.hbase.filter.TestFilterWithScanLimits
Tests run: 1, Failures: 0, Errors: 0, Skipped: 0, Time elapsed: 1.609 sec - in org.apache.hadoop.hbase.filter.TestFilterWithScanLimits
Running org.apache.hadoop.hbase.io.TestFileLink
Running org.apache.hadoop.hbase.io.hfile.TestScannerSelectionUsingTTL
Tests run: 3, Failures: 0, Errors: 0, Skipped: 0, Time elapsed: 14.166 sec - in org.apache.hadoop.hbase.io.TestFileLink
Running org.apache.hadoop.hbase.io.hfile.TestCacheConfig
Tests run: 6, Failures: 0, Errors: 0, Skipped: 0, Time elapsed: 1.604 sec - in org.apache.hadoop.hbase.io.hfile.TestCacheConfig
Running org.apache.hadoop.hbase.io.hfile.TestHFileSeek
Tests run: 1, Failures: 0, Errors: 0, Skipped: 0, Time elapsed: 1.771 sec - in org.apache.hadoop.hbase.io.hfile.TestHFileSeek
Running org.apache.hadoop.hbase.io.hfile.TestForceCacheImportantBlocks
Tests run: 4, Failures: 0, Errors: 0, Skipped: 0, Time elapsed: 39.434 sec - in org.apache.hadoop.hbase.io.hfile.TestForceCacheImportantBlocks
Running org.apache.hadoop.hbase.io.hfile.TestCacheOnWrite
Tests run: 6, Failures: 0, Errors: 0, Skipped: 0, Time elapsed: 62.522 sec - in org.apache.hadoop.hbase.io.hfile.TestScannerSelectionUsingTTL
Running org.apache.hadoop.hbase.io.hfile.TestHFileBlock
Tests run: 31, Failures: 0, Errors: 0, Skipped: 0, Time elapsed: 186.501 sec - in org.apache.hadoop.hbase.wal.TestWALSplit
Running org.apache.hadoop.hbase.io.hfile.TestHFileBlockIndex
Tests run: 31, Failures: 0, Errors: 0, Skipped: 0, Time elapsed: 194.056 sec - in org.apache.hadoop.hbase.wal.TestWALSplitCompressed
Tests run: 2, Failures: 0, Errors: 0, Skipped: 0, Time elapsed: 1.027 sec - in org.apache.hadoop.hbase.io.hfile.TestHFileBlockIndex
Running org.apache.hadoop.hbase.io.encoding.TestLoadAndSwitchEncodeOnDisk
Running org.apache.hadoop.hbase.io.encoding.TestPrefixTree
Tests run: 1, Failures: 0, Errors: 0, Skipped: 0, Time elapsed: 2.658 sec - in org.apache.hadoop.hbase.io.encoding.TestPrefixTree
Running org.apache.hadoop.hbase.io.encoding.TestBufferedDataBlockEncoder
Tests run: 45, Failures: 0, Errors: 0, Skipped: 1, Time elapsed: 252.88 sec - in org.apache.hadoop.hbase.util.TestHBaseFsck
Running org.apache.hadoop.hbase.io.encoding.TestEncodedSeekers
Tests run: 1, Failures: 0, Errors: 0, Skipped: 0, Time elapsed: 23.992 sec - in org.apache.hadoop.hbase.io.encoding.TestLoadAndSwitchEncodeOnDisk
Running org.apache.hadoop.hbase.io.encoding.TestDataBlockEncoders
Tests run: 1, Failures: 0, Errors: 0, Skipped: 0, Time elapsed: 28.285 sec - in org.apache.hadoop.hbase.io.encoding.TestBufferedDataBlockEncoder
Running org.apache.hadoop.hbase.io.encoding.TestChangingEncoding
Tests run: 28, Failures: 0, Errors: 0, Skipped: 0, Time elapsed: 94.092 sec - in org.apache.hadoop.hbase.io.hfile.TestHFileBlock
Running org.apache.hadoop.hbase.TestClusterBootOrder
Tests run: 2, Failures: 0, Errors: 0, Skipped: 0, Time elapsed: 26.346 sec - in org.apache.hadoop.hbase.TestClusterBootOrder
Tests run: 20, Failures: 0, Errors: 0, Skipped: 0, Time elapsed: 97.254 sec - in org.apache.hadoop.hbase.io.encoding.TestEncodedSeekers
Tests run: 3, Failures: 0, Errors: 0, Skipped: 0, Time elapsed: 103.708 sec - in org.apache.hadoop.hbase.io.encoding.TestChangingEncoding
Tests run: 28, Failures: 0, Errors: 0, Skipped: 0, Time elapsed: 227.211 sec - in org.apache.hadoop.hbase.io.encoding.TestDataBlockEncoders
Tests run: 216, Failures: 0, Errors: 0, Skipped: 0, Time elapsed: 335.088 sec - in org.apache.hadoop.hbase.io.hfile.TestCacheOnWrite

Results :


Tests in error: 
  TestAssignmentManager.testSSHTimesOutOpeningRegionTransition:1100->processServerShutdownHandler:689->Object.wait:-2 » 
  TestAssignmentManager.testSSHWhenSplitRegionInProgress:515->testCaseWithSplitRegionPartial:544->processServerShutdownHandler:689->Object.wait:-2 » 


Tests run: 2304, Failures: 0, Errors: 2, Skipped: 18

[INFO] ------------------------------------------------------------------------
[INFO] Reactor Summary:
[INFO] 
[INFO] HBase ............................................. SUCCESS [3.007s]
[INFO] HBase - Checkstyle ................................ SUCCESS [0.664s]
[INFO] HBase - Annotations ............................... SUCCESS [0.805s]
[INFO] HBase - Common .................................... SUCCESS [59.570s]
[INFO] HBase - Protocol .................................. SUCCESS [9.202s]
[INFO] HBase - Client .................................... SUCCESS [1:13.377s]
[INFO] HBase - Hadoop Compatibility ...................... SUCCESS [7.032s]
[INFO] HBase - Hadoop Two Compatibility .................. SUCCESS [6.153s]
[INFO] HBase - Prefix Tree ............................... SUCCESS [8.660s]
[INFO] HBase - Server .................................... FAILURE [1:04:48.797s]
[INFO] HBase - Testing Util .............................. SKIPPED
[INFO] HBase - Thrift .................................... SKIPPED
[INFO] HBase - Rest ...................................... SKIPPED
[INFO] HBase - Shell ..................................... SKIPPED
[INFO] HBase - Integration Tests ......................... SKIPPED
[INFO] HBase - Examples .................................. SKIPPED
[INFO] HBase - Assembly .................................. SKIPPED
[INFO] ------------------------------------------------------------------------
[INFO] BUILD FAILURE
[INFO] ------------------------------------------------------------------------
[INFO] Total time: 1:07:38.150s
[INFO] Finished at: Sat Jan 03 07:57:01 UTC 2015
[INFO] Final Memory: 46M/711M
[INFO] ------------------------------------------------------------------------
[ERROR] Failed to execute goal org.apache.maven.plugins:maven-surefire-plugin:2.18:test (secondPartTestsExecution) on project hbase-server: There are test failures.
[ERROR] 
[ERROR] Please refer to <https://builds.apache.org/job/HBase-1.1/ws/hbase-server/target/surefire-reports> for the individual test results.
[ERROR] -> [Help 1]
[ERROR] 
[ERROR] To see the full stack trace of the errors, re-run Maven with the -e switch.
[ERROR] Re-run Maven using the -X switch to enable full debug logging.
[ERROR] 
[ERROR] For more information about the errors and possible solutions, please read the following articles:
[ERROR] [Help 1] http://cwiki.apache.org/confluence/display/MAVEN/MojoFailureException
[ERROR] 
[ERROR] After correcting the problems, you can resume the build with the command
[ERROR]   mvn <goals> -rf :hbase-server
Build step 'Invoke top-level Maven targets' marked build as failure
Performing Post build task...
Match found for :.* : True
Logical operation result is TRUE
Running script  :   ZOMBIE_TESTS_COUNT=`jps | grep surefirebooter | wc -l`
  if [[ $ZOMBIE_TESTS_COUNT != 0 ]] ; then
    #It seems sometimes the tests are not dying immediately. Let's give them 10s
    echo "Suspicious java process found - waiting 10s to see if there are just slow to stop"
    sleep 10   
    ZOMBIE_TESTS_COUNT=`jps | grep surefirebooter | wc -l`
    if [[ $ZOMBIE_TESTS_COUNT != 0 ]] ; then
      echo "There are $ZOMBIE_TESTS_COUNT zombie tests, they should have been killed by surefire but survived"
      echo "************ BEGIN zombies jstack extract"
      ZB_STACK=`jps | grep surefirebooter | cut -d ' ' -f 1 | xargs -n 1 jstack | grep ".test" | grep "\.java"`
      jps | grep surefirebooter | cut -d ' ' -f 1 | xargs -n 1 jstack
      echo "************ END  zombies jstack extract"
      JIRA_COMMENT="$JIRA_COMMENT

     {color:red}-1 core zombie tests{color}.  There are ${ZOMBIE_TESTS_COUNT} zombie test(s): ${ZB_STACK}"
      BAD=1
      jps | grep surefirebooter | cut -d ' ' -f 1 | xargs kill -9
    else
      echo "We're ok: there is no zombie test, but some tests took some time to stop"
    fi
  else
    echo "We're ok: there is no zombie test"
  fi
[HBase-1.1] $ /bin/bash -xe /tmp/hudson1400098868307277193.sh
++ jps
++ grep surefirebooter
++ wc -l
+ ZOMBIE_TESTS_COUNT=0
+ [[ 0 != 0 ]]
+ echo 'We'\''re ok: there is no zombie test'
We're ok: there is no zombie test
POST BUILD TASK : SUCCESS
END OF POST BUILD TASK : 0
Archiving artifacts
Sending artifact delta relative to HBase-1.1 #38
Archived 1836 artifacts
Archive block size is 32768
Received 26 blocks and 408270119 bytes
Compression is 0.2%
Took 1 min 57 sec
Recording test results

Build failed in Jenkins: HBase-1.1 #47

Posted by Apache Jenkins Server <je...@builds.apache.org>.
See <https://builds.apache.org/job/HBase-1.1/47/changes>

Changes:

[tedyu] HBASE-12783 Addendum removes extraneous import

------------------------------------------
[...truncated 2629 lines...]
	at java.util.TimerThread.run(Timer.java:505)

"LeaseRenewer:jenkins@localhost:41997" daemon prio=10 tid=0x00007fd2d0208800 nid=0x1de9 waiting on condition [0x00007fd2b42dd000]
   java.lang.Thread.State: TIMED_WAITING (sleeping)
	at java.lang.Thread.sleep(Native Method)
	at org.apache.hadoop.hdfs.LeaseRenewer.run(LeaseRenewer.java:438)
	at org.apache.hadoop.hdfs.LeaseRenewer.access$700(LeaseRenewer.java:71)
	at org.apache.hadoop.hdfs.LeaseRenewer$1.run(LeaseRenewer.java:298)
	at java.lang.Thread.run(Thread.java:745)

"Thread-773" prio=10 tid=0x00007fd2d9dc3000 nid=0x1d98 waiting on condition [0x00007fd2b851e000]
   java.lang.Thread.State: TIMED_WAITING (sleeping)
	at java.lang.Thread.sleep(Native Method)
	at org.apache.hadoop.test.GenericTestUtils.waitFor(GenericTestUtils.java:162)
	at org.apache.hadoop.hdfs.TestSafeMode.testInitializeReplQueuesEarly(TestSafeMode.java:213)
	at sun.reflect.NativeMethodAccessorImpl.invoke0(Native Method)
	at sun.reflect.NativeMethodAccessorImpl.invoke(NativeMethodAccessorImpl.java:57)
	at sun.reflect.DelegatingMethodAccessorImpl.invoke(DelegatingMethodAccessorImpl.java:43)
	at java.lang.reflect.Method.invoke(Method.java:606)
	at org.junit.runners.model.FrameworkMethod$1.runReflectiveCall(FrameworkMethod.java:47)
	at org.junit.internal.runners.model.ReflectiveCallable.run(ReflectiveCallable.java:12)
	at org.junit.runners.model.FrameworkMethod.invokeExplosively(FrameworkMethod.java:44)
	at org.junit.internal.runners.statements.InvokeMethod.evaluate(InvokeMethod.java:17)
	at org.junit.internal.runners.statements.FailOnTimeout$StatementThread.run(FailOnTimeout.java:74)

"IPC Parameter Sending Thread #1" daemon prio=10 tid=0x00007fd2d04ec000 nid=0x1d8a waiting on condition [0x00007fd2b8b25000]
   java.lang.Thread.State: TIMED_WAITING (parking)
	at sun.misc.Unsafe.park(Native Method)
	- parking to wait for  <0x00000007df0be450> (a java.util.concurrent.SynchronousQueue$TransferStack)
	at java.util.concurrent.locks.LockSupport.parkNanos(LockSupport.java:226)
	at java.util.concurrent.SynchronousQueue$TransferStack.awaitFulfill(SynchronousQueue.java:460)
	at java.util.concurrent.SynchronousQueue$TransferStack.transfer(SynchronousQueue.java:359)
	at java.util.concurrent.SynchronousQueue.poll(SynchronousQueue.java:942)
	at java.util.concurrent.ThreadPoolExecutor.getTask(ThreadPoolExecutor.java:1068)
	at java.util.concurrent.ThreadPoolExecutor.runWorker(ThreadPoolExecutor.java:1130)
	at java.util.concurrent.ThreadPoolExecutor$Worker.run(ThreadPoolExecutor.java:615)
	at java.lang.Thread.run(Thread.java:745)

"IPC Client (1687280596) connection to localhost/127.0.0.1:47559 from jenkins" daemon prio=10 tid=0x00007fd2d04c4000 nid=0x1cfd in Object.wait() [0x00007fd2b1db8000]
   java.lang.Thread.State: TIMED_WAITING (on object monitor)
	at java.lang.Object.wait(Native Method)
	- waiting on <0x00000007b5c6e960> (a org.apache.hadoop.ipc.Client$Connection)
	at org.apache.hadoop.ipc.Client$Connection.waitForWork(Client.java:920)
	- locked <0x00000007b5c6e960> (a org.apache.hadoop.ipc.Client$Connection)
	at org.apache.hadoop.ipc.Client$Connection.run(Client.java:965)

"IPC Client (1687280596) connection to localhost/127.0.0.1:47559 from jenkins" daemon prio=10 tid=0x00007fd2d8ac0000 nid=0x1ce0 in Object.wait() [0x00007fd2b8a24000]
   java.lang.Thread.State: TIMED_WAITING (on object monitor)
	at java.lang.Object.wait(Native Method)
	- waiting on <0x00000007b4f0f1b8> (a org.apache.hadoop.ipc.Client$Connection)
	at org.apache.hadoop.ipc.Client$Connection.waitForWork(Client.java:920)
	- locked <0x00000007b4f0f1b8> (a org.apache.hadoop.ipc.Client$Connection)
	at org.apache.hadoop.ipc.Client$Connection.run(Client.java:965)

"LeaseRenewer:jenkins@localhost:44891" daemon prio=10 tid=0x00007fd2d954f000 nid=0x1b29 waiting on condition [0x00007fd2b8c26000]
   java.lang.Thread.State: TIMED_WAITING (sleeping)
	at java.lang.Thread.sleep(Native Method)
	at org.apache.hadoop.hdfs.LeaseRenewer.run(LeaseRenewer.java:438)
	at org.apache.hadoop.hdfs.LeaseRenewer.access$700(LeaseRenewer.java:71)
	at org.apache.hadoop.hdfs.LeaseRenewer$1.run(LeaseRenewer.java:298)
	at java.lang.Thread.run(Thread.java:745)

"LeaseRenewer:jenkins@localhost:44341" daemon prio=10 tid=0x00007fd2d8381800 nid=0x1968 waiting on condition [0x00007fd2b16b1000]
   java.lang.Thread.State: TIMED_WAITING (sleeping)
	at java.lang.Thread.sleep(Native Method)
	at org.apache.hadoop.hdfs.LeaseRenewer.run(LeaseRenewer.java:438)
	at org.apache.hadoop.hdfs.LeaseRenewer.access$700(LeaseRenewer.java:71)
	at org.apache.hadoop.hdfs.LeaseRenewer$1.run(LeaseRenewer.java:298)
	at java.lang.Thread.run(Thread.java:745)

"LeaseRenewer:jenkins@localhost:43235" daemon prio=10 tid=0x00007fd2d8a13800 nid=0x1888 waiting on condition [0x00007fd2b831d000]
   java.lang.Thread.State: TIMED_WAITING (sleeping)
	at java.lang.Thread.sleep(Native Method)
	at org.apache.hadoop.hdfs.LeaseRenewer.run(LeaseRenewer.java:438)
	at org.apache.hadoop.hdfs.LeaseRenewer.access$700(LeaseRenewer.java:71)
	at org.apache.hadoop.hdfs.LeaseRenewer$1.run(LeaseRenewer.java:298)
	at java.lang.Thread.run(Thread.java:745)

"org.apache.hadoop.hdfs.PeerCache@62293051" daemon prio=10 tid=0x00007fd2d9ede800 nid=0x1661 waiting on condition [0x00007fd2ba13b000]
   java.lang.Thread.State: TIMED_WAITING (sleeping)
	at java.lang.Thread.sleep(Native Method)
	at org.apache.hadoop.hdfs.PeerCache.run(PeerCache.java:250)
	at org.apache.hadoop.hdfs.PeerCache.access$000(PeerCache.java:41)
	at org.apache.hadoop.hdfs.PeerCache$1.run(PeerCache.java:119)
	at java.lang.Thread.run(Thread.java:745)

"LeaseRenewer:jenkins@localhost:50379" daemon prio=10 tid=0x00007fd2d9f1a000 nid=0x163c waiting on condition [0x00007fd2ba23c000]
   java.lang.Thread.State: TIMED_WAITING (sleeping)
	at java.lang.Thread.sleep(Native Method)
	at org.apache.hadoop.hdfs.LeaseRenewer.run(LeaseRenewer.java:438)
	at org.apache.hadoop.hdfs.LeaseRenewer.access$700(LeaseRenewer.java:71)
	at org.apache.hadoop.hdfs.LeaseRenewer$1.run(LeaseRenewer.java:298)
	at java.lang.Thread.run(Thread.java:745)

"process reaper" daemon prio=10 tid=0x00007fd2c8052000 nid=0x1634 waiting on condition [0x00007fd2cc09f000]
   java.lang.Thread.State: TIMED_WAITING (parking)
	at sun.misc.Unsafe.park(Native Method)
	- parking to wait for  <0x00000007058a2658> (a java.util.concurrent.SynchronousQueue$TransferStack)
	at java.util.concurrent.locks.LockSupport.parkNanos(LockSupport.java:226)
	at java.util.concurrent.SynchronousQueue$TransferStack.awaitFulfill(SynchronousQueue.java:460)
	at java.util.concurrent.SynchronousQueue$TransferStack.transfer(SynchronousQueue.java:359)
	at java.util.concurrent.SynchronousQueue.poll(SynchronousQueue.java:942)
	at java.util.concurrent.ThreadPoolExecutor.getTask(ThreadPoolExecutor.java:1068)
	at java.util.concurrent.ThreadPoolExecutor.runWorker(ThreadPoolExecutor.java:1130)
	at java.util.concurrent.ThreadPoolExecutor$Worker.run(ThreadPoolExecutor.java:615)
	at java.lang.Thread.run(Thread.java:745)

"Thread-58" daemon prio=10 tid=0x00007fd2d9c82000 nid=0x162a runnable [0x00007fd2ba741000]
   java.lang.Thread.State: RUNNABLE
	at org.apache.hadoop.net.unix.DomainSocketWatcher.doPoll0(Native Method)
	at org.apache.hadoop.net.unix.DomainSocketWatcher.access$900(DomainSocketWatcher.java:52)
	at org.apache.hadoop.net.unix.DomainSocketWatcher$1.run(DomainSocketWatcher.java:474)
	at java.lang.Thread.run(Thread.java:745)

"IPC Parameter Sending Thread #0" daemon prio=10 tid=0x0000000002658800 nid=0x1629 waiting on condition [0x00007fd2ba842000]
   java.lang.Thread.State: TIMED_WAITING (parking)
	at sun.misc.Unsafe.park(Native Method)
	- parking to wait for  <0x00000007df0be450> (a java.util.concurrent.SynchronousQueue$TransferStack)
	at java.util.concurrent.locks.LockSupport.parkNanos(LockSupport.java:226)
	at java.util.concurrent.SynchronousQueue$TransferStack.awaitFulfill(SynchronousQueue.java:460)
	at java.util.concurrent.SynchronousQueue$TransferStack.transfer(SynchronousQueue.java:359)
	at java.util.concurrent.SynchronousQueue.poll(SynchronousQueue.java:942)
	at java.util.concurrent.ThreadPoolExecutor.getTask(ThreadPoolExecutor.java:1068)
	at java.util.concurrent.ThreadPoolExecutor.runWorker(ThreadPoolExecutor.java:1130)
	at java.util.concurrent.ThreadPoolExecutor$Worker.run(ThreadPoolExecutor.java:615)
	at java.lang.Thread.run(Thread.java:745)

"process reaper" daemon prio=10 tid=0x00007fd2d8ce8000 nid=0x15c0 waiting on condition [0x00007fd2cc0e6000]
   java.lang.Thread.State: TIMED_WAITING (parking)
	at sun.misc.Unsafe.park(Native Method)
	- parking to wait for  <0x00000007058a2658> (a java.util.concurrent.SynchronousQueue$TransferStack)
	at java.util.concurrent.locks.LockSupport.parkNanos(LockSupport.java:226)
	at java.util.concurrent.SynchronousQueue$TransferStack.awaitFulfill(SynchronousQueue.java:460)
	at java.util.concurrent.SynchronousQueue$TransferStack.transfer(SynchronousQueue.java:359)
	at java.util.concurrent.SynchronousQueue.poll(SynchronousQueue.java:942)
	at java.util.concurrent.ThreadPoolExecutor.getTask(ThreadPoolExecutor.java:1068)
	at java.util.concurrent.ThreadPoolExecutor.runWorker(ThreadPoolExecutor.java:1130)
	at java.util.concurrent.ThreadPoolExecutor$Worker.run(ThreadPoolExecutor.java:615)
	at java.lang.Thread.run(Thread.java:745)

"Service Thread" daemon prio=10 tid=0x00007fd2d8296800 nid=0x1598 runnable [0x0000000000000000]
   java.lang.Thread.State: RUNNABLE

"C2 CompilerThread1" daemon prio=10 tid=0x00007fd2d8294000 nid=0x1597 waiting on condition [0x0000000000000000]
   java.lang.Thread.State: RUNNABLE

"C2 CompilerThread0" daemon prio=10 tid=0x00007fd2d8291800 nid=0x1596 waiting on condition [0x0000000000000000]
   java.lang.Thread.State: RUNNABLE

"Signal Dispatcher" daemon prio=10 tid=0x00007fd2d8287000 nid=0x1595 runnable [0x0000000000000000]
   java.lang.Thread.State: RUNNABLE

"Finalizer" daemon prio=10 tid=0x00007fd2d8270800 nid=0x1594 in Object.wait() [0x00007fd2cd3d2000]
   java.lang.Thread.State: WAITING (on object monitor)
	at java.lang.Object.wait(Native Method)
	- waiting on <0x00000007058a2e20> (a java.lang.ref.ReferenceQueue$Lock)
	at java.lang.ref.ReferenceQueue.remove(ReferenceQueue.java:135)
	- locked <0x00000007058a2e20> (a java.lang.ref.ReferenceQueue$Lock)
	at java.lang.ref.ReferenceQueue.remove(ReferenceQueue.java:151)
	at java.lang.ref.Finalizer$FinalizerThread.run(Finalizer.java:189)

"Reference Handler" daemon prio=10 tid=0x00007fd2d8267000 nid=0x1593 in Object.wait() [0x00007fd2cd4d3000]
   java.lang.Thread.State: WAITING (on object monitor)
	at java.lang.Object.wait(Native Method)
	- waiting on <0x00000007058b82f8> (a java.lang.ref.Reference$Lock)
	at java.lang.Object.wait(Object.java:503)
	at java.lang.ref.Reference$ReferenceHandler.run(Reference.java:133)
	- locked <0x00000007058b82f8> (a java.lang.ref.Reference$Lock)

"main" prio=10 tid=0x00007fd2d800a000 nid=0x1584 in Object.wait() [0x00007fd2e08e2000]
   java.lang.Thread.State: TIMED_WAITING (on object monitor)
	at java.lang.Object.wait(Native Method)
	- waiting on <0x00000007c088b4b8> (a org.junit.internal.runners.statements.FailOnTimeout$StatementThread)
	at java.lang.Thread.join(Thread.java:1289)
	- locked <0x00000007c088b4b8> (a org.junit.internal.runners.statements.FailOnTimeout$StatementThread)
	at org.junit.internal.runners.statements.FailOnTimeout.evaluateStatement(FailOnTimeout.java:26)
	at org.junit.internal.runners.statements.FailOnTimeout.evaluate(FailOnTimeout.java:17)
	at org.junit.internal.runners.statements.RunBefores.evaluate(RunBefores.java:26)
	at org.junit.internal.runners.statements.RunAfters.evaluate(RunAfters.java:27)
	at org.junit.runners.ParentRunner.runLeaf(ParentRunner.java:271)
	at org.junit.runners.BlockJUnit4ClassRunner.runChild(BlockJUnit4ClassRunner.java:70)
	at org.junit.runners.BlockJUnit4ClassRunner.runChild(BlockJUnit4ClassRunner.java:50)
	at org.junit.runners.ParentRunner$3.run(ParentRunner.java:238)
	at org.junit.runners.ParentRunner$1.schedule(ParentRunner.java:63)
	at org.junit.runners.ParentRunner.runChildren(ParentRunner.java:236)
	at org.junit.runners.ParentRunner.access$000(ParentRunner.java:53)
	at org.junit.runners.ParentRunner$2.evaluate(ParentRunner.java:229)
	at org.junit.runners.ParentRunner.run(ParentRunner.java:309)
	at org.apache.maven.surefire.junit4.JUnit4Provider.execute(JUnit4Provider.java:264)
	at org.apache.maven.surefire.junit4.JUnit4Provider.executeTestSet(JUnit4Provider.java:153)
	at org.apache.maven.surefire.junit4.JUnit4Provider.invoke(JUnit4Provider.java:124)
	at org.apache.maven.surefire.booter.ForkedBooter.invokeProviderInSameClassLoader(ForkedBooter.java:200)
	at org.apache.maven.surefire.booter.ForkedBooter.runSuitesInProcess(ForkedBooter.java:153)
	at org.apache.maven.surefire.booter.ForkedBooter.main(ForkedBooter.java:103)

"VM Thread" prio=10 tid=0x00007fd2d8264800 nid=0x1592 runnable 

"GC task thread#0 (ParallelGC)" prio=10 tid=0x00007fd2d8020000 nid=0x1585 runnable 

"GC task thread#1 (ParallelGC)" prio=10 tid=0x00007fd2d8022000 nid=0x1586 runnable 

"GC task thread#2 (ParallelGC)" prio=10 tid=0x00007fd2d8023800 nid=0x1587 runnable 

"GC task thread#3 (ParallelGC)" prio=10 tid=0x00007fd2d8025800 nid=0x1588 runnable 

"GC task thread#4 (ParallelGC)" prio=10 tid=0x00007fd2d8027800 nid=0x1589 runnable 

"GC task thread#5 (ParallelGC)" prio=10 tid=0x00007fd2d8029800 nid=0x158a runnable 

"GC task thread#6 (ParallelGC)" prio=10 tid=0x00007fd2d802b000 nid=0x158b runnable 

"GC task thread#7 (ParallelGC)" prio=10 tid=0x00007fd2d802d000 nid=0x158c runnable 

"GC task thread#8 (ParallelGC)" prio=10 tid=0x00007fd2d802f000 nid=0x158d runnable 

"GC task thread#9 (ParallelGC)" prio=10 tid=0x00007fd2d8030800 nid=0x158e runnable 

"GC task thread#10 (ParallelGC)" prio=10 tid=0x00007fd2d8032800 nid=0x158f runnable 

"GC task thread#11 (ParallelGC)" prio=10 tid=0x00007fd2d8034800 nid=0x1590 runnable 

"GC task thread#12 (ParallelGC)" prio=10 tid=0x00007fd2d8036800 nid=0x1591 runnable 

"VM Periodic Task Thread" prio=10 tid=0x00007fd2d82a1000 nid=0x1599 waiting on condition 

JNI global references: 243

+ echo '************ END  zombies jstack extract'
************ END  zombies jstack extract
+ JIRA_COMMENT='

     {color:red}-1 core zombie tests{color}.  There are 1 zombie test(s): 	at org.apache.hadoop.test.GenericTestUtils.waitFor(GenericTestUtils.java:162)
	at org.apache.hadoop.hdfs.TestSafeMode.testInitializeReplQueuesEarly(TestSafeMode.java:213)'
+ BAD=1
+ jps
+ grep surefirebooter
+ cut -d ' ' -f 1
+ xargs kill -9
POST BUILD TASK : SUCCESS
END OF POST BUILD TASK : 0
Archiving artifacts
Sending artifact delta relative to HBase-1.1 #38
Archived 1836 artifacts
Archive block size is 32768
Received 26 blocks and 409729984 bytes
Compression is 0.2%
Took 1 min 44 sec
Recording test results
Updating HBASE-12783

Build failed in Jenkins: HBase-1.1 #46

Posted by Apache Jenkins Server <je...@builds.apache.org>.
See <https://builds.apache.org/job/HBase-1.1/46/changes>

Changes:

[tedyu] HBASE-12783 Create efficient RegionLocator implementation (Solomon Duskis)

------------------------------------------
[...truncated 749 lines...]
[INFO] 
[INFO] --- maven-surefire-plugin:2.18:test (secondPartTestsExecution) @ hbase-prefix-tree ---
[INFO] Tests are skipped.
[INFO] 
[INFO] --- jacoco-maven-plugin:0.6.2.201302030002:report (report) @ hbase-prefix-tree ---
[INFO] Skipping JaCoCo execution
[INFO] 
[INFO] --- maven-source-plugin:2.2.1:jar-no-fork (attach-sources) @ hbase-prefix-tree ---
[INFO] Building jar: <https://builds.apache.org/job/HBase-1.1/ws/hbase-prefix-tree/target/hbase-prefix-tree-1.1.0-SNAPSHOT-sources.jar>
[INFO] 
[INFO] --- maven-jar-plugin:2.4:test-jar (default) @ hbase-prefix-tree ---
[INFO] Building jar: <https://builds.apache.org/job/HBase-1.1/ws/hbase-prefix-tree/target/hbase-prefix-tree-1.1.0-SNAPSHOT-tests.jar>
[INFO] 
[INFO] --- maven-jar-plugin:2.4:jar (default-jar) @ hbase-prefix-tree ---
[INFO] Building jar: <https://builds.apache.org/job/HBase-1.1/ws/hbase-prefix-tree/target/hbase-prefix-tree-1.1.0-SNAPSHOT.jar>
[INFO] 
[INFO] --- maven-install-plugin:2.3.1:install (default-install) @ hbase-prefix-tree ---
[INFO] Installing <https://builds.apache.org/job/HBase-1.1/ws/hbase-prefix-tree/target/hbase-prefix-tree-1.1.0-SNAPSHOT.jar> to /home/jenkins/.m2/repository/org/apache/hbase/hbase-prefix-tree/1.1.0-SNAPSHOT/hbase-prefix-tree-1.1.0-SNAPSHOT.jar
[INFO] Installing <https://builds.apache.org/job/HBase-1.1/ws/hbase-prefix-tree/pom.xml> to /home/jenkins/.m2/repository/org/apache/hbase/hbase-prefix-tree/1.1.0-SNAPSHOT/hbase-prefix-tree-1.1.0-SNAPSHOT.pom
[INFO] Installing <https://builds.apache.org/job/HBase-1.1/ws/hbase-prefix-tree/target/hbase-prefix-tree-1.1.0-SNAPSHOT-sources.jar> to /home/jenkins/.m2/repository/org/apache/hbase/hbase-prefix-tree/1.1.0-SNAPSHOT/hbase-prefix-tree-1.1.0-SNAPSHOT-sources.jar
[INFO] Installing <https://builds.apache.org/job/HBase-1.1/ws/hbase-prefix-tree/target/hbase-prefix-tree-1.1.0-SNAPSHOT-tests.jar> to /home/jenkins/.m2/repository/org/apache/hbase/hbase-prefix-tree/1.1.0-SNAPSHOT/hbase-prefix-tree-1.1.0-SNAPSHOT-tests.jar
[INFO]                                                                         
[INFO] ------------------------------------------------------------------------
[INFO] Building HBase - Server 1.1.0-SNAPSHOT
[INFO] ------------------------------------------------------------------------
[INFO] 
[INFO] --- maven-enforcer-plugin:1.0.1:enforce (enforce) @ hbase-server ---
[INFO] 
[INFO] --- jacoco-maven-plugin:0.6.2.201302030002:prepare-agent (prepare-agent) @ hbase-server ---
[INFO] Skipping JaCoCo execution
[INFO] argLine set to 
[INFO] 
[INFO] --- maven-antrun-plugin:1.6:run (generate) @ hbase-server ---
[INFO] Executing tasks

main:
    [mkdir] Created dir: <https://builds.apache.org/job/HBase-1.1/ws/hbase-server/target/hbase-webapps>
     [copy] Copying 20 files to <https://builds.apache.org/job/HBase-1.1/ws/hbase-server/target/hbase-webapps>
log4j:WARN No appenders could be found for logger (org.mortbay.log).
log4j:WARN Please initialize the log4j system properly.
log4j:WARN See http://logging.apache.org/log4j/1.2/faq.html#noconfig for more info.
    [mkdir] Created dir: <https://builds.apache.org/job/HBase-1.1/ws/hbase-server/target/hbase-webapps/master/WEB-INF>
    [mkdir] Created dir: <https://builds.apache.org/job/HBase-1.1/ws/hbase-server/target/hbase-webapps/regionserver/WEB-INF>
[INFO] Executed tasks
[INFO] 
[INFO] --- build-helper-maven-plugin:1.9.1:add-source (jspcSource-packageInfo-source) @ hbase-server ---
[INFO] Source directory: <https://builds.apache.org/job/HBase-1.1/ws/hbase-server/target/generated-jamon> added.
[INFO] Source directory: <https://builds.apache.org/job/HBase-1.1/ws/hbase-server/target/generated-sources/java> added.
[INFO] 
[INFO] --- jamon-maven-plugin:2.3.4:translate (default) @ hbase-server ---
[INFO] Translating 10 templates from <https://builds.apache.org/job/HBase-1.1/ws/hbase-server/src/main/jamon> to <https://builds.apache.org/job/HBase-1.1/ws/hbase-server/target/generated-jamon>
[INFO] 
[INFO] --- maven-remote-resources-plugin:1.4:process (default) @ hbase-server ---
[INFO] 
[INFO] --- maven-resources-plugin:2.6:resources (default-resources) @ hbase-server ---
[INFO] Using 'UTF-8' encoding to copy filtered resources.
[INFO] Copying 22 resources
[INFO] Copying 3 resources
[INFO] 
[INFO] --- maven-compiler-plugin:2.5.1:compile (default-compile) @ hbase-server ---
[INFO] Compiling 715 source files to <https://builds.apache.org/job/HBase-1.1/ws/hbase-server/target/classes>
[INFO] 
[INFO] --- maven-dependency-plugin:2.1:build-classpath (create-mrapp-generated-classpath) @ hbase-server ---
[INFO] Wrote classpath file '<https://builds.apache.org/job/HBase-1.1/ws/hbase-server/target/test-classes/mrapp-generated-classpath'.>
[INFO] 
[INFO] --- maven-resources-plugin:2.6:testResources (default-testResources) @ hbase-server ---
[INFO] Using 'UTF-8' encoding to copy filtered resources.
[INFO] Copying 12 resources
[INFO] Copying 3 resources
[INFO] 
[INFO] --- maven-compiler-plugin:2.5.1:testCompile (default-testCompile) @ hbase-server ---
[INFO] Compiling 647 source files to <https://builds.apache.org/job/HBase-1.1/ws/hbase-server/target/test-classes>
[INFO] -------------------------------------------------------------
[ERROR] COMPILATION ERROR : 
[INFO] -------------------------------------------------------------
[ERROR] <https://builds.apache.org/job/HBase-1.1/ws/hbase-server/src/test/java/org/apache/hadoop/hbase/mapreduce/TestHFileOutputFormat.java>:[57,30] error: cannot find symbol
[ERROR]   symbol:   class TableDescriptor
  location: package org.apache.hadoop.hbase
<https://builds.apache.org/job/HBase-1.1/ws/hbase-server/src/test/java/org/apache/hadoop/hbase/http/ssl/KeyStoreTestUtil.java>:[46,24] AlgorithmId is internal proprietary API and may be removed in a future release
[ERROR] <https://builds.apache.org/job/HBase-1.1/ws/hbase-server/src/test/java/org/apache/hadoop/hbase/http/ssl/KeyStoreTestUtil.java>:[47,24] CertificateAlgorithmId is internal proprietary API and may be removed in a future release
[ERROR] <https://builds.apache.org/job/HBase-1.1/ws/hbase-server/src/test/java/org/apache/hadoop/hbase/http/ssl/KeyStoreTestUtil.java>:[48,24] CertificateIssuerName is internal proprietary API and may be removed in a future release
[ERROR] <https://builds.apache.org/job/HBase-1.1/ws/hbase-server/src/test/java/org/apache/hadoop/hbase/http/ssl/KeyStoreTestUtil.java>:[49,24] CertificateSerialNumber is internal proprietary API and may be removed in a future release
[ERROR] <https://builds.apache.org/job/HBase-1.1/ws/hbase-server/src/test/java/org/apache/hadoop/hbase/http/ssl/KeyStoreTestUtil.java>:[50,24] CertificateSubjectName is internal proprietary API and may be removed in a future release
[ERROR] <https://builds.apache.org/job/HBase-1.1/ws/hbase-server/src/test/java/org/apache/hadoop/hbase/http/ssl/KeyStoreTestUtil.java>:[51,24] CertificateValidity is internal proprietary API and may be removed in a future release
[ERROR] <https://builds.apache.org/job/HBase-1.1/ws/hbase-server/src/test/java/org/apache/hadoop/hbase/http/ssl/KeyStoreTestUtil.java>:[52,24] CertificateVersion is internal proprietary API and may be removed in a future release
[ERROR] <https://builds.apache.org/job/HBase-1.1/ws/hbase-server/src/test/java/org/apache/hadoop/hbase/http/ssl/KeyStoreTestUtil.java>:[53,24] CertificateX509Key is internal proprietary API and may be removed in a future release
[ERROR] <https://builds.apache.org/job/HBase-1.1/ws/hbase-server/src/test/java/org/apache/hadoop/hbase/http/ssl/KeyStoreTestUtil.java>:[54,24] X500Name is internal proprietary API and may be removed in a future release
[ERROR] <https://builds.apache.org/job/HBase-1.1/ws/hbase-server/src/test/java/org/apache/hadoop/hbase/http/ssl/KeyStoreTestUtil.java>:[55,24] X509CertImpl is internal proprietary API and may be removed in a future release
[ERROR] <https://builds.apache.org/job/HBase-1.1/ws/hbase-server/src/test/java/org/apache/hadoop/hbase/http/ssl/KeyStoreTestUtil.java>:[56,24] X509CertInfo is internal proprietary API and may be removed in a future release
[ERROR] <https://builds.apache.org/job/HBase-1.1/ws/hbase-server/src/test/java/org/apache/hadoop/hbase/http/ssl/KeyStoreTestUtil.java>:[85,4] X509CertInfo is internal proprietary API and may be removed in a future release
[ERROR] <https://builds.apache.org/job/HBase-1.1/ws/hbase-server/src/test/java/org/apache/hadoop/hbase/http/ssl/KeyStoreTestUtil.java>:[85,28] X509CertInfo is internal proprietary API and may be removed in a future release
[ERROR] <https://builds.apache.org/job/HBase-1.1/ws/hbase-server/src/test/java/org/apache/hadoop/hbase/http/ssl/KeyStoreTestUtil.java>:[88,4] CertificateValidity is internal proprietary API and may be removed in a future release
[ERROR] <https://builds.apache.org/job/HBase-1.1/ws/hbase-server/src/test/java/org/apache/hadoop/hbase/http/ssl/KeyStoreTestUtil.java>:[88,39] CertificateValidity is internal proprietary API and may be removed in a future release
[ERROR] <https://builds.apache.org/job/HBase-1.1/ws/hbase-server/src/test/java/org/apache/hadoop/hbase/http/ssl/KeyStoreTestUtil.java>:[90,4] X500Name is internal proprietary API and may be removed in a future release
[ERROR] <https://builds.apache.org/job/HBase-1.1/ws/hbase-server/src/test/java/org/apache/hadoop/hbase/http/ssl/KeyStoreTestUtil.java>:[90,25] X500Name is internal proprietary API and may be removed in a future release
[ERROR] <https://builds.apache.org/job/HBase-1.1/ws/hbase-server/src/test/java/org/apache/hadoop/hbase/http/ssl/KeyStoreTestUtil.java>:[92,13] X509CertInfo is internal proprietary API and may be removed in a future release
[ERROR] <https://builds.apache.org/job/HBase-1.1/ws/hbase-server/src/test/java/org/apache/hadoop/hbase/http/ssl/KeyStoreTestUtil.java>:[93,13] X509CertInfo is internal proprietary API and may be removed in a future release
[ERROR] <https://builds.apache.org/job/HBase-1.1/ws/hbase-server/src/test/java/org/apache/hadoop/hbase/http/ssl/KeyStoreTestUtil.java>:[93,45] CertificateSerialNumber is internal proprietary API and may be removed in a future release
[ERROR] <https://builds.apache.org/job/HBase-1.1/ws/hbase-server/src/test/java/org/apache/hadoop/hbase/http/ssl/KeyStoreTestUtil.java>:[94,13] X509CertInfo is internal proprietary API and may be removed in a future release
[ERROR] <https://builds.apache.org/job/HBase-1.1/ws/hbase-server/src/test/java/org/apache/hadoop/hbase/http/ssl/KeyStoreTestUtil.java>:[94,39] CertificateSubjectName is internal proprietary API and may be removed in a future release
[ERROR] <https://builds.apache.org/job/HBase-1.1/ws/hbase-server/src/test/java/org/apache/hadoop/hbase/http/ssl/KeyStoreTestUtil.java>:[95,13] X509CertInfo is internal proprietary API and may be removed in a future release
[ERROR] <https://builds.apache.org/job/HBase-1.1/ws/hbase-server/src/test/java/org/apache/hadoop/hbase/http/ssl/KeyStoreTestUtil.java>:[95,38] CertificateIssuerName is internal proprietary API and may be removed in a future release
[ERROR] <https://builds.apache.org/job/HBase-1.1/ws/hbase-server/src/test/java/org/apache/hadoop/hbase/http/ssl/KeyStoreTestUtil.java>:[96,13] X509CertInfo is internal proprietary API and may be removed in a future release
[ERROR] <https://builds.apache.org/job/HBase-1.1/ws/hbase-server/src/test/java/org/apache/hadoop/hbase/http/ssl/KeyStoreTestUtil.java>:[96,35] CertificateX509Key is internal proprietary API and may be removed in a future release
[ERROR] <https://builds.apache.org/job/HBase-1.1/ws/hbase-server/src/test/java/org/apache/hadoop/hbase/http/ssl/KeyStoreTestUtil.java>:[98,11] X509CertInfo is internal proprietary API and may be removed in a future release
[ERROR] <https://builds.apache.org/job/HBase-1.1/ws/hbase-server/src/test/java/org/apache/hadoop/hbase/http/ssl/KeyStoreTestUtil.java>:[98,37] CertificateVersion is internal proprietary API and may be removed in a future release
[ERROR] <https://builds.apache.org/job/HBase-1.1/ws/hbase-server/src/test/java/org/apache/hadoop/hbase/http/ssl/KeyStoreTestUtil.java>:[98,56] CertificateVersion is internal proprietary API and may be removed in a future release
[ERROR] <https://builds.apache.org/job/HBase-1.1/ws/hbase-server/src/test/java/org/apache/hadoop/hbase/http/ssl/KeyStoreTestUtil.java>:[99,4] AlgorithmId is internal proprietary API and may be removed in a future release
[ERROR] <https://builds.apache.org/job/HBase-1.1/ws/hbase-server/src/test/java/org/apache/hadoop/hbase/http/ssl/KeyStoreTestUtil.java>:[99,27] AlgorithmId is internal proprietary API and may be removed in a future release
[ERROR] <https://builds.apache.org/job/HBase-1.1/ws/hbase-server/src/test/java/org/apache/hadoop/hbase/http/ssl/KeyStoreTestUtil.java>:[99,39] AlgorithmId is internal proprietary API and may be removed in a future release
[ERROR] <https://builds.apache.org/job/HBase-1.1/ws/hbase-server/src/test/java/org/apache/hadoop/hbase/http/ssl/KeyStoreTestUtil.java>:[100,13] X509CertInfo is internal proprietary API and may be removed in a future release
[ERROR] <https://builds.apache.org/job/HBase-1.1/ws/hbase-server/src/test/java/org/apache/hadoop/hbase/http/ssl/KeyStoreTestUtil.java>:[100,44] CertificateAlgorithmId is internal proprietary API and may be removed in a future release
[ERROR] <https://builds.apache.org/job/HBase-1.1/ws/hbase-server/src/test/java/org/apache/hadoop/hbase/http/ssl/KeyStoreTestUtil.java>:[103,4] X509CertImpl is internal proprietary API and may be removed in a future release
[ERROR] <https://builds.apache.org/job/HBase-1.1/ws/hbase-server/src/test/java/org/apache/hadoop/hbase/http/ssl/KeyStoreTestUtil.java>:[103,28] X509CertImpl is internal proprietary API and may be removed in a future release
[ERROR] <https://builds.apache.org/job/HBase-1.1/ws/hbase-server/src/test/java/org/apache/hadoop/hbase/http/ssl/KeyStoreTestUtil.java>:[107,12] AlgorithmId is internal proprietary API and may be removed in a future release
[ERROR] <https://builds.apache.org/job/HBase-1.1/ws/hbase-server/src/test/java/org/apache/hadoop/hbase/http/ssl/KeyStoreTestUtil.java>:[107,34] X509CertImpl is internal proprietary API and may be removed in a future release
[ERROR] <https://builds.apache.org/job/HBase-1.1/ws/hbase-server/src/test/java/org/apache/hadoop/hbase/http/ssl/KeyStoreTestUtil.java>:[109,11] CertificateAlgorithmId is internal proprietary API and may be removed in a future release
[ERROR] <https://builds.apache.org/job/HBase-1.1/ws/hbase-server/src/test/java/org/apache/hadoop/hbase/http/ssl/KeyStoreTestUtil.java>:[109,47] CertificateAlgorithmId is internal proprietary API and may be removed in a future release
[ERROR] <https://builds.apache.org/job/HBase-1.1/ws/hbase-server/src/test/java/org/apache/hadoop/hbase/http/ssl/KeyStoreTestUtil.java>:[111,15] X509CertImpl is internal proprietary API and may be removed in a future release
[INFO] 42 errors 
[INFO] -------------------------------------------------------------
[INFO] ------------------------------------------------------------------------
[INFO] Reactor Summary:
[INFO] 
[INFO] HBase ............................................. SUCCESS [2.986s]
[INFO] HBase - Checkstyle ................................ SUCCESS [0.663s]
[INFO] HBase - Annotations ............................... SUCCESS [0.810s]
[INFO] HBase - Common .................................... SUCCESS [59.582s]
[INFO] HBase - Protocol .................................. SUCCESS [8.895s]
[INFO] HBase - Client .................................... SUCCESS [1:12.569s]
[INFO] HBase - Hadoop Compatibility ...................... SUCCESS [6.985s]
[INFO] HBase - Hadoop Two Compatibility .................. SUCCESS [5.998s]
[INFO] HBase - Prefix Tree ............................... SUCCESS [8.227s]
[INFO] HBase - Server .................................... FAILURE [9.662s]
[INFO] HBase - Testing Util .............................. SKIPPED
[INFO] HBase - Thrift .................................... SKIPPED
[INFO] HBase - Rest ...................................... SKIPPED
[INFO] HBase - Shell ..................................... SKIPPED
[INFO] HBase - Integration Tests ......................... SKIPPED
[INFO] HBase - Examples .................................. SKIPPED
[INFO] HBase - Assembly .................................. SKIPPED
[INFO] ------------------------------------------------------------------------
[INFO] BUILD FAILURE
[INFO] ------------------------------------------------------------------------
[INFO] Total time: 2:57.169s
[INFO] Finished at: Sat Jan 03 04:29:13 UTC 2015
[INFO] Final Memory: 82M/1148M
[INFO] ------------------------------------------------------------------------
[ERROR] Failed to execute goal org.apache.maven.plugins:maven-compiler-plugin:2.5.1:testCompile (default-testCompile) on project hbase-server: Compilation failure: Compilation failure:
[ERROR] <https://builds.apache.org/job/HBase-1.1/ws/hbase-server/src/test/java/org/apache/hadoop/hbase/mapreduce/TestHFileOutputFormat.java>:[57,30] error: cannot find symbol
[ERROR] symbol:   class TableDescriptor
[ERROR] location: package org.apache.hadoop.hbase
[ERROR] <https://builds.apache.org/job/HBase-1.1/ws/hbase-server/src/test/java/org/apache/hadoop/hbase/http/ssl/KeyStoreTestUtil.java>:[46,24] AlgorithmId is internal proprietary API and may be removed in a future release
[ERROR] <https://builds.apache.org/job/HBase-1.1/ws/hbase-server/src/test/java/org/apache/hadoop/hbase/http/ssl/KeyStoreTestUtil.java>:[47,24] CertificateAlgorithmId is internal proprietary API and may be removed in a future release
[ERROR] <https://builds.apache.org/job/HBase-1.1/ws/hbase-server/src/test/java/org/apache/hadoop/hbase/http/ssl/KeyStoreTestUtil.java>:[48,24] CertificateIssuerName is internal proprietary API and may be removed in a future release
[ERROR] <https://builds.apache.org/job/HBase-1.1/ws/hbase-server/src/test/java/org/apache/hadoop/hbase/http/ssl/KeyStoreTestUtil.java>:[49,24] CertificateSerialNumber is internal proprietary API and may be removed in a future release
[ERROR] <https://builds.apache.org/job/HBase-1.1/ws/hbase-server/src/test/java/org/apache/hadoop/hbase/http/ssl/KeyStoreTestUtil.java>:[50,24] CertificateSubjectName is internal proprietary API and may be removed in a future release
[ERROR] <https://builds.apache.org/job/HBase-1.1/ws/hbase-server/src/test/java/org/apache/hadoop/hbase/http/ssl/KeyStoreTestUtil.java>:[51,24] CertificateValidity is internal proprietary API and may be removed in a future release
[ERROR] <https://builds.apache.org/job/HBase-1.1/ws/hbase-server/src/test/java/org/apache/hadoop/hbase/http/ssl/KeyStoreTestUtil.java>:[52,24] CertificateVersion is internal proprietary API and may be removed in a future release
[ERROR] <https://builds.apache.org/job/HBase-1.1/ws/hbase-server/src/test/java/org/apache/hadoop/hbase/http/ssl/KeyStoreTestUtil.java>:[53,24] CertificateX509Key is internal proprietary API and may be removed in a future release
[ERROR] <https://builds.apache.org/job/HBase-1.1/ws/hbase-server/src/test/java/org/apache/hadoop/hbase/http/ssl/KeyStoreTestUtil.java>:[54,24] X500Name is internal proprietary API and may be removed in a future release
[ERROR] <https://builds.apache.org/job/HBase-1.1/ws/hbase-server/src/test/java/org/apache/hadoop/hbase/http/ssl/KeyStoreTestUtil.java>:[55,24] X509CertImpl is internal proprietary API and may be removed in a future release
[ERROR] <https://builds.apache.org/job/HBase-1.1/ws/hbase-server/src/test/java/org/apache/hadoop/hbase/http/ssl/KeyStoreTestUtil.java>:[56,24] X509CertInfo is internal proprietary API and may be removed in a future release
[ERROR] <https://builds.apache.org/job/HBase-1.1/ws/hbase-server/src/test/java/org/apache/hadoop/hbase/http/ssl/KeyStoreTestUtil.java>:[85,4] X509CertInfo is internal proprietary API and may be removed in a future release
[ERROR] <https://builds.apache.org/job/HBase-1.1/ws/hbase-server/src/test/java/org/apache/hadoop/hbase/http/ssl/KeyStoreTestUtil.java>:[85,28] X509CertInfo is internal proprietary API and may be removed in a future release
[ERROR] <https://builds.apache.org/job/HBase-1.1/ws/hbase-server/src/test/java/org/apache/hadoop/hbase/http/ssl/KeyStoreTestUtil.java>:[88,4] CertificateValidity is internal proprietary API and may be removed in a future release
[ERROR] <https://builds.apache.org/job/HBase-1.1/ws/hbase-server/src/test/java/org/apache/hadoop/hbase/http/ssl/KeyStoreTestUtil.java>:[88,39] CertificateValidity is internal proprietary API and may be removed in a future release
[ERROR] <https://builds.apache.org/job/HBase-1.1/ws/hbase-server/src/test/java/org/apache/hadoop/hbase/http/ssl/KeyStoreTestUtil.java>:[90,4] X500Name is internal proprietary API and may be removed in a future release
[ERROR] <https://builds.apache.org/job/HBase-1.1/ws/hbase-server/src/test/java/org/apache/hadoop/hbase/http/ssl/KeyStoreTestUtil.java>:[90,25] X500Name is internal proprietary API and may be removed in a future release
[ERROR] <https://builds.apache.org/job/HBase-1.1/ws/hbase-server/src/test/java/org/apache/hadoop/hbase/http/ssl/KeyStoreTestUtil.java>:[92,13] X509CertInfo is internal proprietary API and may be removed in a future release
[ERROR] <https://builds.apache.org/job/HBase-1.1/ws/hbase-server/src/test/java/org/apache/hadoop/hbase/http/ssl/KeyStoreTestUtil.java>:[93,13] X509CertInfo is internal proprietary API and may be removed in a future release
[ERROR] <https://builds.apache.org/job/HBase-1.1/ws/hbase-server/src/test/java/org/apache/hadoop/hbase/http/ssl/KeyStoreTestUtil.java>:[93,45] CertificateSerialNumber is internal proprietary API and may be removed in a future release
[ERROR] <https://builds.apache.org/job/HBase-1.1/ws/hbase-server/src/test/java/org/apache/hadoop/hbase/http/ssl/KeyStoreTestUtil.java>:[94,13] X509CertInfo is internal proprietary API and may be removed in a future release
[ERROR] <https://builds.apache.org/job/HBase-1.1/ws/hbase-server/src/test/java/org/apache/hadoop/hbase/http/ssl/KeyStoreTestUtil.java>:[94,39] CertificateSubjectName is internal proprietary API and may be removed in a future release
[ERROR] <https://builds.apache.org/job/HBase-1.1/ws/hbase-server/src/test/java/org/apache/hadoop/hbase/http/ssl/KeyStoreTestUtil.java>:[95,13] X509CertInfo is internal proprietary API and may be removed in a future release
[ERROR] <https://builds.apache.org/job/HBase-1.1/ws/hbase-server/src/test/java/org/apache/hadoop/hbase/http/ssl/KeyStoreTestUtil.java>:[95,38] CertificateIssuerName is internal proprietary API and may be removed in a future release
[ERROR] <https://builds.apache.org/job/HBase-1.1/ws/hbase-server/src/test/java/org/apache/hadoop/hbase/http/ssl/KeyStoreTestUtil.java>:[96,13] X509CertInfo is internal proprietary API and may be removed in a future release
[ERROR] <https://builds.apache.org/job/HBase-1.1/ws/hbase-server/src/test/java/org/apache/hadoop/hbase/http/ssl/KeyStoreTestUtil.java>:[96,35] CertificateX509Key is internal proprietary API and may be removed in a future release
[ERROR] <https://builds.apache.org/job/HBase-1.1/ws/hbase-server/src/test/java/org/apache/hadoop/hbase/http/ssl/KeyStoreTestUtil.java>:[98,11] X509CertInfo is internal proprietary API and may be removed in a future release
[ERROR] <https://builds.apache.org/job/HBase-1.1/ws/hbase-server/src/test/java/org/apache/hadoop/hbase/http/ssl/KeyStoreTestUtil.java>:[98,37] CertificateVersion is internal proprietary API and may be removed in a future release
[ERROR] <https://builds.apache.org/job/HBase-1.1/ws/hbase-server/src/test/java/org/apache/hadoop/hbase/http/ssl/KeyStoreTestUtil.java>:[98,56] CertificateVersion is internal proprietary API and may be removed in a future release
[ERROR] <https://builds.apache.org/job/HBase-1.1/ws/hbase-server/src/test/java/org/apache/hadoop/hbase/http/ssl/KeyStoreTestUtil.java>:[99,4] AlgorithmId is internal proprietary API and may be removed in a future release
[ERROR] <https://builds.apache.org/job/HBase-1.1/ws/hbase-server/src/test/java/org/apache/hadoop/hbase/http/ssl/KeyStoreTestUtil.java>:[99,27] AlgorithmId is internal proprietary API and may be removed in a future release
[ERROR] <https://builds.apache.org/job/HBase-1.1/ws/hbase-server/src/test/java/org/apache/hadoop/hbase/http/ssl/KeyStoreTestUtil.java>:[99,39] AlgorithmId is internal proprietary API and may be removed in a future release
[ERROR] <https://builds.apache.org/job/HBase-1.1/ws/hbase-server/src/test/java/org/apache/hadoop/hbase/http/ssl/KeyStoreTestUtil.java>:[100,13] X509CertInfo is internal proprietary API and may be removed in a future release
[ERROR] <https://builds.apache.org/job/HBase-1.1/ws/hbase-server/src/test/java/org/apache/hadoop/hbase/http/ssl/KeyStoreTestUtil.java>:[100,44] CertificateAlgorithmId is internal proprietary API and may be removed in a future release
[ERROR] <https://builds.apache.org/job/HBase-1.1/ws/hbase-server/src/test/java/org/apache/hadoop/hbase/http/ssl/KeyStoreTestUtil.java>:[103,4] X509CertImpl is internal proprietary API and may be removed in a future release
[ERROR] <https://builds.apache.org/job/HBase-1.1/ws/hbase-server/src/test/java/org/apache/hadoop/hbase/http/ssl/KeyStoreTestUtil.java>:[103,28] X509CertImpl is internal proprietary API and may be removed in a future release
[ERROR] <https://builds.apache.org/job/HBase-1.1/ws/hbase-server/src/test/java/org/apache/hadoop/hbase/http/ssl/KeyStoreTestUtil.java>:[107,12] AlgorithmId is internal proprietary API and may be removed in a future release
[ERROR] <https://builds.apache.org/job/HBase-1.1/ws/hbase-server/src/test/java/org/apache/hadoop/hbase/http/ssl/KeyStoreTestUtil.java>:[107,34] X509CertImpl is internal proprietary API and may be removed in a future release
[ERROR] <https://builds.apache.org/job/HBase-1.1/ws/hbase-server/src/test/java/org/apache/hadoop/hbase/http/ssl/KeyStoreTestUtil.java>:[109,11] CertificateAlgorithmId is internal proprietary API and may be removed in a future release
[ERROR] <https://builds.apache.org/job/HBase-1.1/ws/hbase-server/src/test/java/org/apache/hadoop/hbase/http/ssl/KeyStoreTestUtil.java>:[109,47] CertificateAlgorithmId is internal proprietary API and may be removed in a future release
[ERROR] <https://builds.apache.org/job/HBase-1.1/ws/hbase-server/src/test/java/org/apache/hadoop/hbase/http/ssl/KeyStoreTestUtil.java>:[111,15] X509CertImpl is internal proprietary API and may be removed in a future release
[ERROR] -> [Help 1]
[ERROR] 
[ERROR] To see the full stack trace of the errors, re-run Maven with the -e switch.
[ERROR] Re-run Maven using the -X switch to enable full debug logging.
[ERROR] 
[ERROR] For more information about the errors and possible solutions, please read the following articles:
[ERROR] [Help 1] http://cwiki.apache.org/confluence/display/MAVEN/MojoFailureException
[ERROR] 
[ERROR] After correcting the problems, you can resume the build with the command
[ERROR]   mvn <goals> -rf :hbase-server
Build step 'Invoke top-level Maven targets' marked build as failure
Performing Post build task...
Match found for :.* : True
Logical operation result is TRUE
Running script  :   ZOMBIE_TESTS_COUNT=`jps | grep surefirebooter | wc -l`
  if [[ $ZOMBIE_TESTS_COUNT != 0 ]] ; then
    #It seems sometimes the tests are not dying immediately. Let's give them 10s
    echo "Suspicious java process found - waiting 10s to see if there are just slow to stop"
    sleep 10   
    ZOMBIE_TESTS_COUNT=`jps | grep surefirebooter | wc -l`
    if [[ $ZOMBIE_TESTS_COUNT != 0 ]] ; then
      echo "There are $ZOMBIE_TESTS_COUNT zombie tests, they should have been killed by surefire but survived"
      echo "************ BEGIN zombies jstack extract"
      ZB_STACK=`jps | grep surefirebooter | cut -d ' ' -f 1 | xargs -n 1 jstack | grep ".test" | grep "\.java"`
      jps | grep surefirebooter | cut -d ' ' -f 1 | xargs -n 1 jstack
      echo "************ END  zombies jstack extract"
      JIRA_COMMENT="$JIRA_COMMENT

     {color:red}-1 core zombie tests{color}.  There are ${ZOMBIE_TESTS_COUNT} zombie test(s): ${ZB_STACK}"
      BAD=1
      jps | grep surefirebooter | cut -d ' ' -f 1 | xargs kill -9
    else
      echo "We're ok: there is no zombie test, but some tests took some time to stop"
    fi
  else
    echo "We're ok: there is no zombie test"
  fi
[HBase-1.1] $ /bin/bash -xe /tmp/hudson1987430399019299606.sh
++ jps
++ grep surefirebooter
++ wc -l
+ ZOMBIE_TESTS_COUNT=0
+ [[ 0 != 0 ]]
+ echo 'We'\''re ok: there is no zombie test'
We're ok: there is no zombie test
POST BUILD TASK : SUCCESS
END OF POST BUILD TASK : 0
Archiving artifacts
Sending artifact delta relative to HBase-1.1 #38
Archived 261 artifacts
Archive block size is 32768
Received 2 blocks and 1014185 bytes
Compression is 6.1%
Took 25 sec
Recording test results
Updating HBASE-12783