You are viewing a plain text version of this content. The canonical link for it is here.
Posted to builds@solr.apache.org by Apache Jenkins Server <je...@builds.apache.org> on 2024/06/25 15:18:03 UTC
[JENKINS] Solr » Solr-Docker-Nightly-main - Build # 953 - Still Failing!
Build: https://ci-builds.apache.org/job/Solr/job/Solr-Docker-Nightly-main/953/
Log:
Started by timer
Started by timer
Running as SYSTEM
[EnvInject] - Loading node environment variables.
Building remotely on lucene-solr-1 (solr lucene) in workspace /home/jenkins/jenkins-slave/workspace/Solr/Solr-Docker-Nightly-main
[WS-CLEANUP] Deleting project workspace...
[WS-CLEANUP] Deferred wipeout is used...
[WS-CLEANUP] Done
The recommended git tool is: NONE
No credentials specified
Cloning the remote Git repository
Cloning repository https://gitbox.apache.org/repos/asf/solr.git
> git init /home/jenkins/jenkins-slave/workspace/Solr/Solr-Docker-Nightly-main # timeout=10
Fetching upstream changes from https://gitbox.apache.org/repos/asf/solr.git
> git --version # timeout=10
> git --version # 'git version 2.17.1'
> git fetch --tags --progress -- https://gitbox.apache.org/repos/asf/solr.git +refs/heads/*:refs/remotes/origin/* # timeout=10
> git config remote.origin.url https://gitbox.apache.org/repos/asf/solr.git # timeout=10
> git config --add remote.origin.fetch +refs/heads/*:refs/remotes/origin/* # timeout=10
Avoid second fetch
> git rev-parse refs/remotes/origin/main^{commit} # timeout=10
Checking out Revision 709a1ee27df23b419d09fe8f67c3276409131a4a (refs/remotes/origin/main)
> git config core.sparsecheckout # timeout=10
> git checkout -f 709a1ee27df23b419d09fe8f67c3276409131a4a # timeout=10
> git branch -a -v --no-abbrev # timeout=10
> git checkout -b main 709a1ee27df23b419d09fe8f67c3276409131a4a # timeout=10
Commit message: "remove changelog, this is just a small refactoring (#2531)"
> git rev-list --no-walk 79cd576c3a97abe6d80ec6b798dfce7e964f5b1b # timeout=10
No emails were triggered.
provisioning config files...
copy managed file [gradle.properties] to file:/home/jenkins/jenkins-slave/workspace/Solr/Solr-Docker-Nightly-main/gradle.properties
[Solr-Docker-Nightly-main] $ /bin/sh -xe /tmp/jenkins14620514490081124390.sh
+ echo ****
+ docker login -u **** --password-stdin
WARNING! Your password will be stored unencrypted in /home/jenkins/.docker/config.json.
Configure a credential helper to remove this warning. See
https://docs.docker.com/engine/reference/commandline/login/#credentials-store
Login Succeeded
[Gradle] - Launching build.
[Solr-Docker-Nightly-main] $ /home/jenkins/jenkins-slave/workspace/Solr/Solr-Docker-Nightly-main/gradlew -Psolr.docker.imageRepo=apache/solr-nightly -Psolr.docker.dist=full testDocker dockerPush
/home/jenkins/jenkins-slave/workspace/Solr/Solr-Docker-Nightly-main/buildSrc/src/main/java/org/apache/lucene/gradle/WrapperDownloader.java:95: warning: [deprecation] URL(String) in URL has been deprecated
URL url = new URL("https://raw.githubusercontent.com/gradle/gradle/v" + wrapperVersion + "/gradle/wrapper/gradle-wrapper.jar");
^
1 warning
Downloading gradle-wrapper.jar from https://raw.githubusercontent.com/gradle/gradle/v8.4.0/gradle/wrapper/gradle-wrapper.jar
To honour the JVM settings for this build a single-use Daemon process will be forked. For more on this, please refer to https://docs.gradle.org/8.4/userguide/gradle_daemon.html#sec:disabling_the_daemon in the Gradle documentation.
Daemon will be stopped at the end of the build
> Task :buildSrc:compileJava
Note: Some input files use or override a deprecated API.
Note: Recompile with -Xlint:deprecation for details.
> Task :buildSrc:compileGroovy NO-SOURCE
> Task :buildSrc:processResources NO-SOURCE
> Task :buildSrc:classes
> Task :buildSrc:jar
> Task :solr:docker:createBodySnippetDockerfile
> Task :solr:docker:createDockerfileLocal
> Task :solr:docker:assemblePackaging
> Task :solr:documentation:changesToHtml
> Task :solr:documentation:copyDocumentationAssets
> Task :solr:documentation:markdownToHtml
> Task :solr:documentation:copyChangesToHtmlForMiniSite
> Task :solr:documentation:copyMiniDocumentationAssets
> Task :solr:documentation:createMiniDocumentationIndex
> Task :solr:documentation:documentationMinimal
> Task :solr:example:assemblePackaging
> Task :gitStatus
> Task :checkJdkInternalsExportedToGradle FAILED
FAILURE: Build failed with an exception.
* Where:
Script '/home/jenkins/jenkins-slave/workspace/Solr/Solr-Docker-Nightly-main/gradle/generation/local-settings.gradle' line: 42
* What went wrong:
Execution failed for task ':checkJdkInternalsExportedToGradle'.
> Certain gradle tasks and plugins require access to jdk.compiler internals, your gradle.properties might have just been generated or could be out of sync (see gradle/template.gradle.properties)
* Try:
> Run with --stacktrace option to get the stack trace.
> Run with --info or --debug option to get more log output.
> Get more help at https://help.gradle.org.
Deprecated Gradle features were used in this build, making it incompatible with Gradle 9.0.
You can use '--warning-mode all' to show the individual deprecation warnings and determine if they come from your own scripts or plugins.
For more on this, please refer to https://docs.gradle.org/8.4/userguide/command_line_interface.html#sec:command_line_warnings in the Gradle documentation.
BUILD FAILED in 23s
14 actionable tasks: 14 executed
Publishing build scan...
Publishing build scan failed due to network error 'java.net.SocketTimeoutException: Read timed out' (2 retries remaining)...
Publishing failed.
The response from https://ge.apache.org/scans/publish/gradle/3.15.1/token was not from Gradle Enterprise.
The specified server address may be incorrect, or your network environment may be interfering.
Please report this problem to your Gradle Enterprise administrator via https://ge.apache.org/help and include the following via copy/paste:
----------
Gradle version: 8.4
Plugin version: 3.15.1
Request URL: https://ge.apache.org/scans/publish/gradle/3.15.1/token
Request ID: d5151cd4-c66e-4df9-88fd-04e4188836c5
Response status code: 502
Response content type: text/html
----------
Build step 'Invoke Gradle script' changed build result to FAILURE
Build step 'Invoke Gradle script' marked build as failure
Email was triggered for: Failure - Any
Sending email for trigger: Failure - Any
[JENKINS] Solr » Solr-Docker-Nightly-main - Build # 954 - Still Failing!
Posted by Apache Jenkins Server <je...@builds.apache.org>.
Build: https://ci-builds.apache.org/job/Solr/job/Solr-Docker-Nightly-main/954/
Log:
Started by timer
Started by timer
Running as SYSTEM
[EnvInject] - Loading node environment variables.
Building remotely on lucene-solr-1 (solr lucene) in workspace /home/jenkins/jenkins-slave/workspace/Solr/Solr-Docker-Nightly-main
[WS-CLEANUP] Deleting project workspace...
[WS-CLEANUP] Deferred wipeout is used...
[WS-CLEANUP] Done
The recommended git tool is: NONE
No credentials specified
Cloning the remote Git repository
Cloning repository https://gitbox.apache.org/repos/asf/solr.git
> git init /home/jenkins/jenkins-slave/workspace/Solr/Solr-Docker-Nightly-main # timeout=10
Fetching upstream changes from https://gitbox.apache.org/repos/asf/solr.git
> git --version # timeout=10
> git --version # 'git version 2.17.1'
> git fetch --tags --progress -- https://gitbox.apache.org/repos/asf/solr.git +refs/heads/*:refs/remotes/origin/* # timeout=10
> git config remote.origin.url https://gitbox.apache.org/repos/asf/solr.git # timeout=10
> git config --add remote.origin.fetch +refs/heads/*:refs/remotes/origin/* # timeout=10
Avoid second fetch
> git rev-parse refs/remotes/origin/main^{commit} # timeout=10
Checking out Revision 390c30ff56ad354a6ee55eaae54713dd8ec4cce3 (refs/remotes/origin/main)
> git config core.sparsecheckout # timeout=10
> git checkout -f 390c30ff56ad354a6ee55eaae54713dd8ec4cce3 # timeout=10
> git branch -a -v --no-abbrev # timeout=10
> git checkout -b main 390c30ff56ad354a6ee55eaae54713dd8ec4cce3 # timeout=10
Commit message: "SOLR-17349: SolrDocumentFetcher should always skip lazy field loading overhead if documentCache==null (#2535)"
> git rev-list --no-walk 709a1ee27df23b419d09fe8f67c3276409131a4a # timeout=10
No emails were triggered.
provisioning config files...
copy managed file [gradle.properties] to file:/home/jenkins/jenkins-slave/workspace/Solr/Solr-Docker-Nightly-main/gradle.properties
[Solr-Docker-Nightly-main] $ /bin/sh -xe /tmp/jenkins8438492570236294870.sh
+ echo ****
+ docker login -u **** --password-stdin
WARNING! Your password will be stored unencrypted in /home/jenkins/.docker/config.json.
Configure a credential helper to remove this warning. See
https://docs.docker.com/engine/reference/commandline/login/#credentials-store
Login Succeeded
[Gradle] - Launching build.
[Solr-Docker-Nightly-main] $ /home/jenkins/jenkins-slave/workspace/Solr/Solr-Docker-Nightly-main/gradlew -Psolr.docker.imageRepo=apache/solr-nightly -Psolr.docker.dist=full testDocker dockerPush
/home/jenkins/jenkins-slave/workspace/Solr/Solr-Docker-Nightly-main/buildSrc/src/main/java/org/apache/lucene/gradle/WrapperDownloader.java:95: warning: [deprecation] URL(String) in URL has been deprecated
URL url = new URL("https://raw.githubusercontent.com/gradle/gradle/v" + wrapperVersion + "/gradle/wrapper/gradle-wrapper.jar");
^
1 warning
Downloading gradle-wrapper.jar from https://raw.githubusercontent.com/gradle/gradle/v8.4.0/gradle/wrapper/gradle-wrapper.jar
To honour the JVM settings for this build a single-use Daemon process will be forked. For more on this, please refer to https://docs.gradle.org/8.4/userguide/gradle_daemon.html#sec:disabling_the_daemon in the Gradle documentation.
Daemon will be stopped at the end of the build
> Task :buildSrc:compileJava
Note: Some input files use or override a deprecated API.
Note: Recompile with -Xlint:deprecation for details.
> Task :buildSrc:compileGroovy NO-SOURCE
> Task :buildSrc:processResources NO-SOURCE
> Task :buildSrc:classes
> Task :buildSrc:jar
> Task :solr:docker:createBodySnippetDockerfile
> Task :solr:docker:createDockerfileLocal
> Task :solr:docker:assemblePackaging
> Task :solr:documentation:changesToHtml
> Task :solr:documentation:copyDocumentationAssets
> Task :solr:documentation:markdownToHtml
> Task :solr:documentation:copyChangesToHtmlForMiniSite
> Task :solr:documentation:copyMiniDocumentationAssets
> Task :solr:documentation:createMiniDocumentationIndex
> Task :solr:documentation:documentationMinimal
> Task :solr:example:assemblePackaging
> Task :gitStatus
> Task :checkJdkInternalsExportedToGradle FAILED
FAILURE: Build failed with an exception.
* Where:
Script '/home/jenkins/jenkins-slave/workspace/Solr/Solr-Docker-Nightly-main/gradle/generation/local-settings.gradle' line: 42
* What went wrong:
Execution failed for task ':checkJdkInternalsExportedToGradle'.
> Certain gradle tasks and plugins require access to jdk.compiler internals, your gradle.properties might have just been generated or could be out of sync (see gradle/template.gradle.properties)
* Try:
> Run with --stacktrace option to get the stack trace.
> Run with --info or --debug option to get more log output.
> Get more help at https://help.gradle.org.
Deprecated Gradle features were used in this build, making it incompatible with Gradle 9.0.
You can use '--warning-mode all' to show the individual deprecation warnings and determine if they come from your own scripts or plugins.
For more on this, please refer to https://docs.gradle.org/8.4/userguide/command_line_interface.html#sec:command_line_warnings in the Gradle documentation.
BUILD FAILED in 24s
14 actionable tasks: 14 executed
Publishing build scan...
https://ge.apache.org/s/snvy7en5xvcty
Build step 'Invoke Gradle script' changed build result to FAILURE
Build step 'Invoke Gradle script' marked build as failure
Email was triggered for: Failure - Any
Sending email for trigger: Failure - Any