You are viewing a plain text version of this content. The canonical link for it is here.
Posted to commits@phoenix.apache.org by Apache Jenkins Server <je...@builds.apache.org> on 2016/04/08 18:06:36 UTC
Build failed in Jenkins: Phoenix | Master #1188
See <https://builds.apache.org/job/Phoenix-master/1188/changes>
Changes:
[maryannxue] PHOENIX-2828 Ordinality should be 1-based in UNNEST WITH ORDINALITY
------------------------------------------
Started by an SCM change
[EnvInject] - Loading node environment variables.
Building remotely on ubuntu-us1 (Ubuntu ubuntu ubuntu-us golang-ppa) in workspace <https://builds.apache.org/job/Phoenix-master/ws/>
> git rev-parse --is-inside-work-tree # timeout=10
Fetching changes from the remote Git repository
> git config remote.origin.url https://git-wip-us.apache.org/repos/asf/phoenix.git # timeout=10
Fetching upstream changes from https://git-wip-us.apache.org/repos/asf/phoenix.git
> git --version # timeout=10
> git -c core.askpass=true fetch --tags --progress https://git-wip-us.apache.org/repos/asf/phoenix.git +refs/heads/*:refs/remotes/origin/*
> git rev-parse origin/master^{commit} # timeout=10
Checking out Revision 05bae1fbd75a735628abee3f7da09bb0dee1cbb1 (origin/master)
> git config core.sparsecheckout # timeout=10
> git checkout -f 05bae1fbd75a735628abee3f7da09bb0dee1cbb1
> git rev-list 776eea9ce1c4828f959b9ef76dd244941972f6ec # timeout=10
No emails were triggered.
[EnvInject] - Executing scripts and injecting environment variables after the SCM step.
[EnvInject] - Injecting as environment variables the properties content
MAVEN_OPTS=-Xmx3G
[EnvInject] - Variables injected successfully.
[Phoenix-master] $ /bin/bash -xe /tmp/hudson8035636731516531537.sh
+ ls /home/jenkins/.m2/repository/org/apache/htrace
htrace
htrace-core
+ ls /home/jenkins/.m2/repository/org/apache/hbase
hbase
hbase-annotations
hbase-client
hbase-common
hbase-hadoop2-compat
hbase-hadoop-compat
hbase-it
hbase-prefix-tree
hbase-procedure
hbase-protocol
hbase-server
hbase-shell
hbase-testing-util
FATAL: Failed to install https://repo.maven.apache.org/maven2/org/apache/maven/apache-maven/3.0.4/apache-maven-3.0.4-bin.zip to /home/jenkins/tools/maven/apache-maven-3.0.4
java.io.IOException: Failed to install https://repo.maven.apache.org/maven2/org/apache/maven/apache-maven/3.0.4/apache-maven-3.0.4-bin.zip to /home/jenkins/tools/maven/apache-maven-3.0.4
at hudson.FilePath.installIfNecessaryFrom(FilePath.java:832)
at hudson.tools.DownloadFromUrlInstaller.performInstallation(DownloadFromUrlInstaller.java:75)
at hudson.tools.InstallerTranslator.getToolHome(InstallerTranslator.java:68)
at hudson.tools.ToolLocationNodeProperty.getToolHome(ToolLocationNodeProperty.java:108)
at hudson.tools.ToolInstallation.translateFor(ToolInstallation.java:206)
at hudson.tasks.Maven$MavenInstallation.forNode(Maven.java:624)
at hudson.tasks.Maven.perform(Maven.java:288)
at hudson.tasks.BuildStepMonitor$1.perform(BuildStepMonitor.java:20)
at hudson.model.AbstractBuild$AbstractBuildExecution.perform(AbstractBuild.java:782)
at hudson.model.Build$BuildExecution.build(Build.java:205)
at hudson.model.Build$BuildExecution.doRun(Build.java:162)
at hudson.model.AbstractBuild$AbstractBuildExecution.run(AbstractBuild.java:534)
at hudson.model.Run.execute(Run.java:1738)
at hudson.model.FreeStyleBuild.run(FreeStyleBuild.java:43)
at hudson.model.ResourceController.execute(ResourceController.java:98)
at hudson.model.Executor.run(Executor.java:410)
Caused by: java.io.IOException: remote file operation failed: /home/jenkins/tools/maven/apache-maven-3.0.4 at hudson.remoting.Channel@e3210c0:ubuntu-us1: java.nio.file.AccessDeniedException: /home/jenkins/tools/maven/apache-maven-3.0.4/.installedFrom
at hudson.FilePath.act(FilePath.java:986)
at hudson.FilePath.act(FilePath.java:968)
at hudson.FilePath.deleteContents(FilePath.java:1183)
at hudson.FilePath.installIfNecessaryFrom(FilePath.java:796)
... 15 more
Caused by: java.nio.file.AccessDeniedException: /home/jenkins/tools/maven/apache-maven-3.0.4/.installedFrom
at sun.nio.fs.UnixException.translateToIOException(UnixException.java:84)
at sun.nio.fs.UnixException.rethrowAsIOException(UnixException.java:102)
at sun.nio.fs.UnixException.rethrowAsIOException(UnixException.java:107)
at sun.nio.fs.UnixFileSystemProvider.implDelete(UnixFileSystemProvider.java:244)
at sun.nio.fs.AbstractFileSystemProvider.delete(AbstractFileSystemProvider.java:103)
at java.nio.file.Files.delete(Files.java:1077)
at sun.reflect.GeneratedMethodAccessor608.invoke(Unknown Source)
at sun.reflect.DelegatingMethodAccessorImpl.invoke(DelegatingMethodAccessorImpl.java:43)
at java.lang.reflect.Method.invoke(Method.java:606)
at hudson.Util.deleteFile(Util.java:255)
at hudson.FilePath.deleteRecursive(FilePath.java:1203)
at hudson.FilePath.deleteContentsRecursive(FilePath.java:1212)
at hudson.FilePath.access$1100(FilePath.java:190)
at hudson.FilePath$15.invoke(FilePath.java:1186)
at hudson.FilePath$15.invoke(FilePath.java:1183)
at hudson.FilePath$FileCallableWrapper.call(FilePath.java:2719)
at hudson.remoting.UserRequest.perform(UserRequest.java:120)
at hudson.remoting.UserRequest.perform(UserRequest.java:48)
at hudson.remoting.Request$2.run(Request.java:326)
at hudson.remoting.InterceptingExecutorService$1.call(InterceptingExecutorService.java:68)
at java.util.concurrent.FutureTask.run(FutureTask.java:262)
at java.util.concurrent.ThreadPoolExecutor.runWorker(ThreadPoolExecutor.java:1145)
at java.util.concurrent.ThreadPoolExecutor$Worker.run(ThreadPoolExecutor.java:615)
at java.lang.Thread.run(Thread.java:745)
at ......remote call to ubuntu-us1(Native Method)
at hudson.remoting.Channel.attachCallSiteStackTrace(Channel.java:1416)
at hudson.remoting.UserResponse.retrieve(UserRequest.java:220)
at hudson.remoting.Channel.call(Channel.java:781)
at hudson.FilePath.act(FilePath.java:979)
... 18 more
Archiving artifacts
Compressed 226.11 MB of artifacts by 65.7% relative to #1185
Updating PHOENIX-2828
Recording test results
ERROR: Step ‘Publish JUnit test result report’ failed: Test reports were found but none of them are new. Did tests run?
For example, <https://builds.apache.org/job/Phoenix-master/1188/artifact/phoenix-core/target/surefire-reports/TEST-org.apache.hadoop.hbase.ipc.PhoenixIndexRpcSchedulerTest.xml> is 2 days 9 hr old
Jenkins build is back to normal : Phoenix | Master #1192
Posted by Apache Jenkins Server <je...@builds.apache.org>.
See <https://builds.apache.org/job/Phoenix-master/1192/changes>
Build failed in Jenkins: Phoenix | Master #1191
Posted by Apache Jenkins Server <je...@builds.apache.org>.
See <https://builds.apache.org/job/Phoenix-master/1191/changes>
Changes:
[samarth] PHOENIX-2830 Upgrade code fails when upgrading from a version before 4.3
------------------------------------------
Started by an SCM change
[EnvInject] - Loading node environment variables.
Building remotely on ubuntu-us1 (Ubuntu ubuntu ubuntu-us golang-ppa) in workspace <https://builds.apache.org/job/Phoenix-master/ws/>
> git rev-parse --is-inside-work-tree # timeout=10
Fetching changes from the remote Git repository
> git config remote.origin.url https://git-wip-us.apache.org/repos/asf/phoenix.git # timeout=10
Fetching upstream changes from https://git-wip-us.apache.org/repos/asf/phoenix.git
> git --version # timeout=10
> git -c core.askpass=true fetch --tags --progress https://git-wip-us.apache.org/repos/asf/phoenix.git +refs/heads/*:refs/remotes/origin/*
> git rev-parse origin/master^{commit} # timeout=10
Checking out Revision bbcdd2a3418216c4da0b39af74e833f5cc60fc4d (origin/master)
> git config core.sparsecheckout # timeout=10
> git checkout -f bbcdd2a3418216c4da0b39af74e833f5cc60fc4d
> git rev-list 6cc17278d7e8be64ac606b2d0030cdb3edfda961 # timeout=10
No emails were triggered.
[EnvInject] - Executing scripts and injecting environment variables after the SCM step.
[EnvInject] - Injecting as environment variables the properties content
MAVEN_OPTS=-Xmx3G
[EnvInject] - Variables injected successfully.
[Phoenix-master] $ /bin/bash -xe /tmp/hudson1397782204506481600.sh
+ ls /home/jenkins/.m2/repository/org/apache/htrace
htrace
htrace-core
+ ls /home/jenkins/.m2/repository/org/apache/hbase
hbase
hbase-annotations
hbase-client
hbase-common
hbase-hadoop2-compat
hbase-hadoop-compat
hbase-it
hbase-prefix-tree
hbase-procedure
hbase-protocol
hbase-server
hbase-shell
hbase-testing-util
FATAL: Failed to install https://repo.maven.apache.org/maven2/org/apache/maven/apache-maven/3.0.4/apache-maven-3.0.4-bin.zip to /home/jenkins/tools/maven/apache-maven-3.0.4
java.io.IOException: Failed to install https://repo.maven.apache.org/maven2/org/apache/maven/apache-maven/3.0.4/apache-maven-3.0.4-bin.zip to /home/jenkins/tools/maven/apache-maven-3.0.4
at hudson.FilePath.installIfNecessaryFrom(FilePath.java:832)
at hudson.tools.DownloadFromUrlInstaller.performInstallation(DownloadFromUrlInstaller.java:75)
at hudson.tools.InstallerTranslator.getToolHome(InstallerTranslator.java:68)
at hudson.tools.ToolLocationNodeProperty.getToolHome(ToolLocationNodeProperty.java:108)
at hudson.tools.ToolInstallation.translateFor(ToolInstallation.java:206)
at hudson.tasks.Maven$MavenInstallation.forNode(Maven.java:624)
at hudson.tasks.Maven.perform(Maven.java:288)
at hudson.tasks.BuildStepMonitor$1.perform(BuildStepMonitor.java:20)
at hudson.model.AbstractBuild$AbstractBuildExecution.perform(AbstractBuild.java:782)
at hudson.model.Build$BuildExecution.build(Build.java:205)
at hudson.model.Build$BuildExecution.doRun(Build.java:162)
at hudson.model.AbstractBuild$AbstractBuildExecution.run(AbstractBuild.java:534)
at hudson.model.Run.execute(Run.java:1738)
at hudson.model.FreeStyleBuild.run(FreeStyleBuild.java:43)
at hudson.model.ResourceController.execute(ResourceController.java:98)
at hudson.model.Executor.run(Executor.java:410)
Caused by: java.io.IOException: remote file operation failed: /home/jenkins/tools/maven/apache-maven-3.0.4 at hudson.remoting.Channel@e3210c0:ubuntu-us1: java.nio.file.AccessDeniedException: /home/jenkins/tools/maven/apache-maven-3.0.4/.installedFrom
at hudson.FilePath.act(FilePath.java:986)
at hudson.FilePath.act(FilePath.java:968)
at hudson.FilePath.deleteContents(FilePath.java:1183)
at hudson.FilePath.installIfNecessaryFrom(FilePath.java:796)
... 15 more
Caused by: java.nio.file.AccessDeniedException: /home/jenkins/tools/maven/apache-maven-3.0.4/.installedFrom
at sun.nio.fs.UnixException.translateToIOException(UnixException.java:84)
at sun.nio.fs.UnixException.rethrowAsIOException(UnixException.java:102)
at sun.nio.fs.UnixException.rethrowAsIOException(UnixException.java:107)
at sun.nio.fs.UnixFileSystemProvider.implDelete(UnixFileSystemProvider.java:244)
at sun.nio.fs.AbstractFileSystemProvider.delete(AbstractFileSystemProvider.java:103)
at java.nio.file.Files.delete(Files.java:1077)
at sun.reflect.GeneratedMethodAccessor1048.invoke(Unknown Source)
at sun.reflect.DelegatingMethodAccessorImpl.invoke(DelegatingMethodAccessorImpl.java:43)
at java.lang.reflect.Method.invoke(Method.java:606)
at hudson.Util.deleteFile(Util.java:255)
at hudson.FilePath.deleteRecursive(FilePath.java:1203)
at hudson.FilePath.deleteContentsRecursive(FilePath.java:1212)
at hudson.FilePath.access$1100(FilePath.java:190)
at hudson.FilePath$15.invoke(FilePath.java:1186)
at hudson.FilePath$15.invoke(FilePath.java:1183)
at hudson.FilePath$FileCallableWrapper.call(FilePath.java:2719)
at hudson.remoting.UserRequest.perform(UserRequest.java:120)
at hudson.remoting.UserRequest.perform(UserRequest.java:48)
at hudson.remoting.Request$2.run(Request.java:326)
at hudson.remoting.InterceptingExecutorService$1.call(InterceptingExecutorService.java:68)
at java.util.concurrent.FutureTask.run(FutureTask.java:262)
at java.util.concurrent.ThreadPoolExecutor.runWorker(ThreadPoolExecutor.java:1145)
at java.util.concurrent.ThreadPoolExecutor$Worker.run(ThreadPoolExecutor.java:615)
at java.lang.Thread.run(Thread.java:745)
at ......remote call to ubuntu-us1(Native Method)
at hudson.remoting.Channel.attachCallSiteStackTrace(Channel.java:1416)
at hudson.remoting.UserResponse.retrieve(UserRequest.java:220)
at hudson.remoting.Channel.call(Channel.java:781)
at hudson.FilePath.act(FilePath.java:979)
... 18 more
Archiving artifacts
Compressed 226.11 MB of artifacts by 65.7% relative to #1185
Updating PHOENIX-2830
Recording test results
ERROR: Step ‘Publish JUnit test result report’ failed: Test reports were found but none of them are new. Did tests run?
For example, <https://builds.apache.org/job/Phoenix-master/1191/artifact/phoenix-core/target/surefire-reports/TEST-org.apache.hadoop.hbase.ipc.PhoenixIndexRpcSchedulerTest.xml> is 5 days 14 hr old
Build failed in Jenkins: Phoenix | Master #1190
Posted by Apache Jenkins Server <je...@builds.apache.org>.
See <https://builds.apache.org/job/Phoenix-master/1190/changes>
Changes:
[tdsilva] PHOENIX-2156 Support drop of column from table with views
------------------------------------------
Started by an SCM change
[EnvInject] - Loading node environment variables.
Building remotely on ubuntu-us1 (Ubuntu ubuntu ubuntu-us golang-ppa) in workspace <https://builds.apache.org/job/Phoenix-master/ws/>
> git rev-parse --is-inside-work-tree # timeout=10
Fetching changes from the remote Git repository
> git config remote.origin.url https://git-wip-us.apache.org/repos/asf/phoenix.git # timeout=10
Fetching upstream changes from https://git-wip-us.apache.org/repos/asf/phoenix.git
> git --version # timeout=10
> git -c core.askpass=true fetch --tags --progress https://git-wip-us.apache.org/repos/asf/phoenix.git +refs/heads/*:refs/remotes/origin/*
> git rev-parse origin/master^{commit} # timeout=10
Checking out Revision 6cc17278d7e8be64ac606b2d0030cdb3edfda961 (origin/master)
> git config core.sparsecheckout # timeout=10
> git checkout -f 6cc17278d7e8be64ac606b2d0030cdb3edfda961
> git rev-list 6d147896f5856e728c454e4a1fa47575d9690aa7 # timeout=10
No emails were triggered.
[EnvInject] - Executing scripts and injecting environment variables after the SCM step.
[EnvInject] - Injecting as environment variables the properties content
MAVEN_OPTS=-Xmx3G
[EnvInject] - Variables injected successfully.
[Phoenix-master] $ /bin/bash -xe /tmp/hudson6566048817350203773.sh
+ ls /home/jenkins/.m2/repository/org/apache/htrace
htrace
htrace-core
+ ls /home/jenkins/.m2/repository/org/apache/hbase
hbase
hbase-annotations
hbase-client
hbase-common
hbase-hadoop2-compat
hbase-hadoop-compat
hbase-it
hbase-prefix-tree
hbase-procedure
hbase-protocol
hbase-server
hbase-shell
hbase-testing-util
FATAL: Failed to install https://repo.maven.apache.org/maven2/org/apache/maven/apache-maven/3.0.4/apache-maven-3.0.4-bin.zip to /home/jenkins/tools/maven/apache-maven-3.0.4
java.io.IOException: Failed to install https://repo.maven.apache.org/maven2/org/apache/maven/apache-maven/3.0.4/apache-maven-3.0.4-bin.zip to /home/jenkins/tools/maven/apache-maven-3.0.4
at hudson.FilePath.installIfNecessaryFrom(FilePath.java:832)
at hudson.tools.DownloadFromUrlInstaller.performInstallation(DownloadFromUrlInstaller.java:75)
at hudson.tools.InstallerTranslator.getToolHome(InstallerTranslator.java:68)
at hudson.tools.ToolLocationNodeProperty.getToolHome(ToolLocationNodeProperty.java:108)
at hudson.tools.ToolInstallation.translateFor(ToolInstallation.java:206)
at hudson.tasks.Maven$MavenInstallation.forNode(Maven.java:624)
at hudson.tasks.Maven.perform(Maven.java:288)
at hudson.tasks.BuildStepMonitor$1.perform(BuildStepMonitor.java:20)
at hudson.model.AbstractBuild$AbstractBuildExecution.perform(AbstractBuild.java:782)
at hudson.model.Build$BuildExecution.build(Build.java:205)
at hudson.model.Build$BuildExecution.doRun(Build.java:162)
at hudson.model.AbstractBuild$AbstractBuildExecution.run(AbstractBuild.java:534)
at hudson.model.Run.execute(Run.java:1738)
at hudson.model.FreeStyleBuild.run(FreeStyleBuild.java:43)
at hudson.model.ResourceController.execute(ResourceController.java:98)
at hudson.model.Executor.run(Executor.java:410)
Caused by: java.io.IOException: remote file operation failed: /home/jenkins/tools/maven/apache-maven-3.0.4 at hudson.remoting.Channel@e3210c0:ubuntu-us1: java.nio.file.AccessDeniedException: /home/jenkins/tools/maven/apache-maven-3.0.4/.installedFrom
at hudson.FilePath.act(FilePath.java:986)
at hudson.FilePath.act(FilePath.java:968)
at hudson.FilePath.deleteContents(FilePath.java:1183)
at hudson.FilePath.installIfNecessaryFrom(FilePath.java:796)
... 15 more
Caused by: java.nio.file.AccessDeniedException: /home/jenkins/tools/maven/apache-maven-3.0.4/.installedFrom
at sun.nio.fs.UnixException.translateToIOException(UnixException.java:84)
at sun.nio.fs.UnixException.rethrowAsIOException(UnixException.java:102)
at sun.nio.fs.UnixException.rethrowAsIOException(UnixException.java:107)
at sun.nio.fs.UnixFileSystemProvider.implDelete(UnixFileSystemProvider.java:244)
at sun.nio.fs.AbstractFileSystemProvider.delete(AbstractFileSystemProvider.java:103)
at java.nio.file.Files.delete(Files.java:1077)
at sun.reflect.GeneratedMethodAccessor1048.invoke(Unknown Source)
at sun.reflect.DelegatingMethodAccessorImpl.invoke(DelegatingMethodAccessorImpl.java:43)
at java.lang.reflect.Method.invoke(Method.java:606)
at hudson.Util.deleteFile(Util.java:255)
at hudson.FilePath.deleteRecursive(FilePath.java:1203)
at hudson.FilePath.deleteContentsRecursive(FilePath.java:1212)
at hudson.FilePath.access$1100(FilePath.java:190)
at hudson.FilePath$15.invoke(FilePath.java:1186)
at hudson.FilePath$15.invoke(FilePath.java:1183)
at hudson.FilePath$FileCallableWrapper.call(FilePath.java:2719)
at hudson.remoting.UserRequest.perform(UserRequest.java:120)
at hudson.remoting.UserRequest.perform(UserRequest.java:48)
at hudson.remoting.Request$2.run(Request.java:326)
at hudson.remoting.InterceptingExecutorService$1.call(InterceptingExecutorService.java:68)
at java.util.concurrent.FutureTask.run(FutureTask.java:262)
at java.util.concurrent.ThreadPoolExecutor.runWorker(ThreadPoolExecutor.java:1145)
at java.util.concurrent.ThreadPoolExecutor$Worker.run(ThreadPoolExecutor.java:615)
at java.lang.Thread.run(Thread.java:745)
at ......remote call to ubuntu-us1(Native Method)
at hudson.remoting.Channel.attachCallSiteStackTrace(Channel.java:1416)
at hudson.remoting.UserResponse.retrieve(UserRequest.java:220)
at hudson.remoting.Channel.call(Channel.java:781)
at hudson.FilePath.act(FilePath.java:979)
... 18 more
Archiving artifacts
Compressed 226.11 MB of artifacts by 65.7% relative to #1185
Updating PHOENIX-2156
Recording test results
ERROR: Step ‘Publish JUnit test result report’ failed: Test reports were found but none of them are new. Did tests run?
For example, <https://builds.apache.org/job/Phoenix-master/1190/artifact/phoenix-core/target/surefire-reports/TEST-org.apache.hadoop.hbase.ipc.PhoenixIndexRpcSchedulerTest.xml> is 5 days 13 hr old
Build failed in Jenkins: Phoenix | Master #1189
Posted by Apache Jenkins Server <je...@builds.apache.org>.
See <https://builds.apache.org/job/Phoenix-master/1189/changes>
Changes:
[samarth] PHOENIX-2822 Tests that extend BaseHBaseManagedTimeIT are very
------------------------------------------
Started by an SCM change
[EnvInject] - Loading node environment variables.
Building remotely on ubuntu-us1 (Ubuntu ubuntu ubuntu-us golang-ppa) in workspace <https://builds.apache.org/job/Phoenix-master/ws/>
> git rev-parse --is-inside-work-tree # timeout=10
Fetching changes from the remote Git repository
> git config remote.origin.url https://git-wip-us.apache.org/repos/asf/phoenix.git # timeout=10
Fetching upstream changes from https://git-wip-us.apache.org/repos/asf/phoenix.git
> git --version # timeout=10
> git -c core.askpass=true fetch --tags --progress https://git-wip-us.apache.org/repos/asf/phoenix.git +refs/heads/*:refs/remotes/origin/*
> git rev-parse origin/master^{commit} # timeout=10
Checking out Revision 6d147896f5856e728c454e4a1fa47575d9690aa7 (origin/master)
> git config core.sparsecheckout # timeout=10
> git checkout -f 6d147896f5856e728c454e4a1fa47575d9690aa7
> git rev-list 05bae1fbd75a735628abee3f7da09bb0dee1cbb1 # timeout=10
No emails were triggered.
[EnvInject] - Executing scripts and injecting environment variables after the SCM step.
[EnvInject] - Injecting as environment variables the properties content
MAVEN_OPTS=-Xmx3G
[EnvInject] - Variables injected successfully.
[Phoenix-master] $ /bin/bash -xe /tmp/hudson6512728306173646039.sh
+ ls /home/jenkins/.m2/repository/org/apache/htrace
htrace
htrace-core
+ ls /home/jenkins/.m2/repository/org/apache/hbase
hbase
hbase-annotations
hbase-client
hbase-common
hbase-hadoop2-compat
hbase-hadoop-compat
hbase-it
hbase-prefix-tree
hbase-procedure
hbase-protocol
hbase-server
hbase-shell
hbase-testing-util
FATAL: Failed to install https://repo.maven.apache.org/maven2/org/apache/maven/apache-maven/3.0.4/apache-maven-3.0.4-bin.zip to /home/jenkins/tools/maven/apache-maven-3.0.4
java.io.IOException: Failed to install https://repo.maven.apache.org/maven2/org/apache/maven/apache-maven/3.0.4/apache-maven-3.0.4-bin.zip to /home/jenkins/tools/maven/apache-maven-3.0.4
at hudson.FilePath.installIfNecessaryFrom(FilePath.java:832)
at hudson.tools.DownloadFromUrlInstaller.performInstallation(DownloadFromUrlInstaller.java:75)
at hudson.tools.InstallerTranslator.getToolHome(InstallerTranslator.java:68)
at hudson.tools.ToolLocationNodeProperty.getToolHome(ToolLocationNodeProperty.java:108)
at hudson.tools.ToolInstallation.translateFor(ToolInstallation.java:206)
at hudson.tasks.Maven$MavenInstallation.forNode(Maven.java:624)
at hudson.tasks.Maven.perform(Maven.java:288)
at hudson.tasks.BuildStepMonitor$1.perform(BuildStepMonitor.java:20)
at hudson.model.AbstractBuild$AbstractBuildExecution.perform(AbstractBuild.java:782)
at hudson.model.Build$BuildExecution.build(Build.java:205)
at hudson.model.Build$BuildExecution.doRun(Build.java:162)
at hudson.model.AbstractBuild$AbstractBuildExecution.run(AbstractBuild.java:534)
at hudson.model.Run.execute(Run.java:1738)
at hudson.model.FreeStyleBuild.run(FreeStyleBuild.java:43)
at hudson.model.ResourceController.execute(ResourceController.java:98)
at hudson.model.Executor.run(Executor.java:410)
Caused by: java.io.IOException: remote file operation failed: /home/jenkins/tools/maven/apache-maven-3.0.4 at hudson.remoting.Channel@e3210c0:ubuntu-us1: java.nio.file.AccessDeniedException: /home/jenkins/tools/maven/apache-maven-3.0.4/.installedFrom
at hudson.FilePath.act(FilePath.java:986)
at hudson.FilePath.act(FilePath.java:968)
at hudson.FilePath.deleteContents(FilePath.java:1183)
at hudson.FilePath.installIfNecessaryFrom(FilePath.java:796)
... 15 more
Caused by: java.nio.file.AccessDeniedException: /home/jenkins/tools/maven/apache-maven-3.0.4/.installedFrom
at sun.nio.fs.UnixException.translateToIOException(UnixException.java:84)
at sun.nio.fs.UnixException.rethrowAsIOException(UnixException.java:102)
at sun.nio.fs.UnixException.rethrowAsIOException(UnixException.java:107)
at sun.nio.fs.UnixFileSystemProvider.implDelete(UnixFileSystemProvider.java:244)
at sun.nio.fs.AbstractFileSystemProvider.delete(AbstractFileSystemProvider.java:103)
at java.nio.file.Files.delete(Files.java:1077)
at sun.reflect.GeneratedMethodAccessor608.invoke(Unknown Source)
at sun.reflect.DelegatingMethodAccessorImpl.invoke(DelegatingMethodAccessorImpl.java:43)
at java.lang.reflect.Method.invoke(Method.java:606)
at hudson.Util.deleteFile(Util.java:255)
at hudson.FilePath.deleteRecursive(FilePath.java:1203)
at hudson.FilePath.deleteContentsRecursive(FilePath.java:1212)
at hudson.FilePath.access$1100(FilePath.java:190)
at hudson.FilePath$15.invoke(FilePath.java:1186)
at hudson.FilePath$15.invoke(FilePath.java:1183)
at hudson.FilePath$FileCallableWrapper.call(FilePath.java:2719)
at hudson.remoting.UserRequest.perform(UserRequest.java:120)
at hudson.remoting.UserRequest.perform(UserRequest.java:48)
at hudson.remoting.Request$2.run(Request.java:326)
at hudson.remoting.InterceptingExecutorService$1.call(InterceptingExecutorService.java:68)
at java.util.concurrent.FutureTask.run(FutureTask.java:262)
at java.util.concurrent.ThreadPoolExecutor.runWorker(ThreadPoolExecutor.java:1145)
at java.util.concurrent.ThreadPoolExecutor$Worker.run(ThreadPoolExecutor.java:615)
at java.lang.Thread.run(Thread.java:745)
at ......remote call to ubuntu-us1(Native Method)
at hudson.remoting.Channel.attachCallSiteStackTrace(Channel.java:1416)
at hudson.remoting.UserResponse.retrieve(UserRequest.java:220)
at hudson.remoting.Channel.call(Channel.java:781)
at hudson.FilePath.act(FilePath.java:979)
... 18 more
Archiving artifacts
Compressed 226.11 MB of artifacts by 65.7% relative to #1185
Updating PHOENIX-2822
Recording test results
ERROR: Step ‘Publish JUnit test result report’ failed: Test reports were found but none of them are new. Did tests run?
For example, <https://builds.apache.org/job/Phoenix-master/1189/artifact/phoenix-core/target/surefire-reports/TEST-org.apache.hadoop.hbase.ipc.PhoenixIndexRpcSchedulerTest.xml> is 2 days 15 hr old