You are viewing a plain text version of this content. The canonical link for it is here.
Posted to dev@royale.apache.org by ap...@gmail.com on 2020/03/06 23:00:38 UTC

Build failed in Jenkins: royale-asjs_MXTests #728

See <http://apacheroyaleci2.westus2.cloudapp.azure.com:8080/job/royale-asjs_MXTests/728/display/redirect?page=changes>

Changes:

[aharui] remove unused import

[carlosrovira] jewel-datagrid: some simplifications on structure

[noreply] Create doap_Royale.rdf

[noreply] Delete doap_Royale.rdf


------------------------------------------
[...truncated 952.39 KB...]
checkintests:

mxtests-clean:
   [delete] Deleting directory <http://apacheroyaleci2.westus2.cloudapp.azure.com:8080/job/royale-asjs_MXTests/ws/mustella/tests/mxtests/basicTests/bin>

check-air-home:
     [echo] AIR_HOME is C:\adobe\air\4.0\AdobeAIRSDK

check-runtime-env:

runtime-setup:

load-task:

marmotinni-setup:

prepare:
     [echo] Making lib directory <http://apacheroyaleci2.westus2.cloudapp.azure.com:8080/job/royale-asjs_MXTests/ws/marmotinni/java/c>:\jenkins\workspace\royale-asjs_MXTests\marmotinni\java/lib

selenium3-jar-check:

selenium3-jar:

main:

clean:
   [delete] Deleting: <http://apacheroyaleci2.westus2.cloudapp.azure.com:8080/job/royale-asjs_MXTests/ws/mustella/mustella.swc>

check-compiler-home:

check-compiler:

compile:
     [echo] Compiling mustella.swc
     [echo] ROYALE_HOME: <http://apacheroyaleci2.westus2.cloudapp.azure.com:8080/job/royale-asjs_MXTests/ws/>
     [echo] ROYALE_COMPILER_HOME: <http://apacheroyaleci2.westus2.cloudapp.azure.com:8080/job/royale-asjs_MXTests/ws/js>
     [java] args:
     [java] +royalelib=<http://apacheroyaleci2.westus2.cloudapp.azure.com:8080/job/royale-asjs_MXTests/ws/frameworks>
     [java] +playerglobal.version=11.7
     [java] +env.PLAYERGLOBAL_HOME=C:\adobe\flash
     [java] +env.AIR_HOME=C:\adobe\air\4.0\AdobeAIRSDK
     [java] -compiler.strict-xml=true
     [java] -compiler.targets=SWF,JSRoyale
     [java] -output=<http://apacheroyaleci2.westus2.cloudapp.azure.com:8080/job/royale-asjs_MXTests/ws/mustella/mustella.swc>
     [java] -load-config=<http://apacheroyaleci2.westus2.cloudapp.azure.com:8080/job/royale-asjs_MXTests/ws/mustella/src/main/config/compile-swf-config.xml>
     [java] -js-load-config=<http://apacheroyaleci2.westus2.cloudapp.azure.com:8080/job/royale-asjs_MXTests/ws/frameworks/js-config.xml>
     [java] -js-load-config+=<http://apacheroyaleci2.westus2.cloudapp.azure.com:8080/job/royale-asjs_MXTests/ws/mustella/src/main/config/compile-js-config.xml>
     [java] target:SWF
     [java] target:JSRoyale
     [java] COMPC
     [java] Loading configuration: <http://apacheroyaleci2.westus2.cloudapp.azure.com:8080/job/royale-asjs_MXTests/ws/mustella/src/main/config/compile-swf-config.xml>
     [java] 
     [java] 58056 bytes written to C:\jenkins\workspace\royale-asjs_MXTests\mustella\mustella.swc in 7.655 seconds
     [java] COMPCJSCRoyale
     [java] 12.9076386 seconds
     [java] <http://apacheroyaleci2.westus2.cloudapp.azure.com:8080/job/royale-asjs_MXTests/ws/mustella/src/main/royale/DontSendScriptComplete.as(21)>: col: 8 No definitions matching flash.net.* could be found.
     [java] 
     [java] import flash.net.*;
     [java]        ^
     [java] 
     [java] <http://apacheroyaleci2.westus2.cloudapp.azure.com:8080/job/royale-asjs_MXTests/ws/mustella/src/main/royale/DontSendScriptComplete.as(22)>: col: 8 Definition flash.events.Event could not be found.
     [java] 
     [java] import flash.events.Event;
     [java]        ^
     [java] 
     [java] Picked up JAVA_TOOL_OPTIONS: -Dfile.encoding=UTF-8 -Xms384m -Xmx2g
     [java] Java Result: 2

compile-js:

main:

basictests-compile-java:
   [delete] Deleting directory <http://apacheroyaleci2.westus2.cloudapp.azure.com:8080/job/royale-asjs_MXTests/ws/mustella/target/classes>
    [mkdir] Created dir: <http://apacheroyaleci2.westus2.cloudapp.azure.com:8080/job/royale-asjs_MXTests/ws/mustella/target/classes>
    [javac] <http://apacheroyaleci2.westus2.cloudapp.azure.com:8080/job/royale-asjs_MXTests/ws/build.xml>:1336: warning: 'includeantruntime' was not set, defaulting to build.sysclasspath=last; set to false for repeatable builds
    [javac] Compiling 12 source files to <http://apacheroyaleci2.westus2.cloudapp.azure.com:8080/job/royale-asjs_MXTests/ws/mustella/target/classes>
    [javac] Note: <http://apacheroyaleci2.westus2.cloudapp.azure.com:8080/job/royale-asjs_MXTests/ws/mustella/src/main/java/marmotinni/DispatchMouseClickEvent.java> uses or overrides a deprecated API.
    [javac] Note: Recompile with -Xlint:deprecation for details.

mxtests-compile-java:

mxtests:
    [mxmlc] MXMLJSC
    [mxmlc] -sdk-js-lib=<http://apacheroyaleci2.westus2.cloudapp.azure.com:8080/job/royale-asjs_MXTests/ws/mustella/js>
    [mxmlc] +env.PLAYERGLOBAL_HOME=C:\adobe\flash
    [mxmlc] -compiler.debug=true
    [mxmlc] +royalelib=<http://apacheroyaleci2.westus2.cloudapp.azure.com:8080/job/royale-asjs_MXTests/ws/frameworks/>
    [mxmlc] -closure-lib=<http://apacheroyaleci2.westus2.cloudapp.azure.com:8080/job/royale-asjs_MXTests/ws/js/lib/google/closure-library>
    [mxmlc] +configname=flex
    [mxmlc] -compiler.library-path+=<http://apacheroyaleci2.westus2.cloudapp.azure.com:8080/job/royale-asjs_MXTests/ws/mustella/mustella.swc>
    [mxmlc] -compiler.js-external-library-path=<http://apacheroyaleci2.westus2.cloudapp.azure.com:8080/job/royale-asjs_MXTests/ws/js/libs/js.swc>
    [mxmlc] -compiler.js-library-path=<http://apacheroyaleci2.westus2.cloudapp.azure.com:8080/job/royale-asjs_MXTests/ws/frameworks/js/libs>
    [mxmlc] -compiler.js-library-path+=<http://apacheroyaleci2.westus2.cloudapp.azure.com:8080/job/royale-asjs_MXTests/ws/mustella/mustella.swc>
    [mxmlc] --
    [mxmlc] <http://apacheroyaleci2.westus2.cloudapp.azure.com:8080/job/royale-asjs_MXTests/ws/mustella/tests/mxtests/basicTests/BasicTests.mxml>
    [mxmlc] Loading configuration: <http://apacheroyaleci2.westus2.cloudapp.azure.com:8080/job/royale-asjs_MXTests/ws/frameworks/flex-config.xml>
    [mxmlc] Loading configuration: <http://apacheroyaleci2.westus2.cloudapp.azure.com:8080/job/royale-asjs_MXTests/ws/mustella/tests/mxtests/basicTests/BasicTests-config.xml>
    [mxmlc] 
    [mxmlc] 390456 bytes written to C:\jenkins\workspace\royale-asjs_MXTests\mustella\tests\mxtests\basicTests\BasicTests.swf in 21.416 seconds
    [mxmlc] <http://apacheroyaleci2.westus2.cloudapp.azure.com:8080/job/royale-asjs_MXTests/ws/frameworks/js/libs/BasicJS.swc> Warning: The definition goog.events.BrowserEvent depended on by org.apache.royale.html.accessories.RestrictTextInputBead in the SWC <http://apacheroyaleci2.westus2.cloudapp.azure.com:8080/job/royale-asjs_MXTests/ws/frameworks/js/libs/BasicJS.swc> could not be found
    [mxmlc] 
    [mxmlc] 
    [mxmlc] <http://apacheroyaleci2.westus2.cloudapp.azure.com:8080/job/royale-asjs_MXTests/ws/frameworks/js/libs/BasicJS.swc> Warning: The definition goog.events depended on by org.apache.royale.html.TextInput in the SWC <http://apacheroyaleci2.westus2.cloudapp.azure.com:8080/job/royale-asjs_MXTests/ws/frameworks/js/libs/BasicJS.swc> could not be found
    [mxmlc] 
    [mxmlc] 
    [mxmlc] <http://apacheroyaleci2.westus2.cloudapp.azure.com:8080/job/royale-asjs_MXTests/ws/frameworks/js/libs/BasicJS.swc> Warning: The definition goog.events depended on by org.apache.royale.html.beads.controllers.SpinnerMouseController in the SWC <http://apacheroyaleci2.westus2.cloudapp.azure.com:8080/job/royale-asjs_MXTests/ws/frameworks/js/libs/BasicJS.swc> could not be found
    [mxmlc] 
    [mxmlc] 
    [mxmlc] <http://apacheroyaleci2.westus2.cloudapp.azure.com:8080/job/royale-asjs_MXTests/ws/frameworks/js/libs/BasicJS.swc> Warning: The definition goog.events.EventType depended on by org.apache.royale.html.beads.controllers.SpinnerMouseController in the SWC <http://apacheroyaleci2.westus2.cloudapp.azure.com:8080/job/royale-asjs_MXTests/ws/frameworks/js/libs/BasicJS.swc> could not be found
    [mxmlc] 
    [mxmlc] 
    [mxmlc] <http://apacheroyaleci2.westus2.cloudapp.azure.com:8080/job/royale-asjs_MXTests/ws/frameworks/js/libs/BasicJS.swc> Warning: The definition goog.events depended on by org.apache.royale.html.beads.controllers.ItemRendererMouseController in the SWC <http://apacheroyaleci2.westus2.cloudapp.azure.com:8080/job/royale-asjs_MXTests/ws/frameworks/js/libs/BasicJS.swc> could not be found
    [mxmlc] 
    [mxmlc] 
    [mxmlc] <http://apacheroyaleci2.westus2.cloudapp.azure.com:8080/job/royale-asjs_MXTests/ws/frameworks/js/libs/BasicJS.swc> Warning: The definition goog.events.EventType depended on by org.apache.royale.html.beads.controllers.ItemRendererMouseController in the SWC <http://apacheroyaleci2.westus2.cloudapp.azure.com:8080/job/royale-asjs_MXTests/ws/frameworks/js/libs/BasicJS.swc> could not be found
    [mxmlc] 
    [mxmlc] 
    [mxmlc] <http://apacheroyaleci2.westus2.cloudapp.azure.com:8080/job/royale-asjs_MXTests/ws/frameworks/js/libs/BasicJS.swc> Warning: The definition goog.events.Event depended on by org.apache.royale.html.beads.controllers.ItemRendererMouseController in the SWC <http://apacheroyaleci2.westus2.cloudapp.azure.com:8080/job/royale-asjs_MXTests/ws/frameworks/js/libs/BasicJS.swc> could not be found
    [mxmlc] 
    [mxmlc] 
    [mxmlc] <http://apacheroyaleci2.westus2.cloudapp.azure.com:8080/job/royale-asjs_MXTests/ws/frameworks/js/libs/CoreJS.swc> Warning: The definition goog.events.Event depended on by org.apache.royale.events.Event in the SWC <http://apacheroyaleci2.westus2.cloudapp.azure.com:8080/job/royale-asjs_MXTests/ws/frameworks/js/libs/CoreJS.swc> could not be found
    [mxmlc] 
    [mxmlc] 
    [mxmlc] <http://apacheroyaleci2.westus2.cloudapp.azure.com:8080/job/royale-asjs_MXTests/ws/frameworks/js/libs/CoreJS.swc> Warning: The definition goog.events depended on by org.apache.royale.core.ElementWrapper in the SWC <http://apacheroyaleci2.westus2.cloudapp.azure.com:8080/job/royale-asjs_MXTests/ws/frameworks/js/libs/CoreJS.swc> could not be found
    [mxmlc] 
    [mxmlc] 
    [mxmlc] <http://apacheroyaleci2.westus2.cloudapp.azure.com:8080/job/royale-asjs_MXTests/ws/frameworks/js/libs/CoreJS.swc> Warning: The definition goog.events.BrowserEvent depended on by org.apache.royale.core.ElementWrapper in the SWC <http://apacheroyaleci2.westus2.cloudapp.azure.com:8080/job/royale-asjs_MXTests/ws/frameworks/js/libs/CoreJS.swc> could not be found
    [mxmlc] 
    [mxmlc] 
    [mxmlc] <http://apacheroyaleci2.westus2.cloudapp.azure.com:8080/job/royale-asjs_MXTests/ws/frameworks/js/libs/CoreJS.swc> Warning: The definition goog.DEBUG depended on by org.apache.royale.core.ElementWrapper in the SWC <http://apacheroyaleci2.westus2.cloudapp.azure.com:8080/job/royale-asjs_MXTests/ws/frameworks/js/libs/CoreJS.swc> could not be found
    [mxmlc] 
    [mxmlc] 
    [mxmlc] <http://apacheroyaleci2.westus2.cloudapp.azure.com:8080/job/royale-asjs_MXTests/ws/frameworks/js/libs/CoreJS.swc> Warning: The definition goog.events.Event depended on by org.apache.royale.events.utils.KeyboardEventConverter in the SWC <http://apacheroyaleci2.westus2.cloudapp.azure.com:8080/job/royale-asjs_MXTests/ws/frameworks/js/libs/CoreJS.swc> could not be found
    [mxmlc] 
    [mxmlc] 
    [mxmlc] <http://apacheroyaleci2.westus2.cloudapp.azure.com:8080/job/royale-asjs_MXTests/ws/frameworks/js/libs/CoreJS.swc> Warning: The definition goog.events.BrowserEvent depended on by org.apache.royale.events.utils.KeyboardEventConverter in the SWC <http://apacheroyaleci2.westus2.cloudapp.azure.com:8080/job/royale-asjs_MXTests/ws/frameworks/js/libs/CoreJS.swc> could not be found
    [mxmlc] 
    [mxmlc] 
    [mxmlc] <http://apacheroyaleci2.westus2.cloudapp.azure.com:8080/job/royale-asjs_MXTests/ws/frameworks/js/libs/CoreJS.swc> Warning: The definition goog.events.BrowserEvent depended on by org.apache.royale.events.MouseEvent in the SWC <http://apacheroyaleci2.westus2.cloudapp.azure.com:8080/job/royale-asjs_MXTests/ws/frameworks/js/libs/CoreJS.swc> could not be found
    [mxmlc] 
    [mxmlc] 
    [mxmlc] <http://apacheroyaleci2.westus2.cloudapp.azure.com:8080/job/royale-asjs_MXTests/ws/frameworks/js/libs/CoreJS.swc> Warning: The definition goog.events depended on by org.apache.royale.events.EventDispatcher in the SWC <http://apacheroyaleci2.westus2.cloudapp.azure.com:8080/job/royale-asjs_MXTests/ws/frameworks/js/libs/CoreJS.swc> could not be found
    [mxmlc] 
    [mxmlc] 
    [mxmlc] <http://apacheroyaleci2.westus2.cloudapp.azure.com:8080/job/royale-asjs_MXTests/ws/frameworks/js/libs/CoreJS.swc> Warning: The definition goog.events.EventTarget depended on by org.apache.royale.events.EventDispatcher in the SWC <http://apacheroyaleci2.westus2.cloudapp.azure.com:8080/job/royale-asjs_MXTests/ws/frameworks/js/libs/CoreJS.swc> could not be found
    [mxmlc] 
    [mxmlc] 
    [mxmlc] <http://apacheroyaleci2.westus2.cloudapp.azure.com:8080/job/royale-asjs_MXTests/ws/frameworks/js/libs/CoreJS.swc> Warning: The definition goog.events.Listener depended on by org.apache.royale.events.EventDispatcher in the SWC <http://apacheroyaleci2.westus2.cloudapp.azure.com:8080/job/royale-asjs_MXTests/ws/frameworks/js/libs/CoreJS.swc> could not be found
    [mxmlc] 
    [mxmlc] 
    [mxmlc] <http://apacheroyaleci2.westus2.cloudapp.azure.com:8080/job/royale-asjs_MXTests/ws/frameworks/js/libs/CoreJS.swc> Warning: The definition goog.events.BrowserEvent depended on by org.apache.royale.events.IBrowserEvent in the SWC <http://apacheroyaleci2.westus2.cloudapp.azure.com:8080/job/royale-asjs_MXTests/ws/frameworks/js/libs/CoreJS.swc> could not be found
    [mxmlc] 
    [mxmlc] 
    [mxmlc] <http://apacheroyaleci2.westus2.cloudapp.azure.com:8080/job/royale-asjs_MXTests/ws/frameworks/js/libs/CoreJS.swc> Warning: The definition goog.DEBUG depended on by org.apache.royale.utils.BinaryData in the SWC <http://apacheroyaleci2.westus2.cloudapp.azure.com:8080/job/royale-asjs_MXTests/ws/frameworks/js/libs/CoreJS.swc> could not be found
    [mxmlc] 
    [mxmlc] 
    [mxmlc] <http://apacheroyaleci2.westus2.cloudapp.azure.com:8080/job/royale-asjs_MXTests/ws/frameworks/js/libs/CoreJS.swc> Warning: The definition goog.events.BrowserEvent depended on by org.apache.royale.events.BrowserEvent in the SWC <http://apacheroyaleci2.westus2.cloudapp.azure.com:8080/job/royale-asjs_MXTests/ws/frameworks/js/libs/CoreJS.swc> could not be found
    [mxmlc] 
    [mxmlc] 
    [mxmlc] <http://apacheroyaleci2.westus2.cloudapp.azure.com:8080/job/royale-asjs_MXTests/ws/frameworks/js/libs/CoreJS.swc> Warning: The definition goog.DEBUG depended on by org.apache.royale.debugging.assert in the SWC <http://apacheroyaleci2.westus2.cloudapp.azure.com:8080/job/royale-asjs_MXTests/ws/frameworks/js/libs/CoreJS.swc> could not be found
    [mxmlc] 
    [mxmlc] 
    [mxmlc] <http://apacheroyaleci2.westus2.cloudapp.azure.com:8080/job/royale-asjs_MXTests/ws/frameworks/js/libs/CoreJS.swc> Warning: The definition goog.bind depended on by org.apache.royale.utils.MXMLDataInterpreter in the SWC <http://apacheroyaleci2.westus2.cloudapp.azure.com:8080/job/royale-asjs_MXTests/ws/frameworks/js/libs/CoreJS.swc> could not be found
    [mxmlc] 
    [mxmlc] 
    [mxmlc] <http://apacheroyaleci2.westus2.cloudapp.azure.com:8080/job/royale-asjs_MXTests/ws/frameworks/js/libs/CoreJS.swc> Warning: The definition goog.events.BrowserEvent depended on by org.apache.royale.events.KeyboardEvent in the SWC <http://apacheroyaleci2.westus2.cloudapp.azure.com:8080/job/royale-asjs_MXTests/ws/frameworks/js/libs/CoreJS.swc> could not be found
    [mxmlc] 
    [mxmlc] 
    [mxmlc] <http://apacheroyaleci2.westus2.cloudapp.azure.com:8080/job/royale-asjs_MXTests/ws/frameworks/js/libs/CoreJS.swc> Warning: The definition goog.DEBUG depended on by org.apache.royale.debugging.assertType in the SWC <http://apacheroyaleci2.westus2.cloudapp.azure.com:8080/job/royale-asjs_MXTests/ws/frameworks/js/libs/CoreJS.swc> could not be found
    [mxmlc] 
    [mxmlc] 
    [mxmlc] <http://apacheroyaleci2.westus2.cloudapp.azure.com:8080/job/royale-asjs_MXTests/ws/frameworks/js/libs/CoreJS.swc> Warning: The definition goog.DEBUG depended on by org.apache.royale.debugging.throwError in the SWC <http://apacheroyaleci2.westus2.cloudapp.azure.com:8080/job/royale-asjs_MXTests/ws/frameworks/js/libs/CoreJS.swc> could not be found
    [mxmlc] 
    [mxmlc] 
    [mxmlc] <http://apacheroyaleci2.westus2.cloudapp.azure.com:8080/job/royale-asjs_MXTests/ws/frameworks/js/libs/CoreJS.swc> Warning: The definition goog.events.Event depended on by org.apache.royale.events.utils.MouseEventConverter in the SWC <http://apacheroyaleci2.westus2.cloudapp.azure.com:8080/job/royale-asjs_MXTests/ws/frameworks/js/libs/CoreJS.swc> could not be found
    [mxmlc] 
    [mxmlc] 
    [mxmlc] <http://apacheroyaleci2.westus2.cloudapp.azure.com:8080/job/royale-asjs_MXTests/ws/frameworks/js/libs/CoreJS.swc> Warning: The definition goog.events.BrowserEvent depended on by org.apache.royale.events.utils.MouseEventConverter in the SWC <http://apacheroyaleci2.westus2.cloudapp.azure.com:8080/job/royale-asjs_MXTests/ws/frameworks/js/libs/CoreJS.swc> could not be found
    [mxmlc] 
    [mxmlc] 
    [mxmlc] <http://apacheroyaleci2.westus2.cloudapp.azure.com:8080/job/royale-asjs_MXTests/ws/frameworks/js/libs/LanguageJS.swc> Warning: The definition goog.bind depended on by org.apache.royale.utils.Language in the SWC <http://apacheroyaleci2.westus2.cloudapp.azure.com:8080/job/royale-asjs_MXTests/ws/frameworks/js/libs/LanguageJS.swc> could not be found
    [mxmlc] 
    [mxmlc] 
    [mxmlc] <http://apacheroyaleci2.westus2.cloudapp.azure.com:8080/job/royale-asjs_MXTests/ws/frameworks/js/libs/LanguageJS.swc> Warning: The definition goog.global depended on by org.apache.royale.utils.Language in the SWC <http://apacheroyaleci2.westus2.cloudapp.azure.com:8080/job/royale-asjs_MXTests/ws/frameworks/js/libs/LanguageJS.swc> could not be found
    [mxmlc] 
    [mxmlc] 
    [mxmlc] <http://apacheroyaleci2.westus2.cloudapp.azure.com:8080/job/royale-asjs_MXTests/ws/frameworks/js/libs/LanguageJS.swc> Warning: The definition goog.DEBUG depended on by org.apache.royale.utils.Language in the SWC <http://apacheroyaleci2.westus2.cloudapp.azure.com:8080/job/royale-asjs_MXTests/ws/frameworks/js/libs/LanguageJS.swc> could not be found
    [mxmlc] 
    [mxmlc] 
    [mxmlc] <http://apacheroyaleci2.westus2.cloudapp.azure.com:8080/job/royale-asjs_MXTests/ws/frameworks/js/libs/MXRoyaleJS.swc> Warning: The definition goog.events depended on by mx.controls.TextArea in the SWC <http://apacheroyaleci2.westus2.cloudapp.azure.com:8080/job/royale-asjs_MXTests/ws/frameworks/js/libs/MXRoyaleJS.swc> could not be found
    [mxmlc] 
    [mxmlc] 
    [mxmlc] <http://apacheroyaleci2.westus2.cloudapp.azure.com:8080/job/royale-asjs_MXTests/ws/frameworks/js/libs/MXRoyaleJS.swc> Warning: The definition goog.events.BrowserEvent depended on by mx.events.utils.FocusEventConverter in the SWC <http://apacheroyaleci2.westus2.cloudapp.azure.com:8080/job/royale-asjs_MXTests/ws/frameworks/js/libs/MXRoyaleJS.swc> could not be found
    [mxmlc] 
    [mxmlc] 
    [mxmlc] <http://apacheroyaleci2.westus2.cloudapp.azure.com:8080/job/royale-asjs_MXTests/ws/frameworks/js/libs/MXRoyaleJS.swc> Warning: The definition goog.events depended on by mx.controls.TextInput in the SWC <http://apacheroyaleci2.westus2.cloudapp.azure.com:8080/job/royale-asjs_MXTests/ws/frameworks/js/libs/MXRoyaleJS.swc> could not be found
    [mxmlc] 
    [mxmlc] 
    [mxmlc] <http://apacheroyaleci2.westus2.cloudapp.azure.com:8080/job/royale-asjs_MXTests/ws/frameworks/js/libs/MXRoyaleJS.swc> Warning: The definition goog.events.Event depended on by mx.events.utils.KeyboardEventConverter in the SWC <http://apacheroyaleci2.westus2.cloudapp.azure.com:8080/job/royale-asjs_MXTests/ws/frameworks/js/libs/MXRoyaleJS.swc> could not be found
    [mxmlc] 
    [mxmlc] 
    [mxmlc] <http://apacheroyaleci2.westus2.cloudapp.azure.com:8080/job/royale-asjs_MXTests/ws/frameworks/js/libs/MXRoyaleJS.swc> Warning: The definition goog.events.BrowserEvent depended on by mx.events.utils.KeyboardEventConverter in the SWC <http://apacheroyaleci2.westus2.cloudapp.azure.com:8080/job/royale-asjs_MXTests/ws/frameworks/js/libs/MXRoyaleJS.swc> could not be found
    [mxmlc] 
    [mxmlc] 
    [mxmlc] <http://apacheroyaleci2.westus2.cloudapp.azure.com:8080/job/royale-asjs_MXTests/ws/frameworks/js/libs/MXRoyaleJS.swc> Warning: The definition goog.events.Event depended on by mx.events.utils.MouseEventConverter in the SWC <http://apacheroyaleci2.westus2.cloudapp.azure.com:8080/job/royale-asjs_MXTests/ws/frameworks/js/libs/MXRoyaleJS.swc> could not be found
    [mxmlc] 
    [mxmlc] 
    [mxmlc] <http://apacheroyaleci2.westus2.cloudapp.azure.com:8080/job/royale-asjs_MXTests/ws/frameworks/js/libs/MXRoyaleJS.swc> Warning: The definition goog.events.BrowserEvent depended on by mx.events.utils.MouseEventConverter in the SWC <http://apacheroyaleci2.westus2.cloudapp.azure.com:8080/job/royale-asjs_MXTests/ws/frameworks/js/libs/MXRoyaleJS.swc> could not be found
    [mxmlc] 
    [mxmlc] 
    [mxmlc] <http://apacheroyaleci2.westus2.cloudapp.azure.com:8080/job/royale-asjs_MXTests/ws/frameworks/js/libs/MXRoyaleJS.swc> Warning: The definition goog.DEBUG depended on by mx.utils.ObjectUtil in the SWC <http://apacheroyaleci2.westus2.cloudapp.azure.com:8080/job/royale-asjs_MXTests/ws/frameworks/js/libs/MXRoyaleJS.swc> could not be found
    [mxmlc] 
    [mxmlc] 
    [mxmlc] <http://apacheroyaleci2.westus2.cloudapp.azure.com:8080/job/royale-asjs_MXTests/ws/frameworks/js/libs/NetworkJS.swc> Warning: The definition goog.DEBUG depended on by org.apache.royale.net.remoting.amf.AMFBinaryData in the SWC <http://apacheroyaleci2.westus2.cloudapp.azure.com:8080/job/royale-asjs_MXTests/ws/frameworks/js/libs/NetworkJS.swc> could not be found
    [mxmlc] 
    [mxmlc] 
    [mxmlc] <http://apacheroyaleci2.westus2.cloudapp.azure.com:8080/job/royale-asjs_MXTests/ws/frameworks/js/libs/ReflectionJS.swc> Warning: The definition goog.DEBUG depended on by org.apache.royale.reflection.getDynamicFields in the SWC <http://apacheroyaleci2.westus2.cloudapp.azure.com:8080/job/royale-asjs_MXTests/ws/frameworks/js/libs/ReflectionJS.swc> could not be found
    [mxmlc] 
    [mxmlc] 
    [mxmlc] <http://apacheroyaleci2.westus2.cloudapp.azure.com:8080/job/royale-asjs_MXTests/ws/frameworks/js/libs/ReflectionJS.swc> Warning: The definition goog.DEBUG depended on by org.apache.royale.reflection.VariableDefinition in the SWC <http://apacheroyaleci2.westus2.cloudapp.azure.com:8080/job/royale-asjs_MXTests/ws/frameworks/js/libs/ReflectionJS.swc> could not be found
    [mxmlc] 
    [mxmlc] 
    [mxmlc] <http://apacheroyaleci2.westus2.cloudapp.azure.com:8080/job/royale-asjs_MXTests/ws/frameworks/js/libs/ReflectionJS.swc> Warning: The definition goog.global depended on by org.apache.royale.reflection.getDefinitionByName in the SWC <http://apacheroyaleci2.westus2.cloudapp.azure.com:8080/job/royale-asjs_MXTests/ws/frameworks/js/libs/ReflectionJS.swc> could not be found
    [mxmlc] 
    [mxmlc] 
    [mxmlc] <http://apacheroyaleci2.westus2.cloudapp.azure.com:8080/job/royale-asjs_MXTests/ws/frameworks/js/libs/ReflectionJS.swc> Warning: The definition goog.DEBUG depended on by org.apache.royale.reflection.AccessorDefinition in the SWC <http://apacheroyaleci2.westus2.cloudapp.azure.com:8080/job/royale-asjs_MXTests/ws/frameworks/js/libs/ReflectionJS.swc> could not be found
    [mxmlc] 
    [mxmlc] 
    [mxmlc] <http://apacheroyaleci2.westus2.cloudapp.azure.com:8080/job/royale-asjs_MXTests/ws/frameworks/js/libs/SparkRoyaleJS.swc> Warning: The definition goog.DEBUG depended on by spark.components.supportClasses.SkinnableComponent in the SWC <http://apacheroyaleci2.westus2.cloudapp.azure.com:8080/job/royale-asjs_MXTests/ws/frameworks/js/libs/SparkRoyaleJS.swc> could not be found
    [mxmlc] 
    [mxmlc] 
    [mxmlc] The project 'BasicTests' has been successfully compiled.
    [mxmlc] 40.233919 seconds
    [mxmlc] Picked up JAVA_TOOL_OPTIONS: -Dfile.encoding=UTF-8 -Xms384m -Xmx2g
     [echo] launching player and swf C:\adobe\flash\11.7\flashplayerdebugger.exe <http://apacheroyaleci2.westus2.cloudapp.azure.com:8080/job/royale-asjs_MXTests/ws/mustella/tests/mxtests/basicTests/BasicTests.swf>

mustellaresultsparser:
     [java] test case SetupListAndDataGridTest&result=fail&elapsed=708&phase=body&started=1583535635391&extraInfo=&msg=TypeError: failed
     [java] results: FAILED

BUILD FAILED
<http://apacheroyaleci2.westus2.cloudapp.azure.com:8080/job/royale-asjs_MXTests/ws/build.xml>:1532: The following error occurred while executing this line:
<http://apacheroyaleci2.westus2.cloudapp.azure.com:8080/job/royale-asjs_MXTests/ws/build.xml>:1459: Java returned: 1

Total time: 25 minutes 33 seconds
Picked up JAVA_TOOL_OPTIONS: -Dfile.encoding=UTF-8 -Xms384m -Xmx2g
Build step 'Invoke Ant' marked build as failure
Archiving artifacts

Jenkins build is back to normal : royale-asjs_MXTests #736

Posted by ap...@gmail.com.
See <http://apacheroyaleci2.westus2.cloudapp.azure.com:8080/job/royale-asjs_MXTests/736/display/redirect?page=changes>


Build failed in Jenkins: royale-asjs_MXTests #735

Posted by ap...@gmail.com.
See <http://apacheroyaleci2.westus2.cloudapp.azure.com:8080/job/royale-asjs_MXTests/735/display/redirect?page=changes>

Changes:

[carlosrovira] jewel-datagrid: removed default height. If height is not provided

[carlosrovira] tour-de-jewel: some datagrid updates to examples


------------------------------------------
[...truncated 952.37 KB...]
checkintests:

mxtests-clean:
   [delete] Deleting directory <http://apacheroyaleci2.westus2.cloudapp.azure.com:8080/job/royale-asjs_MXTests/ws/mustella/tests/mxtests/basicTests/bin>

check-air-home:
     [echo] AIR_HOME is C:\adobe\air\4.0\AdobeAIRSDK

check-runtime-env:

runtime-setup:

load-task:

marmotinni-setup:

prepare:
     [echo] Making lib directory <http://apacheroyaleci2.westus2.cloudapp.azure.com:8080/job/royale-asjs_MXTests/ws/marmotinni/java/c>:\jenkins\workspace\royale-asjs_MXTests\marmotinni\java/lib

selenium3-jar-check:

selenium3-jar:

main:

clean:
   [delete] Deleting: <http://apacheroyaleci2.westus2.cloudapp.azure.com:8080/job/royale-asjs_MXTests/ws/mustella/mustella.swc>

check-compiler-home:

check-compiler:

compile:
     [echo] Compiling mustella.swc
     [echo] ROYALE_HOME: <http://apacheroyaleci2.westus2.cloudapp.azure.com:8080/job/royale-asjs_MXTests/ws/>
     [echo] ROYALE_COMPILER_HOME: <http://apacheroyaleci2.westus2.cloudapp.azure.com:8080/job/royale-asjs_MXTests/ws/js>
     [java] args:
     [java] +royalelib=<http://apacheroyaleci2.westus2.cloudapp.azure.com:8080/job/royale-asjs_MXTests/ws/frameworks>
     [java] +playerglobal.version=11.7
     [java] +env.PLAYERGLOBAL_HOME=C:\adobe\flash
     [java] +env.AIR_HOME=C:\adobe\air\4.0\AdobeAIRSDK
     [java] -compiler.strict-xml=true
     [java] -compiler.targets=SWF,JSRoyale
     [java] -output=<http://apacheroyaleci2.westus2.cloudapp.azure.com:8080/job/royale-asjs_MXTests/ws/mustella/mustella.swc>
     [java] -load-config=<http://apacheroyaleci2.westus2.cloudapp.azure.com:8080/job/royale-asjs_MXTests/ws/mustella/src/main/config/compile-swf-config.xml>
     [java] -js-load-config=<http://apacheroyaleci2.westus2.cloudapp.azure.com:8080/job/royale-asjs_MXTests/ws/frameworks/js-config.xml>
     [java] -js-load-config+=<http://apacheroyaleci2.westus2.cloudapp.azure.com:8080/job/royale-asjs_MXTests/ws/mustella/src/main/config/compile-js-config.xml>
     [java] target:SWF
     [java] target:JSRoyale
     [java] COMPC
     [java] Loading configuration: <http://apacheroyaleci2.westus2.cloudapp.azure.com:8080/job/royale-asjs_MXTests/ws/mustella/src/main/config/compile-swf-config.xml>
     [java] 
     [java] 58056 bytes written to C:\jenkins\workspace\royale-asjs_MXTests\mustella\mustella.swc in 2.938 seconds
     [java] COMPCJSCRoyale
     [java] 7.7260463 seconds
     [java] <http://apacheroyaleci2.westus2.cloudapp.azure.com:8080/job/royale-asjs_MXTests/ws/mustella/src/main/royale/DontSendScriptComplete.as(21)>: col: 8 No definitions matching flash.net.* could be found.
     [java] 
     [java] import flash.net.*;
     [java]        ^
     [java] 
     [java] <http://apacheroyaleci2.westus2.cloudapp.azure.com:8080/job/royale-asjs_MXTests/ws/mustella/src/main/royale/DontSendScriptComplete.as(22)>: col: 8 Definition flash.events.Event could not be found.
     [java] 
     [java] import flash.events.Event;
     [java]        ^
     [java] 
     [java] Picked up JAVA_TOOL_OPTIONS: -Dfile.encoding=UTF-8 -Xms384m -Xmx2g
     [java] Java Result: 2

compile-js:

main:

basictests-compile-java:
   [delete] Deleting directory <http://apacheroyaleci2.westus2.cloudapp.azure.com:8080/job/royale-asjs_MXTests/ws/mustella/target/classes>
    [mkdir] Created dir: <http://apacheroyaleci2.westus2.cloudapp.azure.com:8080/job/royale-asjs_MXTests/ws/mustella/target/classes>
    [javac] <http://apacheroyaleci2.westus2.cloudapp.azure.com:8080/job/royale-asjs_MXTests/ws/build.xml>:1336: warning: 'includeantruntime' was not set, defaulting to build.sysclasspath=last; set to false for repeatable builds
    [javac] Compiling 12 source files to <http://apacheroyaleci2.westus2.cloudapp.azure.com:8080/job/royale-asjs_MXTests/ws/mustella/target/classes>
    [javac] Note: <http://apacheroyaleci2.westus2.cloudapp.azure.com:8080/job/royale-asjs_MXTests/ws/mustella/src/main/java/marmotinni/DispatchMouseClickEvent.java> uses or overrides a deprecated API.
    [javac] Note: Recompile with -Xlint:deprecation for details.

mxtests-compile-java:

mxtests:
    [mxmlc] MXMLJSC
    [mxmlc] -sdk-js-lib=<http://apacheroyaleci2.westus2.cloudapp.azure.com:8080/job/royale-asjs_MXTests/ws/mustella/js>
    [mxmlc] +env.PLAYERGLOBAL_HOME=C:\adobe\flash
    [mxmlc] -compiler.debug=true
    [mxmlc] +royalelib=<http://apacheroyaleci2.westus2.cloudapp.azure.com:8080/job/royale-asjs_MXTests/ws/frameworks/>
    [mxmlc] -closure-lib=<http://apacheroyaleci2.westus2.cloudapp.azure.com:8080/job/royale-asjs_MXTests/ws/js/lib/google/closure-library>
    [mxmlc] +configname=flex
    [mxmlc] -compiler.library-path+=<http://apacheroyaleci2.westus2.cloudapp.azure.com:8080/job/royale-asjs_MXTests/ws/mustella/mustella.swc>
    [mxmlc] -compiler.js-external-library-path=<http://apacheroyaleci2.westus2.cloudapp.azure.com:8080/job/royale-asjs_MXTests/ws/js/libs/js.swc>
    [mxmlc] -compiler.js-library-path=<http://apacheroyaleci2.westus2.cloudapp.azure.com:8080/job/royale-asjs_MXTests/ws/frameworks/js/libs>
    [mxmlc] -compiler.js-library-path+=<http://apacheroyaleci2.westus2.cloudapp.azure.com:8080/job/royale-asjs_MXTests/ws/mustella/mustella.swc>
    [mxmlc] --
    [mxmlc] <http://apacheroyaleci2.westus2.cloudapp.azure.com:8080/job/royale-asjs_MXTests/ws/mustella/tests/mxtests/basicTests/BasicTests.mxml>
    [mxmlc] Loading configuration: <http://apacheroyaleci2.westus2.cloudapp.azure.com:8080/job/royale-asjs_MXTests/ws/frameworks/flex-config.xml>
    [mxmlc] Loading configuration: <http://apacheroyaleci2.westus2.cloudapp.azure.com:8080/job/royale-asjs_MXTests/ws/mustella/tests/mxtests/basicTests/BasicTests-config.xml>
    [mxmlc] 
    [mxmlc] 390454 bytes written to C:\jenkins\workspace\royale-asjs_MXTests\mustella\tests\mxtests\basicTests\BasicTests.swf in 18.008 seconds
    [mxmlc] <http://apacheroyaleci2.westus2.cloudapp.azure.com:8080/job/royale-asjs_MXTests/ws/frameworks/js/libs/BasicJS.swc> Warning: The definition goog.events.BrowserEvent depended on by org.apache.royale.html.accessories.RestrictTextInputBead in the SWC <http://apacheroyaleci2.westus2.cloudapp.azure.com:8080/job/royale-asjs_MXTests/ws/frameworks/js/libs/BasicJS.swc> could not be found
    [mxmlc] 
    [mxmlc] 
    [mxmlc] <http://apacheroyaleci2.westus2.cloudapp.azure.com:8080/job/royale-asjs_MXTests/ws/frameworks/js/libs/BasicJS.swc> Warning: The definition goog.events depended on by org.apache.royale.html.beads.controllers.SpinnerMouseController in the SWC <http://apacheroyaleci2.westus2.cloudapp.azure.com:8080/job/royale-asjs_MXTests/ws/frameworks/js/libs/BasicJS.swc> could not be found
    [mxmlc] 
    [mxmlc] 
    [mxmlc] <http://apacheroyaleci2.westus2.cloudapp.azure.com:8080/job/royale-asjs_MXTests/ws/frameworks/js/libs/BasicJS.swc> Warning: The definition goog.events.EventType depended on by org.apache.royale.html.beads.controllers.SpinnerMouseController in the SWC <http://apacheroyaleci2.westus2.cloudapp.azure.com:8080/job/royale-asjs_MXTests/ws/frameworks/js/libs/BasicJS.swc> could not be found
    [mxmlc] 
    [mxmlc] 
    [mxmlc] <http://apacheroyaleci2.westus2.cloudapp.azure.com:8080/job/royale-asjs_MXTests/ws/frameworks/js/libs/BasicJS.swc> Warning: The definition goog.events depended on by org.apache.royale.html.TextInput in the SWC <http://apacheroyaleci2.westus2.cloudapp.azure.com:8080/job/royale-asjs_MXTests/ws/frameworks/js/libs/BasicJS.swc> could not be found
    [mxmlc] 
    [mxmlc] 
    [mxmlc] <http://apacheroyaleci2.westus2.cloudapp.azure.com:8080/job/royale-asjs_MXTests/ws/frameworks/js/libs/BasicJS.swc> Warning: The definition goog.events depended on by org.apache.royale.html.beads.controllers.ItemRendererMouseController in the SWC <http://apacheroyaleci2.westus2.cloudapp.azure.com:8080/job/royale-asjs_MXTests/ws/frameworks/js/libs/BasicJS.swc> could not be found
    [mxmlc] 
    [mxmlc] 
    [mxmlc] <http://apacheroyaleci2.westus2.cloudapp.azure.com:8080/job/royale-asjs_MXTests/ws/frameworks/js/libs/BasicJS.swc> Warning: The definition goog.events.EventType depended on by org.apache.royale.html.beads.controllers.ItemRendererMouseController in the SWC <http://apacheroyaleci2.westus2.cloudapp.azure.com:8080/job/royale-asjs_MXTests/ws/frameworks/js/libs/BasicJS.swc> could not be found
    [mxmlc] 
    [mxmlc] 
    [mxmlc] <http://apacheroyaleci2.westus2.cloudapp.azure.com:8080/job/royale-asjs_MXTests/ws/frameworks/js/libs/BasicJS.swc> Warning: The definition goog.events.Event depended on by org.apache.royale.html.beads.controllers.ItemRendererMouseController in the SWC <http://apacheroyaleci2.westus2.cloudapp.azure.com:8080/job/royale-asjs_MXTests/ws/frameworks/js/libs/BasicJS.swc> could not be found
    [mxmlc] 
    [mxmlc] 
    [mxmlc] <http://apacheroyaleci2.westus2.cloudapp.azure.com:8080/job/royale-asjs_MXTests/ws/frameworks/js/libs/CoreJS.swc> Warning: The definition goog.bind depended on by org.apache.royale.utils.MXMLDataInterpreter in the SWC <http://apacheroyaleci2.westus2.cloudapp.azure.com:8080/job/royale-asjs_MXTests/ws/frameworks/js/libs/CoreJS.swc> could not be found
    [mxmlc] 
    [mxmlc] 
    [mxmlc] <http://apacheroyaleci2.westus2.cloudapp.azure.com:8080/job/royale-asjs_MXTests/ws/frameworks/js/libs/CoreJS.swc> Warning: The definition goog.events.Event depended on by org.apache.royale.events.utils.MouseEventConverter in the SWC <http://apacheroyaleci2.westus2.cloudapp.azure.com:8080/job/royale-asjs_MXTests/ws/frameworks/js/libs/CoreJS.swc> could not be found
    [mxmlc] 
    [mxmlc] 
    [mxmlc] <http://apacheroyaleci2.westus2.cloudapp.azure.com:8080/job/royale-asjs_MXTests/ws/frameworks/js/libs/CoreJS.swc> Warning: The definition goog.events.BrowserEvent depended on by org.apache.royale.events.utils.MouseEventConverter in the SWC <http://apacheroyaleci2.westus2.cloudapp.azure.com:8080/job/royale-asjs_MXTests/ws/frameworks/js/libs/CoreJS.swc> could not be found
    [mxmlc] 
    [mxmlc] 
    [mxmlc] <http://apacheroyaleci2.westus2.cloudapp.azure.com:8080/job/royale-asjs_MXTests/ws/frameworks/js/libs/CoreJS.swc> Warning: The definition goog.DEBUG depended on by org.apache.royale.debugging.throwError in the SWC <http://apacheroyaleci2.westus2.cloudapp.azure.com:8080/job/royale-asjs_MXTests/ws/frameworks/js/libs/CoreJS.swc> could not be found
    [mxmlc] 
    [mxmlc] 
    [mxmlc] <http://apacheroyaleci2.westus2.cloudapp.azure.com:8080/job/royale-asjs_MXTests/ws/frameworks/js/libs/CoreJS.swc> Warning: The definition goog.DEBUG depended on by org.apache.royale.debugging.assert in the SWC <http://apacheroyaleci2.westus2.cloudapp.azure.com:8080/job/royale-asjs_MXTests/ws/frameworks/js/libs/CoreJS.swc> could not be found
    [mxmlc] 
    [mxmlc] 
    [mxmlc] <http://apacheroyaleci2.westus2.cloudapp.azure.com:8080/job/royale-asjs_MXTests/ws/frameworks/js/libs/CoreJS.swc> Warning: The definition goog.events.BrowserEvent depended on by org.apache.royale.events.BrowserEvent in the SWC <http://apacheroyaleci2.westus2.cloudapp.azure.com:8080/job/royale-asjs_MXTests/ws/frameworks/js/libs/CoreJS.swc> could not be found
    [mxmlc] 
    [mxmlc] 
    [mxmlc] <http://apacheroyaleci2.westus2.cloudapp.azure.com:8080/job/royale-asjs_MXTests/ws/frameworks/js/libs/CoreJS.swc> Warning: The definition goog.events.BrowserEvent depended on by org.apache.royale.events.IBrowserEvent in the SWC <http://apacheroyaleci2.westus2.cloudapp.azure.com:8080/job/royale-asjs_MXTests/ws/frameworks/js/libs/CoreJS.swc> could not be found
    [mxmlc] 
    [mxmlc] 
    [mxmlc] <http://apacheroyaleci2.westus2.cloudapp.azure.com:8080/job/royale-asjs_MXTests/ws/frameworks/js/libs/CoreJS.swc> Warning: The definition goog.events depended on by org.apache.royale.core.ElementWrapper in the SWC <http://apacheroyaleci2.westus2.cloudapp.azure.com:8080/job/royale-asjs_MXTests/ws/frameworks/js/libs/CoreJS.swc> could not be found
    [mxmlc] 
    [mxmlc] 
    [mxmlc] <http://apacheroyaleci2.westus2.cloudapp.azure.com:8080/job/royale-asjs_MXTests/ws/frameworks/js/libs/CoreJS.swc> Warning: The definition goog.events.BrowserEvent depended on by org.apache.royale.core.ElementWrapper in the SWC <http://apacheroyaleci2.westus2.cloudapp.azure.com:8080/job/royale-asjs_MXTests/ws/frameworks/js/libs/CoreJS.swc> could not be found
    [mxmlc] 
    [mxmlc] 
    [mxmlc] <http://apacheroyaleci2.westus2.cloudapp.azure.com:8080/job/royale-asjs_MXTests/ws/frameworks/js/libs/CoreJS.swc> Warning: The definition goog.DEBUG depended on by org.apache.royale.core.ElementWrapper in the SWC <http://apacheroyaleci2.westus2.cloudapp.azure.com:8080/job/royale-asjs_MXTests/ws/frameworks/js/libs/CoreJS.swc> could not be found
    [mxmlc] 
    [mxmlc] 
    [mxmlc] <http://apacheroyaleci2.westus2.cloudapp.azure.com:8080/job/royale-asjs_MXTests/ws/frameworks/js/libs/CoreJS.swc> Warning: The definition goog.events.Event depended on by org.apache.royale.events.utils.KeyboardEventConverter in the SWC <http://apacheroyaleci2.westus2.cloudapp.azure.com:8080/job/royale-asjs_MXTests/ws/frameworks/js/libs/CoreJS.swc> could not be found
    [mxmlc] 
    [mxmlc] 
    [mxmlc] <http://apacheroyaleci2.westus2.cloudapp.azure.com:8080/job/royale-asjs_MXTests/ws/frameworks/js/libs/CoreJS.swc> Warning: The definition goog.events.BrowserEvent depended on by org.apache.royale.events.utils.KeyboardEventConverter in the SWC <http://apacheroyaleci2.westus2.cloudapp.azure.com:8080/job/royale-asjs_MXTests/ws/frameworks/js/libs/CoreJS.swc> could not be found
    [mxmlc] 
    [mxmlc] 
    [mxmlc] <http://apacheroyaleci2.westus2.cloudapp.azure.com:8080/job/royale-asjs_MXTests/ws/frameworks/js/libs/CoreJS.swc> Warning: The definition goog.events.BrowserEvent depended on by org.apache.royale.events.KeyboardEvent in the SWC <http://apacheroyaleci2.westus2.cloudapp.azure.com:8080/job/royale-asjs_MXTests/ws/frameworks/js/libs/CoreJS.swc> could not be found
    [mxmlc] 
    [mxmlc] 
    [mxmlc] <http://apacheroyaleci2.westus2.cloudapp.azure.com:8080/job/royale-asjs_MXTests/ws/frameworks/js/libs/CoreJS.swc> Warning: The definition goog.DEBUG depended on by org.apache.royale.utils.BinaryData in the SWC <http://apacheroyaleci2.westus2.cloudapp.azure.com:8080/job/royale-asjs_MXTests/ws/frameworks/js/libs/CoreJS.swc> could not be found
    [mxmlc] 
    [mxmlc] 
    [mxmlc] <http://apacheroyaleci2.westus2.cloudapp.azure.com:8080/job/royale-asjs_MXTests/ws/frameworks/js/libs/CoreJS.swc> Warning: The definition goog.events depended on by org.apache.royale.events.EventDispatcher in the SWC <http://apacheroyaleci2.westus2.cloudapp.azure.com:8080/job/royale-asjs_MXTests/ws/frameworks/js/libs/CoreJS.swc> could not be found
    [mxmlc] 
    [mxmlc] 
    [mxmlc] <http://apacheroyaleci2.westus2.cloudapp.azure.com:8080/job/royale-asjs_MXTests/ws/frameworks/js/libs/CoreJS.swc> Warning: The definition goog.events.EventTarget depended on by org.apache.royale.events.EventDispatcher in the SWC <http://apacheroyaleci2.westus2.cloudapp.azure.com:8080/job/royale-asjs_MXTests/ws/frameworks/js/libs/CoreJS.swc> could not be found
    [mxmlc] 
    [mxmlc] 
    [mxmlc] <http://apacheroyaleci2.westus2.cloudapp.azure.com:8080/job/royale-asjs_MXTests/ws/frameworks/js/libs/CoreJS.swc> Warning: The definition goog.events.Listener depended on by org.apache.royale.events.EventDispatcher in the SWC <http://apacheroyaleci2.westus2.cloudapp.azure.com:8080/job/royale-asjs_MXTests/ws/frameworks/js/libs/CoreJS.swc> could not be found
    [mxmlc] 
    [mxmlc] 
    [mxmlc] <http://apacheroyaleci2.westus2.cloudapp.azure.com:8080/job/royale-asjs_MXTests/ws/frameworks/js/libs/CoreJS.swc> Warning: The definition goog.DEBUG depended on by org.apache.royale.debugging.assertType in the SWC <http://apacheroyaleci2.westus2.cloudapp.azure.com:8080/job/royale-asjs_MXTests/ws/frameworks/js/libs/CoreJS.swc> could not be found
    [mxmlc] 
    [mxmlc] 
    [mxmlc] <http://apacheroyaleci2.westus2.cloudapp.azure.com:8080/job/royale-asjs_MXTests/ws/frameworks/js/libs/CoreJS.swc> Warning: The definition goog.events.Event depended on by org.apache.royale.events.Event in the SWC <http://apacheroyaleci2.westus2.cloudapp.azure.com:8080/job/royale-asjs_MXTests/ws/frameworks/js/libs/CoreJS.swc> could not be found
    [mxmlc] 
    [mxmlc] 
    [mxmlc] <http://apacheroyaleci2.westus2.cloudapp.azure.com:8080/job/royale-asjs_MXTests/ws/frameworks/js/libs/CoreJS.swc> Warning: The definition goog.events.BrowserEvent depended on by org.apache.royale.events.MouseEvent in the SWC <http://apacheroyaleci2.westus2.cloudapp.azure.com:8080/job/royale-asjs_MXTests/ws/frameworks/js/libs/CoreJS.swc> could not be found
    [mxmlc] 
    [mxmlc] 
    [mxmlc] <http://apacheroyaleci2.westus2.cloudapp.azure.com:8080/job/royale-asjs_MXTests/ws/frameworks/js/libs/LanguageJS.swc> Warning: The definition goog.bind depended on by org.apache.royale.utils.Language in the SWC <http://apacheroyaleci2.westus2.cloudapp.azure.com:8080/job/royale-asjs_MXTests/ws/frameworks/js/libs/LanguageJS.swc> could not be found
    [mxmlc] 
    [mxmlc] 
    [mxmlc] <http://apacheroyaleci2.westus2.cloudapp.azure.com:8080/job/royale-asjs_MXTests/ws/frameworks/js/libs/LanguageJS.swc> Warning: The definition goog.global depended on by org.apache.royale.utils.Language in the SWC <http://apacheroyaleci2.westus2.cloudapp.azure.com:8080/job/royale-asjs_MXTests/ws/frameworks/js/libs/LanguageJS.swc> could not be found
    [mxmlc] 
    [mxmlc] 
    [mxmlc] <http://apacheroyaleci2.westus2.cloudapp.azure.com:8080/job/royale-asjs_MXTests/ws/frameworks/js/libs/LanguageJS.swc> Warning: The definition goog.DEBUG depended on by org.apache.royale.utils.Language in the SWC <http://apacheroyaleci2.westus2.cloudapp.azure.com:8080/job/royale-asjs_MXTests/ws/frameworks/js/libs/LanguageJS.swc> could not be found
    [mxmlc] 
    [mxmlc] 
    [mxmlc] <http://apacheroyaleci2.westus2.cloudapp.azure.com:8080/job/royale-asjs_MXTests/ws/frameworks/js/libs/MXRoyaleJS.swc> Warning: The definition goog.DEBUG depended on by mx.utils.ObjectUtil in the SWC <http://apacheroyaleci2.westus2.cloudapp.azure.com:8080/job/royale-asjs_MXTests/ws/frameworks/js/libs/MXRoyaleJS.swc> could not be found
    [mxmlc] 
    [mxmlc] 
    [mxmlc] <http://apacheroyaleci2.westus2.cloudapp.azure.com:8080/job/royale-asjs_MXTests/ws/frameworks/js/libs/MXRoyaleJS.swc> Warning: The definition goog.events.BrowserEvent depended on by mx.events.utils.FocusEventConverter in the SWC <http://apacheroyaleci2.westus2.cloudapp.azure.com:8080/job/royale-asjs_MXTests/ws/frameworks/js/libs/MXRoyaleJS.swc> could not be found
    [mxmlc] 
    [mxmlc] 
    [mxmlc] <http://apacheroyaleci2.westus2.cloudapp.azure.com:8080/job/royale-asjs_MXTests/ws/frameworks/js/libs/MXRoyaleJS.swc> Warning: The definition goog.events depended on by mx.controls.TextInput in the SWC <http://apacheroyaleci2.westus2.cloudapp.azure.com:8080/job/royale-asjs_MXTests/ws/frameworks/js/libs/MXRoyaleJS.swc> could not be found
    [mxmlc] 
    [mxmlc] 
    [mxmlc] <http://apacheroyaleci2.westus2.cloudapp.azure.com:8080/job/royale-asjs_MXTests/ws/frameworks/js/libs/MXRoyaleJS.swc> Warning: The definition goog.events.Event depended on by mx.events.utils.MouseEventConverter in the SWC <http://apacheroyaleci2.westus2.cloudapp.azure.com:8080/job/royale-asjs_MXTests/ws/frameworks/js/libs/MXRoyaleJS.swc> could not be found
    [mxmlc] 
    [mxmlc] 
    [mxmlc] <http://apacheroyaleci2.westus2.cloudapp.azure.com:8080/job/royale-asjs_MXTests/ws/frameworks/js/libs/MXRoyaleJS.swc> Warning: The definition goog.events.BrowserEvent depended on by mx.events.utils.MouseEventConverter in the SWC <http://apacheroyaleci2.westus2.cloudapp.azure.com:8080/job/royale-asjs_MXTests/ws/frameworks/js/libs/MXRoyaleJS.swc> could not be found
    [mxmlc] 
    [mxmlc] 
    [mxmlc] <http://apacheroyaleci2.westus2.cloudapp.azure.com:8080/job/royale-asjs_MXTests/ws/frameworks/js/libs/MXRoyaleJS.swc> Warning: The definition goog.events depended on by mx.controls.TextArea in the SWC <http://apacheroyaleci2.westus2.cloudapp.azure.com:8080/job/royale-asjs_MXTests/ws/frameworks/js/libs/MXRoyaleJS.swc> could not be found
    [mxmlc] 
    [mxmlc] 
    [mxmlc] <http://apacheroyaleci2.westus2.cloudapp.azure.com:8080/job/royale-asjs_MXTests/ws/frameworks/js/libs/MXRoyaleJS.swc> Warning: The definition goog.events.Event depended on by mx.events.utils.KeyboardEventConverter in the SWC <http://apacheroyaleci2.westus2.cloudapp.azure.com:8080/job/royale-asjs_MXTests/ws/frameworks/js/libs/MXRoyaleJS.swc> could not be found
    [mxmlc] 
    [mxmlc] 
    [mxmlc] <http://apacheroyaleci2.westus2.cloudapp.azure.com:8080/job/royale-asjs_MXTests/ws/frameworks/js/libs/MXRoyaleJS.swc> Warning: The definition goog.events.BrowserEvent depended on by mx.events.utils.KeyboardEventConverter in the SWC <http://apacheroyaleci2.westus2.cloudapp.azure.com:8080/job/royale-asjs_MXTests/ws/frameworks/js/libs/MXRoyaleJS.swc> could not be found
    [mxmlc] 
    [mxmlc] 
    [mxmlc] <http://apacheroyaleci2.westus2.cloudapp.azure.com:8080/job/royale-asjs_MXTests/ws/frameworks/js/libs/NetworkJS.swc> Warning: The definition goog.DEBUG depended on by org.apache.royale.net.remoting.amf.AMFBinaryData in the SWC <http://apacheroyaleci2.westus2.cloudapp.azure.com:8080/job/royale-asjs_MXTests/ws/frameworks/js/libs/NetworkJS.swc> could not be found
    [mxmlc] 
    [mxmlc] 
    [mxmlc] <http://apacheroyaleci2.westus2.cloudapp.azure.com:8080/job/royale-asjs_MXTests/ws/frameworks/js/libs/ReflectionJS.swc> Warning: The definition goog.global depended on by org.apache.royale.reflection.getDefinitionByName in the SWC <http://apacheroyaleci2.westus2.cloudapp.azure.com:8080/job/royale-asjs_MXTests/ws/frameworks/js/libs/ReflectionJS.swc> could not be found
    [mxmlc] 
    [mxmlc] 
    [mxmlc] <http://apacheroyaleci2.westus2.cloudapp.azure.com:8080/job/royale-asjs_MXTests/ws/frameworks/js/libs/ReflectionJS.swc> Warning: The definition goog.DEBUG depended on by org.apache.royale.reflection.VariableDefinition in the SWC <http://apacheroyaleci2.westus2.cloudapp.azure.com:8080/job/royale-asjs_MXTests/ws/frameworks/js/libs/ReflectionJS.swc> could not be found
    [mxmlc] 
    [mxmlc] 
    [mxmlc] <http://apacheroyaleci2.westus2.cloudapp.azure.com:8080/job/royale-asjs_MXTests/ws/frameworks/js/libs/ReflectionJS.swc> Warning: The definition goog.DEBUG depended on by org.apache.royale.reflection.AccessorDefinition in the SWC <http://apacheroyaleci2.westus2.cloudapp.azure.com:8080/job/royale-asjs_MXTests/ws/frameworks/js/libs/ReflectionJS.swc> could not be found
    [mxmlc] 
    [mxmlc] 
    [mxmlc] <http://apacheroyaleci2.westus2.cloudapp.azure.com:8080/job/royale-asjs_MXTests/ws/frameworks/js/libs/ReflectionJS.swc> Warning: The definition goog.DEBUG depended on by org.apache.royale.reflection.getDynamicFields in the SWC <http://apacheroyaleci2.westus2.cloudapp.azure.com:8080/job/royale-asjs_MXTests/ws/frameworks/js/libs/ReflectionJS.swc> could not be found
    [mxmlc] 
    [mxmlc] 
    [mxmlc] <http://apacheroyaleci2.westus2.cloudapp.azure.com:8080/job/royale-asjs_MXTests/ws/frameworks/js/libs/SparkRoyaleJS.swc> Warning: The definition goog.DEBUG depended on by spark.components.supportClasses.SkinnableComponent in the SWC <http://apacheroyaleci2.westus2.cloudapp.azure.com:8080/job/royale-asjs_MXTests/ws/frameworks/js/libs/SparkRoyaleJS.swc> could not be found
    [mxmlc] 
    [mxmlc] 
    [mxmlc] The project 'BasicTests' has been successfully compiled.
    [mxmlc] 35.3734447 seconds
    [mxmlc] Picked up JAVA_TOOL_OPTIONS: -Dfile.encoding=UTF-8 -Xms384m -Xmx2g
     [echo] launching player and swf C:\adobe\flash\11.7\flashplayerdebugger.exe <http://apacheroyaleci2.westus2.cloudapp.azure.com:8080/job/royale-asjs_MXTests/ws/mustella/tests/mxtests/basicTests/BasicTests.swf>

mustellaresultsparser:
     [java] test case SetupListAndDataGridTest&result=fail&elapsed=621&phase=body&started=1583645502312&extraInfo=&msg=TypeError: failed
     [java] results: FAILED

BUILD FAILED
<http://apacheroyaleci2.westus2.cloudapp.azure.com:8080/job/royale-asjs_MXTests/ws/build.xml>:1532: The following error occurred while executing this line:
<http://apacheroyaleci2.westus2.cloudapp.azure.com:8080/job/royale-asjs_MXTests/ws/build.xml>:1459: Java returned: 1

Total time: 25 minutes 18 seconds
Picked up JAVA_TOOL_OPTIONS: -Dfile.encoding=UTF-8 -Xms384m -Xmx2g
Build step 'Invoke Ant' marked build as failure
Archiving artifacts

Build failed in Jenkins: royale-asjs_MXTests #734

Posted by ap...@gmail.com.
See <http://apacheroyaleci2.westus2.cloudapp.azure.com:8080/job/royale-asjs_MXTests/734/display/redirect>

Changes:


------------------------------------------
[...truncated 953.76 KB...]
checkintests:

mxtests-clean:
   [delete] Deleting directory <http://apacheroyaleci2.westus2.cloudapp.azure.com:8080/job/royale-asjs_MXTests/ws/mustella/tests/mxtests/basicTests/bin>

check-air-home:
     [echo] AIR_HOME is C:\adobe\air\4.0\AdobeAIRSDK

check-runtime-env:

runtime-setup:

load-task:

marmotinni-setup:

prepare:
     [echo] Making lib directory <http://apacheroyaleci2.westus2.cloudapp.azure.com:8080/job/royale-asjs_MXTests/ws/marmotinni/java/c>:\jenkins\workspace\royale-asjs_MXTests\marmotinni\java/lib

selenium3-jar-check:

selenium3-jar:

main:

clean:
   [delete] Deleting: <http://apacheroyaleci2.westus2.cloudapp.azure.com:8080/job/royale-asjs_MXTests/ws/mustella/mustella.swc>

check-compiler-home:

check-compiler:

compile:
     [echo] Compiling mustella.swc
     [echo] ROYALE_HOME: <http://apacheroyaleci2.westus2.cloudapp.azure.com:8080/job/royale-asjs_MXTests/ws/>
     [echo] ROYALE_COMPILER_HOME: <http://apacheroyaleci2.westus2.cloudapp.azure.com:8080/job/royale-asjs_MXTests/ws/js>
     [java] args:
     [java] +royalelib=<http://apacheroyaleci2.westus2.cloudapp.azure.com:8080/job/royale-asjs_MXTests/ws/frameworks>
     [java] +playerglobal.version=11.7
     [java] +env.PLAYERGLOBAL_HOME=C:\adobe\flash
     [java] +env.AIR_HOME=C:\adobe\air\4.0\AdobeAIRSDK
     [java] -compiler.strict-xml=true
     [java] -compiler.targets=SWF,JSRoyale
     [java] -output=<http://apacheroyaleci2.westus2.cloudapp.azure.com:8080/job/royale-asjs_MXTests/ws/mustella/mustella.swc>
     [java] -load-config=<http://apacheroyaleci2.westus2.cloudapp.azure.com:8080/job/royale-asjs_MXTests/ws/mustella/src/main/config/compile-swf-config.xml>
     [java] -js-load-config=<http://apacheroyaleci2.westus2.cloudapp.azure.com:8080/job/royale-asjs_MXTests/ws/frameworks/js-config.xml>
     [java] -js-load-config+=<http://apacheroyaleci2.westus2.cloudapp.azure.com:8080/job/royale-asjs_MXTests/ws/mustella/src/main/config/compile-js-config.xml>
     [java] target:SWF
     [java] target:JSRoyale
     [java] COMPC
     [java] Loading configuration: <http://apacheroyaleci2.westus2.cloudapp.azure.com:8080/job/royale-asjs_MXTests/ws/mustella/src/main/config/compile-swf-config.xml>
     [java] 
     [java] 58056 bytes written to C:\jenkins\workspace\royale-asjs_MXTests\mustella\mustella.swc in 4.268 seconds
     [java] COMPCJSCRoyale
     [java] 8.6067509 seconds
     [java] <http://apacheroyaleci2.westus2.cloudapp.azure.com:8080/job/royale-asjs_MXTests/ws/mustella/src/main/royale/DontSendScriptComplete.as(21)>: col: 8 No definitions matching flash.net.* could be found.
     [java] 
     [java] import flash.net.*;
     [java]        ^
     [java] 
     [java] <http://apacheroyaleci2.westus2.cloudapp.azure.com:8080/job/royale-asjs_MXTests/ws/mustella/src/main/royale/DontSendScriptComplete.as(22)>: col: 8 Definition flash.events.Event could not be found.
     [java] 
     [java] import flash.events.Event;
     [java]        ^
     [java] 
     [java] Picked up JAVA_TOOL_OPTIONS: -Dfile.encoding=UTF-8 -Xms384m -Xmx2g
     [java] Java Result: 2

compile-js:

main:

basictests-compile-java:
   [delete] Deleting directory <http://apacheroyaleci2.westus2.cloudapp.azure.com:8080/job/royale-asjs_MXTests/ws/mustella/target/classes>
    [mkdir] Created dir: <http://apacheroyaleci2.westus2.cloudapp.azure.com:8080/job/royale-asjs_MXTests/ws/mustella/target/classes>
    [javac] <http://apacheroyaleci2.westus2.cloudapp.azure.com:8080/job/royale-asjs_MXTests/ws/build.xml>:1336: warning: 'includeantruntime' was not set, defaulting to build.sysclasspath=last; set to false for repeatable builds
    [javac] Compiling 12 source files to <http://apacheroyaleci2.westus2.cloudapp.azure.com:8080/job/royale-asjs_MXTests/ws/mustella/target/classes>
    [javac] Note: <http://apacheroyaleci2.westus2.cloudapp.azure.com:8080/job/royale-asjs_MXTests/ws/mustella/src/main/java/marmotinni/DispatchMouseClickEvent.java> uses or overrides a deprecated API.
    [javac] Note: Recompile with -Xlint:deprecation for details.

mxtests-compile-java:

mxtests:
    [mxmlc] MXMLJSC
    [mxmlc] -sdk-js-lib=<http://apacheroyaleci2.westus2.cloudapp.azure.com:8080/job/royale-asjs_MXTests/ws/mustella/js>
    [mxmlc] +env.PLAYERGLOBAL_HOME=C:\adobe\flash
    [mxmlc] -compiler.debug=true
    [mxmlc] +royalelib=<http://apacheroyaleci2.westus2.cloudapp.azure.com:8080/job/royale-asjs_MXTests/ws/frameworks/>
    [mxmlc] -closure-lib=<http://apacheroyaleci2.westus2.cloudapp.azure.com:8080/job/royale-asjs_MXTests/ws/js/lib/google/closure-library>
    [mxmlc] +configname=flex
    [mxmlc] -compiler.library-path+=<http://apacheroyaleci2.westus2.cloudapp.azure.com:8080/job/royale-asjs_MXTests/ws/mustella/mustella.swc>
    [mxmlc] -compiler.js-external-library-path=<http://apacheroyaleci2.westus2.cloudapp.azure.com:8080/job/royale-asjs_MXTests/ws/js/libs/js.swc>
    [mxmlc] -compiler.js-library-path=<http://apacheroyaleci2.westus2.cloudapp.azure.com:8080/job/royale-asjs_MXTests/ws/frameworks/js/libs>
    [mxmlc] -compiler.js-library-path+=<http://apacheroyaleci2.westus2.cloudapp.azure.com:8080/job/royale-asjs_MXTests/ws/mustella/mustella.swc>
    [mxmlc] --
    [mxmlc] <http://apacheroyaleci2.westus2.cloudapp.azure.com:8080/job/royale-asjs_MXTests/ws/mustella/tests/mxtests/basicTests/BasicTests.mxml>
    [mxmlc] Loading configuration: <http://apacheroyaleci2.westus2.cloudapp.azure.com:8080/job/royale-asjs_MXTests/ws/frameworks/flex-config.xml>
    [mxmlc] Loading configuration: <http://apacheroyaleci2.westus2.cloudapp.azure.com:8080/job/royale-asjs_MXTests/ws/mustella/tests/mxtests/basicTests/BasicTests-config.xml>
    [mxmlc] 
    [mxmlc] 390454 bytes written to C:\jenkins\workspace\royale-asjs_MXTests\mustella\tests\mxtests\basicTests\BasicTests.swf in 10.469 seconds
    [mxmlc] <http://apacheroyaleci2.westus2.cloudapp.azure.com:8080/job/royale-asjs_MXTests/ws/frameworks/js/libs/BasicJS.swc> Warning: The definition goog.events depended on by org.apache.royale.html.beads.controllers.ItemRendererMouseController in the SWC <http://apacheroyaleci2.westus2.cloudapp.azure.com:8080/job/royale-asjs_MXTests/ws/frameworks/js/libs/BasicJS.swc> could not be found
    [mxmlc] 
    [mxmlc] 
    [mxmlc] <http://apacheroyaleci2.westus2.cloudapp.azure.com:8080/job/royale-asjs_MXTests/ws/frameworks/js/libs/BasicJS.swc> Warning: The definition goog.events.EventType depended on by org.apache.royale.html.beads.controllers.ItemRendererMouseController in the SWC <http://apacheroyaleci2.westus2.cloudapp.azure.com:8080/job/royale-asjs_MXTests/ws/frameworks/js/libs/BasicJS.swc> could not be found
    [mxmlc] 
    [mxmlc] 
    [mxmlc] <http://apacheroyaleci2.westus2.cloudapp.azure.com:8080/job/royale-asjs_MXTests/ws/frameworks/js/libs/BasicJS.swc> Warning: The definition goog.events.Event depended on by org.apache.royale.html.beads.controllers.ItemRendererMouseController in the SWC <http://apacheroyaleci2.westus2.cloudapp.azure.com:8080/job/royale-asjs_MXTests/ws/frameworks/js/libs/BasicJS.swc> could not be found
    [mxmlc] 
    [mxmlc] 
    [mxmlc] <http://apacheroyaleci2.westus2.cloudapp.azure.com:8080/job/royale-asjs_MXTests/ws/frameworks/js/libs/BasicJS.swc> Warning: The definition goog.events depended on by org.apache.royale.html.TextInput in the SWC <http://apacheroyaleci2.westus2.cloudapp.azure.com:8080/job/royale-asjs_MXTests/ws/frameworks/js/libs/BasicJS.swc> could not be found
    [mxmlc] 
    [mxmlc] 
    [mxmlc] <http://apacheroyaleci2.westus2.cloudapp.azure.com:8080/job/royale-asjs_MXTests/ws/frameworks/js/libs/BasicJS.swc> Warning: The definition goog.events.BrowserEvent depended on by org.apache.royale.html.accessories.RestrictTextInputBead in the SWC <http://apacheroyaleci2.westus2.cloudapp.azure.com:8080/job/royale-asjs_MXTests/ws/frameworks/js/libs/BasicJS.swc> could not be found
    [mxmlc] 
    [mxmlc] 
    [mxmlc] <http://apacheroyaleci2.westus2.cloudapp.azure.com:8080/job/royale-asjs_MXTests/ws/frameworks/js/libs/BasicJS.swc> Warning: The definition goog.events depended on by org.apache.royale.html.beads.controllers.SpinnerMouseController in the SWC <http://apacheroyaleci2.westus2.cloudapp.azure.com:8080/job/royale-asjs_MXTests/ws/frameworks/js/libs/BasicJS.swc> could not be found
    [mxmlc] 
    [mxmlc] 
    [mxmlc] <http://apacheroyaleci2.westus2.cloudapp.azure.com:8080/job/royale-asjs_MXTests/ws/frameworks/js/libs/BasicJS.swc> Warning: The definition goog.events.EventType depended on by org.apache.royale.html.beads.controllers.SpinnerMouseController in the SWC <http://apacheroyaleci2.westus2.cloudapp.azure.com:8080/job/royale-asjs_MXTests/ws/frameworks/js/libs/BasicJS.swc> could not be found
    [mxmlc] 
    [mxmlc] 
    [mxmlc] <http://apacheroyaleci2.westus2.cloudapp.azure.com:8080/job/royale-asjs_MXTests/ws/frameworks/js/libs/CoreJS.swc> Warning: The definition goog.events.BrowserEvent depended on by org.apache.royale.events.BrowserEvent in the SWC <http://apacheroyaleci2.westus2.cloudapp.azure.com:8080/job/royale-asjs_MXTests/ws/frameworks/js/libs/CoreJS.swc> could not be found
    [mxmlc] 
    [mxmlc] 
    [mxmlc] <http://apacheroyaleci2.westus2.cloudapp.azure.com:8080/job/royale-asjs_MXTests/ws/frameworks/js/libs/CoreJS.swc> Warning: The definition goog.DEBUG depended on by org.apache.royale.debugging.assert in the SWC <http://apacheroyaleci2.westus2.cloudapp.azure.com:8080/job/royale-asjs_MXTests/ws/frameworks/js/libs/CoreJS.swc> could not be found
    [mxmlc] 
    [mxmlc] 
    [mxmlc] <http://apacheroyaleci2.westus2.cloudapp.azure.com:8080/job/royale-asjs_MXTests/ws/frameworks/js/libs/CoreJS.swc> Warning: The definition goog.bind depended on by org.apache.royale.utils.MXMLDataInterpreter in the SWC <http://apacheroyaleci2.westus2.cloudapp.azure.com:8080/job/royale-asjs_MXTests/ws/frameworks/js/libs/CoreJS.swc> could not be found
    [mxmlc] 
    [mxmlc] 
    [mxmlc] <http://apacheroyaleci2.westus2.cloudapp.azure.com:8080/job/royale-asjs_MXTests/ws/frameworks/js/libs/CoreJS.swc> Warning: The definition goog.events.BrowserEvent depended on by org.apache.royale.events.KeyboardEvent in the SWC <http://apacheroyaleci2.westus2.cloudapp.azure.com:8080/job/royale-asjs_MXTests/ws/frameworks/js/libs/CoreJS.swc> could not be found
    [mxmlc] 
    [mxmlc] 
    [mxmlc] <http://apacheroyaleci2.westus2.cloudapp.azure.com:8080/job/royale-asjs_MXTests/ws/frameworks/js/libs/CoreJS.swc> Warning: The definition goog.events.Event depended on by org.apache.royale.events.utils.KeyboardEventConverter in the SWC <http://apacheroyaleci2.westus2.cloudapp.azure.com:8080/job/royale-asjs_MXTests/ws/frameworks/js/libs/CoreJS.swc> could not be found
    [mxmlc] 
    [mxmlc] 
    [mxmlc] <http://apacheroyaleci2.westus2.cloudapp.azure.com:8080/job/royale-asjs_MXTests/ws/frameworks/js/libs/CoreJS.swc> Warning: The definition goog.events.BrowserEvent depended on by org.apache.royale.events.utils.KeyboardEventConverter in the SWC <http://apacheroyaleci2.westus2.cloudapp.azure.com:8080/job/royale-asjs_MXTests/ws/frameworks/js/libs/CoreJS.swc> could not be found
    [mxmlc] 
    [mxmlc] 
    [mxmlc] <http://apacheroyaleci2.westus2.cloudapp.azure.com:8080/job/royale-asjs_MXTests/ws/frameworks/js/libs/CoreJS.swc> Warning: The definition goog.events depended on by org.apache.royale.core.ElementWrapper in the SWC <http://apacheroyaleci2.westus2.cloudapp.azure.com:8080/job/royale-asjs_MXTests/ws/frameworks/js/libs/CoreJS.swc> could not be found
    [mxmlc] 
    [mxmlc] 
    [mxmlc] <http://apacheroyaleci2.westus2.cloudapp.azure.com:8080/job/royale-asjs_MXTests/ws/frameworks/js/libs/CoreJS.swc> Warning: The definition goog.events.BrowserEvent depended on by org.apache.royale.core.ElementWrapper in the SWC <http://apacheroyaleci2.westus2.cloudapp.azure.com:8080/job/royale-asjs_MXTests/ws/frameworks/js/libs/CoreJS.swc> could not be found
    [mxmlc] 
    [mxmlc] 
    [mxmlc] <http://apacheroyaleci2.westus2.cloudapp.azure.com:8080/job/royale-asjs_MXTests/ws/frameworks/js/libs/CoreJS.swc> Warning: The definition goog.DEBUG depended on by org.apache.royale.core.ElementWrapper in the SWC <http://apacheroyaleci2.westus2.cloudapp.azure.com:8080/job/royale-asjs_MXTests/ws/frameworks/js/libs/CoreJS.swc> could not be found
    [mxmlc] 
    [mxmlc] 
    [mxmlc] <http://apacheroyaleci2.westus2.cloudapp.azure.com:8080/job/royale-asjs_MXTests/ws/frameworks/js/libs/CoreJS.swc> Warning: The definition goog.events.BrowserEvent depended on by org.apache.royale.events.MouseEvent in the SWC <http://apacheroyaleci2.westus2.cloudapp.azure.com:8080/job/royale-asjs_MXTests/ws/frameworks/js/libs/CoreJS.swc> could not be found
    [mxmlc] 
    [mxmlc] 
    [mxmlc] <http://apacheroyaleci2.westus2.cloudapp.azure.com:8080/job/royale-asjs_MXTests/ws/frameworks/js/libs/CoreJS.swc> Warning: The definition goog.events depended on by org.apache.royale.events.EventDispatcher in the SWC <http://apacheroyaleci2.westus2.cloudapp.azure.com:8080/job/royale-asjs_MXTests/ws/frameworks/js/libs/CoreJS.swc> could not be found
    [mxmlc] 
    [mxmlc] 
    [mxmlc] <http://apacheroyaleci2.westus2.cloudapp.azure.com:8080/job/royale-asjs_MXTests/ws/frameworks/js/libs/CoreJS.swc> Warning: The definition goog.events.EventTarget depended on by org.apache.royale.events.EventDispatcher in the SWC <http://apacheroyaleci2.westus2.cloudapp.azure.com:8080/job/royale-asjs_MXTests/ws/frameworks/js/libs/CoreJS.swc> could not be found
    [mxmlc] 
    [mxmlc] 
    [mxmlc] <http://apacheroyaleci2.westus2.cloudapp.azure.com:8080/job/royale-asjs_MXTests/ws/frameworks/js/libs/CoreJS.swc> Warning: The definition goog.events.Listener depended on by org.apache.royale.events.EventDispatcher in the SWC <http://apacheroyaleci2.westus2.cloudapp.azure.com:8080/job/royale-asjs_MXTests/ws/frameworks/js/libs/CoreJS.swc> could not be found
    [mxmlc] 
    [mxmlc] 
    [mxmlc] <http://apacheroyaleci2.westus2.cloudapp.azure.com:8080/job/royale-asjs_MXTests/ws/frameworks/js/libs/CoreJS.swc> Warning: The definition goog.events.Event depended on by org.apache.royale.events.Event in the SWC <http://apacheroyaleci2.westus2.cloudapp.azure.com:8080/job/royale-asjs_MXTests/ws/frameworks/js/libs/CoreJS.swc> could not be found
    [mxmlc] 
    [mxmlc] 
    [mxmlc] <http://apacheroyaleci2.westus2.cloudapp.azure.com:8080/job/royale-asjs_MXTests/ws/frameworks/js/libs/CoreJS.swc> Warning: The definition goog.events.BrowserEvent depended on by org.apache.royale.events.IBrowserEvent in the SWC <http://apacheroyaleci2.westus2.cloudapp.azure.com:8080/job/royale-asjs_MXTests/ws/frameworks/js/libs/CoreJS.swc> could not be found
    [mxmlc] 
    [mxmlc] 
    [mxmlc] <http://apacheroyaleci2.westus2.cloudapp.azure.com:8080/job/royale-asjs_MXTests/ws/frameworks/js/libs/CoreJS.swc> Warning: The definition goog.DEBUG depended on by org.apache.royale.utils.BinaryData in the SWC <http://apacheroyaleci2.westus2.cloudapp.azure.com:8080/job/royale-asjs_MXTests/ws/frameworks/js/libs/CoreJS.swc> could not be found
    [mxmlc] 
    [mxmlc] 
    [mxmlc] <http://apacheroyaleci2.westus2.cloudapp.azure.com:8080/job/royale-asjs_MXTests/ws/frameworks/js/libs/CoreJS.swc> Warning: The definition goog.DEBUG depended on by org.apache.royale.debugging.assertType in the SWC <http://apacheroyaleci2.westus2.cloudapp.azure.com:8080/job/royale-asjs_MXTests/ws/frameworks/js/libs/CoreJS.swc> could not be found
    [mxmlc] 
    [mxmlc] 
    [mxmlc] <http://apacheroyaleci2.westus2.cloudapp.azure.com:8080/job/royale-asjs_MXTests/ws/frameworks/js/libs/CoreJS.swc> Warning: The definition goog.events.Event depended on by org.apache.royale.events.utils.MouseEventConverter in the SWC <http://apacheroyaleci2.westus2.cloudapp.azure.com:8080/job/royale-asjs_MXTests/ws/frameworks/js/libs/CoreJS.swc> could not be found
    [mxmlc] 
    [mxmlc] 
    [mxmlc] <http://apacheroyaleci2.westus2.cloudapp.azure.com:8080/job/royale-asjs_MXTests/ws/frameworks/js/libs/CoreJS.swc> Warning: The definition goog.events.BrowserEvent depended on by org.apache.royale.events.utils.MouseEventConverter in the SWC <http://apacheroyaleci2.westus2.cloudapp.azure.com:8080/job/royale-asjs_MXTests/ws/frameworks/js/libs/CoreJS.swc> could not be found
    [mxmlc] 
    [mxmlc] 
    [mxmlc] <http://apacheroyaleci2.westus2.cloudapp.azure.com:8080/job/royale-asjs_MXTests/ws/frameworks/js/libs/CoreJS.swc> Warning: The definition goog.DEBUG depended on by org.apache.royale.debugging.throwError in the SWC <http://apacheroyaleci2.westus2.cloudapp.azure.com:8080/job/royale-asjs_MXTests/ws/frameworks/js/libs/CoreJS.swc> could not be found
    [mxmlc] 
    [mxmlc] 
    [mxmlc] <http://apacheroyaleci2.westus2.cloudapp.azure.com:8080/job/royale-asjs_MXTests/ws/frameworks/js/libs/LanguageJS.swc> Warning: The definition goog.bind depended on by org.apache.royale.utils.Language in the SWC <http://apacheroyaleci2.westus2.cloudapp.azure.com:8080/job/royale-asjs_MXTests/ws/frameworks/js/libs/LanguageJS.swc> could not be found
    [mxmlc] 
    [mxmlc] 
    [mxmlc] <http://apacheroyaleci2.westus2.cloudapp.azure.com:8080/job/royale-asjs_MXTests/ws/frameworks/js/libs/LanguageJS.swc> Warning: The definition goog.global depended on by org.apache.royale.utils.Language in the SWC <http://apacheroyaleci2.westus2.cloudapp.azure.com:8080/job/royale-asjs_MXTests/ws/frameworks/js/libs/LanguageJS.swc> could not be found
    [mxmlc] 
    [mxmlc] 
    [mxmlc] <http://apacheroyaleci2.westus2.cloudapp.azure.com:8080/job/royale-asjs_MXTests/ws/frameworks/js/libs/LanguageJS.swc> Warning: The definition goog.DEBUG depended on by org.apache.royale.utils.Language in the SWC <http://apacheroyaleci2.westus2.cloudapp.azure.com:8080/job/royale-asjs_MXTests/ws/frameworks/js/libs/LanguageJS.swc> could not be found
    [mxmlc] 
    [mxmlc] 
    [mxmlc] <http://apacheroyaleci2.westus2.cloudapp.azure.com:8080/job/royale-asjs_MXTests/ws/frameworks/js/libs/MXRoyaleJS.swc> Warning: The definition goog.DEBUG depended on by mx.utils.ObjectUtil in the SWC <http://apacheroyaleci2.westus2.cloudapp.azure.com:8080/job/royale-asjs_MXTests/ws/frameworks/js/libs/MXRoyaleJS.swc> could not be found
    [mxmlc] 
    [mxmlc] 
    [mxmlc] <http://apacheroyaleci2.westus2.cloudapp.azure.com:8080/job/royale-asjs_MXTests/ws/frameworks/js/libs/MXRoyaleJS.swc> Warning: The definition goog.events.Event depended on by mx.events.utils.KeyboardEventConverter in the SWC <http://apacheroyaleci2.westus2.cloudapp.azure.com:8080/job/royale-asjs_MXTests/ws/frameworks/js/libs/MXRoyaleJS.swc> could not be found
    [mxmlc] 
    [mxmlc] 
    [mxmlc] <http://apacheroyaleci2.westus2.cloudapp.azure.com:8080/job/royale-asjs_MXTests/ws/frameworks/js/libs/MXRoyaleJS.swc> Warning: The definition goog.events.BrowserEvent depended on by mx.events.utils.KeyboardEventConverter in the SWC <http://apacheroyaleci2.westus2.cloudapp.azure.com:8080/job/royale-asjs_MXTests/ws/frameworks/js/libs/MXRoyaleJS.swc> could not be found
    [mxmlc] 
    [mxmlc] 
    [mxmlc] <http://apacheroyaleci2.westus2.cloudapp.azure.com:8080/job/royale-asjs_MXTests/ws/frameworks/js/libs/MXRoyaleJS.swc> Warning: The definition goog.events depended on by mx.controls.TextInput in the SWC <http://apacheroyaleci2.westus2.cloudapp.azure.com:8080/job/royale-asjs_MXTests/ws/frameworks/js/libs/MXRoyaleJS.swc> could not be found
    [mxmlc] 
    [mxmlc] 
    [mxmlc] <http://apacheroyaleci2.westus2.cloudapp.azure.com:8080/job/royale-asjs_MXTests/ws/frameworks/js/libs/MXRoyaleJS.swc> Warning: The definition goog.events depended on by mx.controls.TextArea in the SWC <http://apacheroyaleci2.westus2.cloudapp.azure.com:8080/job/royale-asjs_MXTests/ws/frameworks/js/libs/MXRoyaleJS.swc> could not be found
    [mxmlc] 
    [mxmlc] 
    [mxmlc] <http://apacheroyaleci2.westus2.cloudapp.azure.com:8080/job/royale-asjs_MXTests/ws/frameworks/js/libs/MXRoyaleJS.swc> Warning: The definition goog.events.BrowserEvent depended on by mx.events.utils.FocusEventConverter in the SWC <http://apacheroyaleci2.westus2.cloudapp.azure.com:8080/job/royale-asjs_MXTests/ws/frameworks/js/libs/MXRoyaleJS.swc> could not be found
    [mxmlc] 
    [mxmlc] 
    [mxmlc] <http://apacheroyaleci2.westus2.cloudapp.azure.com:8080/job/royale-asjs_MXTests/ws/frameworks/js/libs/MXRoyaleJS.swc> Warning: The definition goog.events.Event depended on by mx.events.utils.MouseEventConverter in the SWC <http://apacheroyaleci2.westus2.cloudapp.azure.com:8080/job/royale-asjs_MXTests/ws/frameworks/js/libs/MXRoyaleJS.swc> could not be found
    [mxmlc] 
    [mxmlc] 
    [mxmlc] <http://apacheroyaleci2.westus2.cloudapp.azure.com:8080/job/royale-asjs_MXTests/ws/frameworks/js/libs/MXRoyaleJS.swc> Warning: The definition goog.events.BrowserEvent depended on by mx.events.utils.MouseEventConverter in the SWC <http://apacheroyaleci2.westus2.cloudapp.azure.com:8080/job/royale-asjs_MXTests/ws/frameworks/js/libs/MXRoyaleJS.swc> could not be found
    [mxmlc] 
    [mxmlc] 
    [mxmlc] <http://apacheroyaleci2.westus2.cloudapp.azure.com:8080/job/royale-asjs_MXTests/ws/frameworks/js/libs/NetworkJS.swc> Warning: The definition goog.DEBUG depended on by org.apache.royale.net.remoting.amf.AMFBinaryData in the SWC <http://apacheroyaleci2.westus2.cloudapp.azure.com:8080/job/royale-asjs_MXTests/ws/frameworks/js/libs/NetworkJS.swc> could not be found
    [mxmlc] 
    [mxmlc] 
    [mxmlc] <http://apacheroyaleci2.westus2.cloudapp.azure.com:8080/job/royale-asjs_MXTests/ws/frameworks/js/libs/ReflectionJS.swc> Warning: The definition goog.DEBUG depended on by org.apache.royale.reflection.AccessorDefinition in the SWC <http://apacheroyaleci2.westus2.cloudapp.azure.com:8080/job/royale-asjs_MXTests/ws/frameworks/js/libs/ReflectionJS.swc> could not be found
    [mxmlc] 
    [mxmlc] 
    [mxmlc] <http://apacheroyaleci2.westus2.cloudapp.azure.com:8080/job/royale-asjs_MXTests/ws/frameworks/js/libs/ReflectionJS.swc> Warning: The definition goog.global depended on by org.apache.royale.reflection.getDefinitionByName in the SWC <http://apacheroyaleci2.westus2.cloudapp.azure.com:8080/job/royale-asjs_MXTests/ws/frameworks/js/libs/ReflectionJS.swc> could not be found
    [mxmlc] 
    [mxmlc] 
    [mxmlc] <http://apacheroyaleci2.westus2.cloudapp.azure.com:8080/job/royale-asjs_MXTests/ws/frameworks/js/libs/ReflectionJS.swc> Warning: The definition goog.DEBUG depended on by org.apache.royale.reflection.VariableDefinition in the SWC <http://apacheroyaleci2.westus2.cloudapp.azure.com:8080/job/royale-asjs_MXTests/ws/frameworks/js/libs/ReflectionJS.swc> could not be found
    [mxmlc] 
    [mxmlc] 
    [mxmlc] <http://apacheroyaleci2.westus2.cloudapp.azure.com:8080/job/royale-asjs_MXTests/ws/frameworks/js/libs/ReflectionJS.swc> Warning: The definition goog.DEBUG depended on by org.apache.royale.reflection.getDynamicFields in the SWC <http://apacheroyaleci2.westus2.cloudapp.azure.com:8080/job/royale-asjs_MXTests/ws/frameworks/js/libs/ReflectionJS.swc> could not be found
    [mxmlc] 
    [mxmlc] 
    [mxmlc] <http://apacheroyaleci2.westus2.cloudapp.azure.com:8080/job/royale-asjs_MXTests/ws/frameworks/js/libs/SparkRoyaleJS.swc> Warning: The definition goog.DEBUG depended on by spark.components.supportClasses.SkinnableComponent in the SWC <http://apacheroyaleci2.westus2.cloudapp.azure.com:8080/job/royale-asjs_MXTests/ws/frameworks/js/libs/SparkRoyaleJS.swc> could not be found
    [mxmlc] 
    [mxmlc] 
    [mxmlc] The project 'BasicTests' has been successfully compiled.
    [mxmlc] 28.5591335 seconds
    [mxmlc] Picked up JAVA_TOOL_OPTIONS: -Dfile.encoding=UTF-8 -Xms384m -Xmx2g
     [echo] launching player and swf C:\adobe\flash\11.7\flashplayerdebugger.exe <http://apacheroyaleci2.westus2.cloudapp.azure.com:8080/job/royale-asjs_MXTests/ws/mustella/tests/mxtests/basicTests/BasicTests.swf>

mustellaresultsparser:
     [java] test case SetupListAndDataGridTest&result=fail&elapsed=620&phase=body&started=1583615172442&extraInfo=&msg=TypeError: failed
     [java] results: FAILED

BUILD FAILED
<http://apacheroyaleci2.westus2.cloudapp.azure.com:8080/job/royale-asjs_MXTests/ws/build.xml>:1532: The following error occurred while executing this line:
<http://apacheroyaleci2.westus2.cloudapp.azure.com:8080/job/royale-asjs_MXTests/ws/build.xml>:1459: Java returned: 1

Total time: 24 minutes 50 seconds
Picked up JAVA_TOOL_OPTIONS: -Dfile.encoding=UTF-8 -Xms384m -Xmx2g
Build step 'Invoke Ant' marked build as failure
Archiving artifacts

Build failed in Jenkins: royale-asjs_MXTests #733

Posted by ap...@gmail.com.
See <http://apacheroyaleci2.westus2.cloudapp.azure.com:8080/job/royale-asjs_MXTests/733/display/redirect>

Changes:


------------------------------------------
[...truncated 952.65 KB...]
checkintests:

mxtests-clean:
   [delete] Deleting directory <http://apacheroyaleci2.westus2.cloudapp.azure.com:8080/job/royale-asjs_MXTests/ws/mustella/tests/mxtests/basicTests/bin>

check-air-home:
     [echo] AIR_HOME is C:\adobe\air\4.0\AdobeAIRSDK

check-runtime-env:

runtime-setup:

load-task:

marmotinni-setup:

prepare:
     [echo] Making lib directory <http://apacheroyaleci2.westus2.cloudapp.azure.com:8080/job/royale-asjs_MXTests/ws/marmotinni/java/c>:\jenkins\workspace\royale-asjs_MXTests\marmotinni\java/lib

selenium3-jar-check:

selenium3-jar:

main:

clean:
   [delete] Deleting: <http://apacheroyaleci2.westus2.cloudapp.azure.com:8080/job/royale-asjs_MXTests/ws/mustella/mustella.swc>

check-compiler-home:

check-compiler:

compile:
     [echo] Compiling mustella.swc
     [echo] ROYALE_HOME: <http://apacheroyaleci2.westus2.cloudapp.azure.com:8080/job/royale-asjs_MXTests/ws/>
     [echo] ROYALE_COMPILER_HOME: <http://apacheroyaleci2.westus2.cloudapp.azure.com:8080/job/royale-asjs_MXTests/ws/js>
     [java] args:
     [java] +royalelib=<http://apacheroyaleci2.westus2.cloudapp.azure.com:8080/job/royale-asjs_MXTests/ws/frameworks>
     [java] +playerglobal.version=11.7
     [java] +env.PLAYERGLOBAL_HOME=C:\adobe\flash
     [java] +env.AIR_HOME=C:\adobe\air\4.0\AdobeAIRSDK
     [java] -compiler.strict-xml=true
     [java] -compiler.targets=SWF,JSRoyale
     [java] -output=<http://apacheroyaleci2.westus2.cloudapp.azure.com:8080/job/royale-asjs_MXTests/ws/mustella/mustella.swc>
     [java] -load-config=<http://apacheroyaleci2.westus2.cloudapp.azure.com:8080/job/royale-asjs_MXTests/ws/mustella/src/main/config/compile-swf-config.xml>
     [java] -js-load-config=<http://apacheroyaleci2.westus2.cloudapp.azure.com:8080/job/royale-asjs_MXTests/ws/frameworks/js-config.xml>
     [java] -js-load-config+=<http://apacheroyaleci2.westus2.cloudapp.azure.com:8080/job/royale-asjs_MXTests/ws/mustella/src/main/config/compile-js-config.xml>
     [java] target:SWF
     [java] target:JSRoyale
     [java] COMPC
     [java] Loading configuration: <http://apacheroyaleci2.westus2.cloudapp.azure.com:8080/job/royale-asjs_MXTests/ws/mustella/src/main/config/compile-swf-config.xml>
     [java] 
     [java] 58056 bytes written to C:\jenkins\workspace\royale-asjs_MXTests\mustella\mustella.swc in 4.738 seconds
     [java] COMPCJSCRoyale
     [java] 9.6262511 seconds
     [java] <http://apacheroyaleci2.westus2.cloudapp.azure.com:8080/job/royale-asjs_MXTests/ws/mustella/src/main/royale/DontSendScriptComplete.as(21)>: col: 8 No definitions matching flash.net.* could be found.
     [java] 
     [java] import flash.net.*;
     [java]        ^
     [java] 
     [java] <http://apacheroyaleci2.westus2.cloudapp.azure.com:8080/job/royale-asjs_MXTests/ws/mustella/src/main/royale/DontSendScriptComplete.as(22)>: col: 8 Definition flash.events.Event could not be found.
     [java] 
     [java] import flash.events.Event;
     [java]        ^
     [java] 
     [java] Picked up JAVA_TOOL_OPTIONS: -Dfile.encoding=UTF-8 -Xms384m -Xmx2g
     [java] Java Result: 2

compile-js:

main:

basictests-compile-java:
   [delete] Deleting directory <http://apacheroyaleci2.westus2.cloudapp.azure.com:8080/job/royale-asjs_MXTests/ws/mustella/target/classes>
    [mkdir] Created dir: <http://apacheroyaleci2.westus2.cloudapp.azure.com:8080/job/royale-asjs_MXTests/ws/mustella/target/classes>
    [javac] <http://apacheroyaleci2.westus2.cloudapp.azure.com:8080/job/royale-asjs_MXTests/ws/build.xml>:1336: warning: 'includeantruntime' was not set, defaulting to build.sysclasspath=last; set to false for repeatable builds
    [javac] Compiling 12 source files to <http://apacheroyaleci2.westus2.cloudapp.azure.com:8080/job/royale-asjs_MXTests/ws/mustella/target/classes>
    [javac] Note: <http://apacheroyaleci2.westus2.cloudapp.azure.com:8080/job/royale-asjs_MXTests/ws/mustella/src/main/java/marmotinni/DispatchMouseClickEvent.java> uses or overrides a deprecated API.
    [javac] Note: Recompile with -Xlint:deprecation for details.

mxtests-compile-java:

mxtests:
    [mxmlc] MXMLJSC
    [mxmlc] -sdk-js-lib=<http://apacheroyaleci2.westus2.cloudapp.azure.com:8080/job/royale-asjs_MXTests/ws/mustella/js>
    [mxmlc] +env.PLAYERGLOBAL_HOME=C:\adobe\flash
    [mxmlc] -compiler.debug=true
    [mxmlc] +royalelib=<http://apacheroyaleci2.westus2.cloudapp.azure.com:8080/job/royale-asjs_MXTests/ws/frameworks/>
    [mxmlc] -closure-lib=<http://apacheroyaleci2.westus2.cloudapp.azure.com:8080/job/royale-asjs_MXTests/ws/js/lib/google/closure-library>
    [mxmlc] +configname=flex
    [mxmlc] -compiler.library-path+=<http://apacheroyaleci2.westus2.cloudapp.azure.com:8080/job/royale-asjs_MXTests/ws/mustella/mustella.swc>
    [mxmlc] -compiler.js-external-library-path=<http://apacheroyaleci2.westus2.cloudapp.azure.com:8080/job/royale-asjs_MXTests/ws/js/libs/js.swc>
    [mxmlc] -compiler.js-library-path=<http://apacheroyaleci2.westus2.cloudapp.azure.com:8080/job/royale-asjs_MXTests/ws/frameworks/js/libs>
    [mxmlc] -compiler.js-library-path+=<http://apacheroyaleci2.westus2.cloudapp.azure.com:8080/job/royale-asjs_MXTests/ws/mustella/mustella.swc>
    [mxmlc] --
    [mxmlc] <http://apacheroyaleci2.westus2.cloudapp.azure.com:8080/job/royale-asjs_MXTests/ws/mustella/tests/mxtests/basicTests/BasicTests.mxml>
    [mxmlc] Loading configuration: <http://apacheroyaleci2.westus2.cloudapp.azure.com:8080/job/royale-asjs_MXTests/ws/frameworks/flex-config.xml>
    [mxmlc] Loading configuration: <http://apacheroyaleci2.westus2.cloudapp.azure.com:8080/job/royale-asjs_MXTests/ws/mustella/tests/mxtests/basicTests/BasicTests-config.xml>
    [mxmlc] 
    [mxmlc] 390454 bytes written to C:\jenkins\workspace\royale-asjs_MXTests\mustella\tests\mxtests\basicTests\BasicTests.swf in 11.939 seconds
    [mxmlc] The project 'BasicTests' has been successfully compiled.
    [mxmlc] <http://apacheroyaleci2.westus2.cloudapp.azure.com:8080/job/royale-asjs_MXTests/ws/frameworks/js/libs/BasicJS.swc> Warning: The definition goog.events depended on by org.apache.royale.html.beads.controllers.SpinnerMouseController in the SWC <http://apacheroyaleci2.westus2.cloudapp.azure.com:8080/job/royale-asjs_MXTests/ws/frameworks/js/libs/BasicJS.swc> could not be found
    [mxmlc] 
    [mxmlc] 
    [mxmlc] <http://apacheroyaleci2.westus2.cloudapp.azure.com:8080/job/royale-asjs_MXTests/ws/frameworks/js/libs/BasicJS.swc> Warning: The definition goog.events.EventType depended on by org.apache.royale.html.beads.controllers.SpinnerMouseController in the SWC <http://apacheroyaleci2.westus2.cloudapp.azure.com:8080/job/royale-asjs_MXTests/ws/frameworks/js/libs/BasicJS.swc> could not be found
    [mxmlc] 
    [mxmlc] 
    [mxmlc] <http://apacheroyaleci2.westus2.cloudapp.azure.com:8080/job/royale-asjs_MXTests/ws/frameworks/js/libs/BasicJS.swc> Warning: The definition goog.events depended on by org.apache.royale.html.beads.controllers.ItemRendererMouseController in the SWC <http://apacheroyaleci2.westus2.cloudapp.azure.com:8080/job/royale-asjs_MXTests/ws/frameworks/js/libs/BasicJS.swc> could not be found
    [mxmlc] 
    [mxmlc] 
    [mxmlc] <http://apacheroyaleci2.westus2.cloudapp.azure.com:8080/job/royale-asjs_MXTests/ws/frameworks/js/libs/BasicJS.swc> Warning: The definition goog.events.EventType depended on by org.apache.royale.html.beads.controllers.ItemRendererMouseController in the SWC <http://apacheroyaleci2.westus2.cloudapp.azure.com:8080/job/royale-asjs_MXTests/ws/frameworks/js/libs/BasicJS.swc> could not be found
    [mxmlc] 
    [mxmlc] 
    [mxmlc] <http://apacheroyaleci2.westus2.cloudapp.azure.com:8080/job/royale-asjs_MXTests/ws/frameworks/js/libs/BasicJS.swc> Warning: The definition goog.events.Event depended on by org.apache.royale.html.beads.controllers.ItemRendererMouseController in the SWC <http://apacheroyaleci2.westus2.cloudapp.azure.com:8080/job/royale-asjs_MXTests/ws/frameworks/js/libs/BasicJS.swc> could not be found
    [mxmlc] 
    [mxmlc] 
    [mxmlc] <http://apacheroyaleci2.westus2.cloudapp.azure.com:8080/job/royale-asjs_MXTests/ws/frameworks/js/libs/BasicJS.swc> Warning: The definition goog.events.BrowserEvent depended on by org.apache.royale.html.accessories.RestrictTextInputBead in the SWC <http://apacheroyaleci2.westus2.cloudapp.azure.com:8080/job/royale-asjs_MXTests/ws/frameworks/js/libs/BasicJS.swc> could not be found
    [mxmlc] 
    [mxmlc] 
    [mxmlc] <http://apacheroyaleci2.westus2.cloudapp.azure.com:8080/job/royale-asjs_MXTests/ws/frameworks/js/libs/BasicJS.swc> Warning: The definition goog.events depended on by org.apache.royale.html.TextInput in the SWC <http://apacheroyaleci2.westus2.cloudapp.azure.com:8080/job/royale-asjs_MXTests/ws/frameworks/js/libs/BasicJS.swc> could not be found
    [mxmlc] 
    [mxmlc] 
    [mxmlc] <http://apacheroyaleci2.westus2.cloudapp.azure.com:8080/job/royale-asjs_MXTests/ws/frameworks/js/libs/CoreJS.swc> Warning: The definition goog.events.Event depended on by org.apache.royale.events.utils.KeyboardEventConverter in the SWC <http://apacheroyaleci2.westus2.cloudapp.azure.com:8080/job/royale-asjs_MXTests/ws/frameworks/js/libs/CoreJS.swc> could not be found
    [mxmlc] 
    [mxmlc] 
    [mxmlc] <http://apacheroyaleci2.westus2.cloudapp.azure.com:8080/job/royale-asjs_MXTests/ws/frameworks/js/libs/CoreJS.swc> Warning: The definition goog.events.BrowserEvent depended on by org.apache.royale.events.utils.KeyboardEventConverter in the SWC <http://apacheroyaleci2.westus2.cloudapp.azure.com:8080/job/royale-asjs_MXTests/ws/frameworks/js/libs/CoreJS.swc> could not be found
    [mxmlc] 
    [mxmlc] 
    [mxmlc] <http://apacheroyaleci2.westus2.cloudapp.azure.com:8080/job/royale-asjs_MXTests/ws/frameworks/js/libs/CoreJS.swc> Warning: The definition goog.DEBUG depended on by org.apache.royale.debugging.assert in the SWC <http://apacheroyaleci2.westus2.cloudapp.azure.com:8080/job/royale-asjs_MXTests/ws/frameworks/js/libs/CoreJS.swc> could not be found
    [mxmlc] 
    [mxmlc] 
    [mxmlc] <http://apacheroyaleci2.westus2.cloudapp.azure.com:8080/job/royale-asjs_MXTests/ws/frameworks/js/libs/CoreJS.swc> Warning: The definition goog.events.BrowserEvent depended on by org.apache.royale.events.MouseEvent in the SWC <http://apacheroyaleci2.westus2.cloudapp.azure.com:8080/job/royale-asjs_MXTests/ws/frameworks/js/libs/CoreJS.swc> could not be found
    [mxmlc] 
    [mxmlc] 
    [mxmlc] <http://apacheroyaleci2.westus2.cloudapp.azure.com:8080/job/royale-asjs_MXTests/ws/frameworks/js/libs/CoreJS.swc> Warning: The definition goog.events.BrowserEvent depended on by org.apache.royale.events.IBrowserEvent in the SWC <http://apacheroyaleci2.westus2.cloudapp.azure.com:8080/job/royale-asjs_MXTests/ws/frameworks/js/libs/CoreJS.swc> could not be found
    [mxmlc] 
    [mxmlc] 
    [mxmlc] <http://apacheroyaleci2.westus2.cloudapp.azure.com:8080/job/royale-asjs_MXTests/ws/frameworks/js/libs/CoreJS.swc> Warning: The definition goog.DEBUG depended on by org.apache.royale.utils.BinaryData in the SWC <http://apacheroyaleci2.westus2.cloudapp.azure.com:8080/job/royale-asjs_MXTests/ws/frameworks/js/libs/CoreJS.swc> could not be found
    [mxmlc] 
    [mxmlc] 
    [mxmlc] <http://apacheroyaleci2.westus2.cloudapp.azure.com:8080/job/royale-asjs_MXTests/ws/frameworks/js/libs/CoreJS.swc> Warning: The definition goog.events.Event depended on by org.apache.royale.events.Event in the SWC <http://apacheroyaleci2.westus2.cloudapp.azure.com:8080/job/royale-asjs_MXTests/ws/frameworks/js/libs/CoreJS.swc> could not be found
    [mxmlc] 
    [mxmlc] 
    [mxmlc] <http://apacheroyaleci2.westus2.cloudapp.azure.com:8080/job/royale-asjs_MXTests/ws/frameworks/js/libs/CoreJS.swc> Warning: The definition goog.events depended on by org.apache.royale.core.ElementWrapper in the SWC <http://apacheroyaleci2.westus2.cloudapp.azure.com:8080/job/royale-asjs_MXTests/ws/frameworks/js/libs/CoreJS.swc> could not be found
    [mxmlc] 
    [mxmlc] 
    [mxmlc] <http://apacheroyaleci2.westus2.cloudapp.azure.com:8080/job/royale-asjs_MXTests/ws/frameworks/js/libs/CoreJS.swc> Warning: The definition goog.events.BrowserEvent depended on by org.apache.royale.core.ElementWrapper in the SWC <http://apacheroyaleci2.westus2.cloudapp.azure.com:8080/job/royale-asjs_MXTests/ws/frameworks/js/libs/CoreJS.swc> could not be found
    [mxmlc] 
    [mxmlc] 
    [mxmlc] <http://apacheroyaleci2.westus2.cloudapp.azure.com:8080/job/royale-asjs_MXTests/ws/frameworks/js/libs/CoreJS.swc> Warning: The definition goog.DEBUG depended on by org.apache.royale.core.ElementWrapper in the SWC <http://apacheroyaleci2.westus2.cloudapp.azure.com:8080/job/royale-asjs_MXTests/ws/frameworks/js/libs/CoreJS.swc> could not be found
    [mxmlc] 
    [mxmlc] 
    [mxmlc] <http://apacheroyaleci2.westus2.cloudapp.azure.com:8080/job/royale-asjs_MXTests/ws/frameworks/js/libs/CoreJS.swc> Warning: The definition goog.events.Event depended on by org.apache.royale.events.utils.MouseEventConverter in the SWC <http://apacheroyaleci2.westus2.cloudapp.azure.com:8080/job/royale-asjs_MXTests/ws/frameworks/js/libs/CoreJS.swc> could not be found
    [mxmlc] 
    [mxmlc] 
    [mxmlc] <http://apacheroyaleci2.westus2.cloudapp.azure.com:8080/job/royale-asjs_MXTests/ws/frameworks/js/libs/CoreJS.swc> Warning: The definition goog.events.BrowserEvent depended on by org.apache.royale.events.utils.MouseEventConverter in the SWC <http://apacheroyaleci2.westus2.cloudapp.azure.com:8080/job/royale-asjs_MXTests/ws/frameworks/js/libs/CoreJS.swc> could not be found
    [mxmlc] 
    [mxmlc] 
    [mxmlc] <http://apacheroyaleci2.westus2.cloudapp.azure.com:8080/job/royale-asjs_MXTests/ws/frameworks/js/libs/CoreJS.swc> Warning: The definition goog.bind depended on by org.apache.royale.utils.MXMLDataInterpreter in the SWC <http://apacheroyaleci2.westus2.cloudapp.azure.com:8080/job/royale-asjs_MXTests/ws/frameworks/js/libs/CoreJS.swc> could not be found
    [mxmlc] 
    [mxmlc] 
    [mxmlc] <http://apacheroyaleci2.westus2.cloudapp.azure.com:8080/job/royale-asjs_MXTests/ws/frameworks/js/libs/CoreJS.swc> Warning: The definition goog.events depended on by org.apache.royale.events.EventDispatcher in the SWC <http://apacheroyaleci2.westus2.cloudapp.azure.com:8080/job/royale-asjs_MXTests/ws/frameworks/js/libs/CoreJS.swc> could not be found
    [mxmlc] 
    [mxmlc] 
    [mxmlc] <http://apacheroyaleci2.westus2.cloudapp.azure.com:8080/job/royale-asjs_MXTests/ws/frameworks/js/libs/CoreJS.swc> Warning: The definition goog.events.EventTarget depended on by org.apache.royale.events.EventDispatcher in the SWC <http://apacheroyaleci2.westus2.cloudapp.azure.com:8080/job/royale-asjs_MXTests/ws/frameworks/js/libs/CoreJS.swc> could not be found
    [mxmlc] 
    [mxmlc] 
    [mxmlc] <http://apacheroyaleci2.westus2.cloudapp.azure.com:8080/job/royale-asjs_MXTests/ws/frameworks/js/libs/CoreJS.swc> Warning: The definition goog.events.Listener depended on by org.apache.royale.events.EventDispatcher in the SWC <http://apacheroyaleci2.westus2.cloudapp.azure.com:8080/job/royale-asjs_MXTests/ws/frameworks/js/libs/CoreJS.swc> could not be found
    [mxmlc] 
    [mxmlc] 
    [mxmlc] <http://apacheroyaleci2.westus2.cloudapp.azure.com:8080/job/royale-asjs_MXTests/ws/frameworks/js/libs/CoreJS.swc> Warning: The definition goog.DEBUG depended on by org.apache.royale.debugging.throwError in the SWC <http://apacheroyaleci2.westus2.cloudapp.azure.com:8080/job/royale-asjs_MXTests/ws/frameworks/js/libs/CoreJS.swc> could not be found
    [mxmlc] 
    [mxmlc] 
    [mxmlc] <http://apacheroyaleci2.westus2.cloudapp.azure.com:8080/job/royale-asjs_MXTests/ws/frameworks/js/libs/CoreJS.swc> Warning: The definition goog.events.BrowserEvent depended on by org.apache.royale.events.BrowserEvent in the SWC <http://apacheroyaleci2.westus2.cloudapp.azure.com:8080/job/royale-asjs_MXTests/ws/frameworks/js/libs/CoreJS.swc> could not be found
    [mxmlc] 
    [mxmlc] 
    [mxmlc] <http://apacheroyaleci2.westus2.cloudapp.azure.com:8080/job/royale-asjs_MXTests/ws/frameworks/js/libs/CoreJS.swc> Warning: The definition goog.events.BrowserEvent depended on by org.apache.royale.events.KeyboardEvent in the SWC <http://apacheroyaleci2.westus2.cloudapp.azure.com:8080/job/royale-asjs_MXTests/ws/frameworks/js/libs/CoreJS.swc> could not be found
    [mxmlc] 
    [mxmlc] 
    [mxmlc] <http://apacheroyaleci2.westus2.cloudapp.azure.com:8080/job/royale-asjs_MXTests/ws/frameworks/js/libs/CoreJS.swc> Warning: The definition goog.DEBUG depended on by org.apache.royale.debugging.assertType in the SWC <http://apacheroyaleci2.westus2.cloudapp.azure.com:8080/job/royale-asjs_MXTests/ws/frameworks/js/libs/CoreJS.swc> could not be found
    [mxmlc] 
    [mxmlc] 
    [mxmlc] <http://apacheroyaleci2.westus2.cloudapp.azure.com:8080/job/royale-asjs_MXTests/ws/frameworks/js/libs/LanguageJS.swc> Warning: The definition goog.bind depended on by org.apache.royale.utils.Language in the SWC <http://apacheroyaleci2.westus2.cloudapp.azure.com:8080/job/royale-asjs_MXTests/ws/frameworks/js/libs/LanguageJS.swc> could not be found
    [mxmlc] 
    [mxmlc] 
    [mxmlc] <http://apacheroyaleci2.westus2.cloudapp.azure.com:8080/job/royale-asjs_MXTests/ws/frameworks/js/libs/LanguageJS.swc> Warning: The definition goog.global depended on by org.apache.royale.utils.Language in the SWC <http://apacheroyaleci2.westus2.cloudapp.azure.com:8080/job/royale-asjs_MXTests/ws/frameworks/js/libs/LanguageJS.swc> could not be found
    [mxmlc] 
    [mxmlc] 
    [mxmlc] <http://apacheroyaleci2.westus2.cloudapp.azure.com:8080/job/royale-asjs_MXTests/ws/frameworks/js/libs/LanguageJS.swc> Warning: The definition goog.DEBUG depended on by org.apache.royale.utils.Language in the SWC <http://apacheroyaleci2.westus2.cloudapp.azure.com:8080/job/royale-asjs_MXTests/ws/frameworks/js/libs/LanguageJS.swc> could not be found
    [mxmlc] 
    [mxmlc] 
    [mxmlc] <http://apacheroyaleci2.westus2.cloudapp.azure.com:8080/job/royale-asjs_MXTests/ws/frameworks/js/libs/MXRoyaleJS.swc> Warning: The definition goog.events.Event depended on by mx.events.utils.MouseEventConverter in the SWC <http://apacheroyaleci2.westus2.cloudapp.azure.com:8080/job/royale-asjs_MXTests/ws/frameworks/js/libs/MXRoyaleJS.swc> could not be found
    [mxmlc] 
    [mxmlc] 
    [mxmlc] <http://apacheroyaleci2.westus2.cloudapp.azure.com:8080/job/royale-asjs_MXTests/ws/frameworks/js/libs/MXRoyaleJS.swc> Warning: The definition goog.events.BrowserEvent depended on by mx.events.utils.MouseEventConverter in the SWC <http://apacheroyaleci2.westus2.cloudapp.azure.com:8080/job/royale-asjs_MXTests/ws/frameworks/js/libs/MXRoyaleJS.swc> could not be found
    [mxmlc] 
    [mxmlc] 
    [mxmlc] <http://apacheroyaleci2.westus2.cloudapp.azure.com:8080/job/royale-asjs_MXTests/ws/frameworks/js/libs/MXRoyaleJS.swc> Warning: The definition goog.events depended on by mx.controls.TextArea in the SWC <http://apacheroyaleci2.westus2.cloudapp.azure.com:8080/job/royale-asjs_MXTests/ws/frameworks/js/libs/MXRoyaleJS.swc> could not be found
    [mxmlc] 
    [mxmlc] 
    [mxmlc] <http://apacheroyaleci2.westus2.cloudapp.azure.com:8080/job/royale-asjs_MXTests/ws/frameworks/js/libs/MXRoyaleJS.swc> Warning: The definition goog.events depended on by mx.controls.TextInput in the SWC <http://apacheroyaleci2.westus2.cloudapp.azure.com:8080/job/royale-asjs_MXTests/ws/frameworks/js/libs/MXRoyaleJS.swc> could not be found
    [mxmlc] 
    [mxmlc] 
    [mxmlc] <http://apacheroyaleci2.westus2.cloudapp.azure.com:8080/job/royale-asjs_MXTests/ws/frameworks/js/libs/MXRoyaleJS.swc> Warning: The definition goog.events.BrowserEvent depended on by mx.events.utils.FocusEventConverter in the SWC <http://apacheroyaleci2.westus2.cloudapp.azure.com:8080/job/royale-asjs_MXTests/ws/frameworks/js/libs/MXRoyaleJS.swc> could not be found
    [mxmlc] 
    [mxmlc] 
    [mxmlc] <http://apacheroyaleci2.westus2.cloudapp.azure.com:8080/job/royale-asjs_MXTests/ws/frameworks/js/libs/MXRoyaleJS.swc> Warning: The definition goog.events.Event depended on by mx.events.utils.KeyboardEventConverter in the SWC <http://apacheroyaleci2.westus2.cloudapp.azure.com:8080/job/royale-asjs_MXTests/ws/frameworks/js/libs/MXRoyaleJS.swc> could not be found
    [mxmlc] 
    [mxmlc] 
    [mxmlc] <http://apacheroyaleci2.westus2.cloudapp.azure.com:8080/job/royale-asjs_MXTests/ws/frameworks/js/libs/MXRoyaleJS.swc> Warning: The definition goog.events.BrowserEvent depended on by mx.events.utils.KeyboardEventConverter in the SWC <http://apacheroyaleci2.westus2.cloudapp.azure.com:8080/job/royale-asjs_MXTests/ws/frameworks/js/libs/MXRoyaleJS.swc> could not be found
    [mxmlc] 
    [mxmlc] 
    [mxmlc] <http://apacheroyaleci2.westus2.cloudapp.azure.com:8080/job/royale-asjs_MXTests/ws/frameworks/js/libs/MXRoyaleJS.swc> Warning: The definition goog.DEBUG depended on by mx.utils.ObjectUtil in the SWC <http://apacheroyaleci2.westus2.cloudapp.azure.com:8080/job/royale-asjs_MXTests/ws/frameworks/js/libs/MXRoyaleJS.swc> could not be found
    [mxmlc] 
    [mxmlc] 
    [mxmlc] <http://apacheroyaleci2.westus2.cloudapp.azure.com:8080/job/royale-asjs_MXTests/ws/frameworks/js/libs/NetworkJS.swc> Warning: The definition goog.DEBUG depended on by org.apache.royale.net.remoting.amf.AMFBinaryData in the SWC <http://apacheroyaleci2.westus2.cloudapp.azure.com:8080/job/royale-asjs_MXTests/ws/frameworks/js/libs/NetworkJS.swc> could not be found
    [mxmlc] 
    [mxmlc] 
    [mxmlc] <http://apacheroyaleci2.westus2.cloudapp.azure.com:8080/job/royale-asjs_MXTests/ws/frameworks/js/libs/ReflectionJS.swc> Warning: The definition goog.DEBUG depended on by org.apache.royale.reflection.getDynamicFields in the SWC <http://apacheroyaleci2.westus2.cloudapp.azure.com:8080/job/royale-asjs_MXTests/ws/frameworks/js/libs/ReflectionJS.swc> could not be found
    [mxmlc] 
    [mxmlc] 
    [mxmlc] <http://apacheroyaleci2.westus2.cloudapp.azure.com:8080/job/royale-asjs_MXTests/ws/frameworks/js/libs/ReflectionJS.swc> Warning: The definition goog.DEBUG depended on by org.apache.royale.reflection.VariableDefinition in the SWC <http://apacheroyaleci2.westus2.cloudapp.azure.com:8080/job/royale-asjs_MXTests/ws/frameworks/js/libs/ReflectionJS.swc> could not be found
    [mxmlc] 
    [mxmlc] 
    [mxmlc] <http://apacheroyaleci2.westus2.cloudapp.azure.com:8080/job/royale-asjs_MXTests/ws/frameworks/js/libs/ReflectionJS.swc> Warning: The definition goog.global depended on by org.apache.royale.reflection.getDefinitionByName in the SWC <http://apacheroyaleci2.westus2.cloudapp.azure.com:8080/job/royale-asjs_MXTests/ws/frameworks/js/libs/ReflectionJS.swc> could not be found
    [mxmlc] 
    [mxmlc] 
    [mxmlc] <http://apacheroyaleci2.westus2.cloudapp.azure.com:8080/job/royale-asjs_MXTests/ws/frameworks/js/libs/ReflectionJS.swc> Warning: The definition goog.DEBUG depended on by org.apache.royale.reflection.AccessorDefinition in the SWC <http://apacheroyaleci2.westus2.cloudapp.azure.com:8080/job/royale-asjs_MXTests/ws/frameworks/js/libs/ReflectionJS.swc> could not be found
    [mxmlc] 
    [mxmlc] 
    [mxmlc] <http://apacheroyaleci2.westus2.cloudapp.azure.com:8080/job/royale-asjs_MXTests/ws/frameworks/js/libs/SparkRoyaleJS.swc> Warning: The definition goog.DEBUG depended on by spark.components.supportClasses.SkinnableComponent in the SWC <http://apacheroyaleci2.westus2.cloudapp.azure.com:8080/job/royale-asjs_MXTests/ws/frameworks/js/libs/SparkRoyaleJS.swc> could not be found
    [mxmlc] 
    [mxmlc] 
    [mxmlc] 28.3765254 seconds
    [mxmlc] Picked up JAVA_TOOL_OPTIONS: -Dfile.encoding=UTF-8 -Xms384m -Xmx2g
     [echo] launching player and swf C:\adobe\flash\11.7\flashplayerdebugger.exe <http://apacheroyaleci2.westus2.cloudapp.azure.com:8080/job/royale-asjs_MXTests/ws/mustella/tests/mxtests/basicTests/BasicTests.swf>

mustellaresultsparser:
     [java] test case SetupListAndDataGridTest&result=fail&elapsed=622&phase=body&started=1583604461971&extraInfo=&msg=TypeError: failed
     [java] results: FAILED

BUILD FAILED
<http://apacheroyaleci2.westus2.cloudapp.azure.com:8080/job/royale-asjs_MXTests/ws/build.xml>:1532: The following error occurred while executing this line:
<http://apacheroyaleci2.westus2.cloudapp.azure.com:8080/job/royale-asjs_MXTests/ws/build.xml>:1459: Java returned: 1

Total time: 24 minutes 52 seconds
Picked up JAVA_TOOL_OPTIONS: -Dfile.encoding=UTF-8 -Xms384m -Xmx2g
Build step 'Invoke Ant' marked build as failure
Archiving artifacts

Build failed in Jenkins: royale-asjs_MXTests #732

Posted by ap...@gmail.com.
See <http://apacheroyaleci2.westus2.cloudapp.azure.com:8080/job/royale-asjs_MXTests/732/display/redirect?page=changes>

Changes:

[carlosrovira] jewel-themes: update themes with latest fixes on button disabled on

[carlosrovira] jewel-datagrid: fix when dg can surround a container and its height is


------------------------------------------
[...truncated 952.49 KB...]
checkintests:

mxtests-clean:
   [delete] Deleting directory <http://apacheroyaleci2.westus2.cloudapp.azure.com:8080/job/royale-asjs_MXTests/ws/mustella/tests/mxtests/basicTests/bin>

check-air-home:
     [echo] AIR_HOME is C:\adobe\air\4.0\AdobeAIRSDK

check-runtime-env:

runtime-setup:

load-task:

marmotinni-setup:

prepare:
     [echo] Making lib directory <http://apacheroyaleci2.westus2.cloudapp.azure.com:8080/job/royale-asjs_MXTests/ws/marmotinni/java/c>:\jenkins\workspace\royale-asjs_MXTests\marmotinni\java/lib

selenium3-jar-check:

selenium3-jar:

main:

clean:
   [delete] Deleting: <http://apacheroyaleci2.westus2.cloudapp.azure.com:8080/job/royale-asjs_MXTests/ws/mustella/mustella.swc>

check-compiler-home:

check-compiler:

compile:
     [echo] Compiling mustella.swc
     [echo] ROYALE_HOME: <http://apacheroyaleci2.westus2.cloudapp.azure.com:8080/job/royale-asjs_MXTests/ws/>
     [echo] ROYALE_COMPILER_HOME: <http://apacheroyaleci2.westus2.cloudapp.azure.com:8080/job/royale-asjs_MXTests/ws/js>
     [java] args:
     [java] +royalelib=<http://apacheroyaleci2.westus2.cloudapp.azure.com:8080/job/royale-asjs_MXTests/ws/frameworks>
     [java] +playerglobal.version=11.7
     [java] +env.PLAYERGLOBAL_HOME=C:\adobe\flash
     [java] +env.AIR_HOME=C:\adobe\air\4.0\AdobeAIRSDK
     [java] -compiler.strict-xml=true
     [java] -compiler.targets=SWF,JSRoyale
     [java] -output=<http://apacheroyaleci2.westus2.cloudapp.azure.com:8080/job/royale-asjs_MXTests/ws/mustella/mustella.swc>
     [java] -load-config=<http://apacheroyaleci2.westus2.cloudapp.azure.com:8080/job/royale-asjs_MXTests/ws/mustella/src/main/config/compile-swf-config.xml>
     [java] -js-load-config=<http://apacheroyaleci2.westus2.cloudapp.azure.com:8080/job/royale-asjs_MXTests/ws/frameworks/js-config.xml>
     [java] -js-load-config+=<http://apacheroyaleci2.westus2.cloudapp.azure.com:8080/job/royale-asjs_MXTests/ws/mustella/src/main/config/compile-js-config.xml>
     [java] target:SWF
     [java] target:JSRoyale
     [java] COMPC
     [java] Loading configuration: <http://apacheroyaleci2.westus2.cloudapp.azure.com:8080/job/royale-asjs_MXTests/ws/mustella/src/main/config/compile-swf-config.xml>
     [java] 
     [java] 58056 bytes written to C:\jenkins\workspace\royale-asjs_MXTests\mustella\mustella.swc in 4.764 seconds
     [java] COMPCJSCRoyale
     [java] <http://apacheroyaleci2.westus2.cloudapp.azure.com:8080/job/royale-asjs_MXTests/ws/mustella/src/main/royale/DontSendScriptComplete.as(21)>: col: 8 No definitions matching flash.net.* could be found.
     [java] 
     [java] import flash.net.*;
     [java]        ^
     [java] 
     [java] <http://apacheroyaleci2.westus2.cloudapp.azure.com:8080/job/royale-asjs_MXTests/ws/mustella/src/main/royale/DontSendScriptComplete.as(22)>: col: 8 Definition flash.events.Event could not be found.
     [java] 
     [java] import flash.events.Event;
     [java]        ^
     [java] 
     [java] 9.8379867 seconds
     [java] Picked up JAVA_TOOL_OPTIONS: -Dfile.encoding=UTF-8 -Xms384m -Xmx2g
     [java] Java Result: 2

compile-js:

main:

basictests-compile-java:
   [delete] Deleting directory <http://apacheroyaleci2.westus2.cloudapp.azure.com:8080/job/royale-asjs_MXTests/ws/mustella/target/classes>
    [mkdir] Created dir: <http://apacheroyaleci2.westus2.cloudapp.azure.com:8080/job/royale-asjs_MXTests/ws/mustella/target/classes>
    [javac] <http://apacheroyaleci2.westus2.cloudapp.azure.com:8080/job/royale-asjs_MXTests/ws/build.xml>:1336: warning: 'includeantruntime' was not set, defaulting to build.sysclasspath=last; set to false for repeatable builds
    [javac] Compiling 12 source files to <http://apacheroyaleci2.westus2.cloudapp.azure.com:8080/job/royale-asjs_MXTests/ws/mustella/target/classes>
    [javac] Note: <http://apacheroyaleci2.westus2.cloudapp.azure.com:8080/job/royale-asjs_MXTests/ws/mustella/src/main/java/marmotinni/DispatchMouseClickEvent.java> uses or overrides a deprecated API.
    [javac] Note: Recompile with -Xlint:deprecation for details.

mxtests-compile-java:

mxtests:
    [mxmlc] MXMLJSC
    [mxmlc] -sdk-js-lib=<http://apacheroyaleci2.westus2.cloudapp.azure.com:8080/job/royale-asjs_MXTests/ws/mustella/js>
    [mxmlc] +env.PLAYERGLOBAL_HOME=C:\adobe\flash
    [mxmlc] -compiler.debug=true
    [mxmlc] +royalelib=<http://apacheroyaleci2.westus2.cloudapp.azure.com:8080/job/royale-asjs_MXTests/ws/frameworks/>
    [mxmlc] -closure-lib=<http://apacheroyaleci2.westus2.cloudapp.azure.com:8080/job/royale-asjs_MXTests/ws/js/lib/google/closure-library>
    [mxmlc] +configname=flex
    [mxmlc] -compiler.library-path+=<http://apacheroyaleci2.westus2.cloudapp.azure.com:8080/job/royale-asjs_MXTests/ws/mustella/mustella.swc>
    [mxmlc] -compiler.js-external-library-path=<http://apacheroyaleci2.westus2.cloudapp.azure.com:8080/job/royale-asjs_MXTests/ws/js/libs/js.swc>
    [mxmlc] -compiler.js-library-path=<http://apacheroyaleci2.westus2.cloudapp.azure.com:8080/job/royale-asjs_MXTests/ws/frameworks/js/libs>
    [mxmlc] -compiler.js-library-path+=<http://apacheroyaleci2.westus2.cloudapp.azure.com:8080/job/royale-asjs_MXTests/ws/mustella/mustella.swc>
    [mxmlc] --
    [mxmlc] <http://apacheroyaleci2.westus2.cloudapp.azure.com:8080/job/royale-asjs_MXTests/ws/mustella/tests/mxtests/basicTests/BasicTests.mxml>
    [mxmlc] Loading configuration: <http://apacheroyaleci2.westus2.cloudapp.azure.com:8080/job/royale-asjs_MXTests/ws/frameworks/flex-config.xml>
    [mxmlc] Loading configuration: <http://apacheroyaleci2.westus2.cloudapp.azure.com:8080/job/royale-asjs_MXTests/ws/mustella/tests/mxtests/basicTests/BasicTests-config.xml>
    [mxmlc] 
    [mxmlc] 390456 bytes written to C:\jenkins\workspace\royale-asjs_MXTests\mustella\tests\mxtests\basicTests\BasicTests.swf in 9.704 seconds
    [mxmlc] The project 'BasicTests' has been successfully compiled.
    [mxmlc] <http://apacheroyaleci2.westus2.cloudapp.azure.com:8080/job/royale-asjs_MXTests/ws/frameworks/js/libs/BasicJS.swc> Warning: The definition goog.events depended on by org.apache.royale.html.TextInput in the SWC <http://apacheroyaleci2.westus2.cloudapp.azure.com:8080/job/royale-asjs_MXTests/ws/frameworks/js/libs/BasicJS.swc> could not be found
    [mxmlc] 
    [mxmlc] 
    [mxmlc] <http://apacheroyaleci2.westus2.cloudapp.azure.com:8080/job/royale-asjs_MXTests/ws/frameworks/js/libs/BasicJS.swc> Warning: The definition goog.events.BrowserEvent depended on by org.apache.royale.html.accessories.RestrictTextInputBead in the SWC <http://apacheroyaleci2.westus2.cloudapp.azure.com:8080/job/royale-asjs_MXTests/ws/frameworks/js/libs/BasicJS.swc> could not be found
    [mxmlc] 
    [mxmlc] 
    [mxmlc] <http://apacheroyaleci2.westus2.cloudapp.azure.com:8080/job/royale-asjs_MXTests/ws/frameworks/js/libs/BasicJS.swc> Warning: The definition goog.events depended on by org.apache.royale.html.beads.controllers.SpinnerMouseController in the SWC <http://apacheroyaleci2.westus2.cloudapp.azure.com:8080/job/royale-asjs_MXTests/ws/frameworks/js/libs/BasicJS.swc> could not be found
    [mxmlc] 
    [mxmlc] 
    [mxmlc] <http://apacheroyaleci2.westus2.cloudapp.azure.com:8080/job/royale-asjs_MXTests/ws/frameworks/js/libs/BasicJS.swc> Warning: The definition goog.events.EventType depended on by org.apache.royale.html.beads.controllers.SpinnerMouseController in the SWC <http://apacheroyaleci2.westus2.cloudapp.azure.com:8080/job/royale-asjs_MXTests/ws/frameworks/js/libs/BasicJS.swc> could not be found
    [mxmlc] 
    [mxmlc] 
    [mxmlc] <http://apacheroyaleci2.westus2.cloudapp.azure.com:8080/job/royale-asjs_MXTests/ws/frameworks/js/libs/BasicJS.swc> Warning: The definition goog.events depended on by org.apache.royale.html.beads.controllers.ItemRendererMouseController in the SWC <http://apacheroyaleci2.westus2.cloudapp.azure.com:8080/job/royale-asjs_MXTests/ws/frameworks/js/libs/BasicJS.swc> could not be found
    [mxmlc] 
    [mxmlc] 
    [mxmlc] <http://apacheroyaleci2.westus2.cloudapp.azure.com:8080/job/royale-asjs_MXTests/ws/frameworks/js/libs/BasicJS.swc> Warning: The definition goog.events.EventType depended on by org.apache.royale.html.beads.controllers.ItemRendererMouseController in the SWC <http://apacheroyaleci2.westus2.cloudapp.azure.com:8080/job/royale-asjs_MXTests/ws/frameworks/js/libs/BasicJS.swc> could not be found
    [mxmlc] 
    [mxmlc] 
    [mxmlc] <http://apacheroyaleci2.westus2.cloudapp.azure.com:8080/job/royale-asjs_MXTests/ws/frameworks/js/libs/BasicJS.swc> Warning: The definition goog.events.Event depended on by org.apache.royale.html.beads.controllers.ItemRendererMouseController in the SWC <http://apacheroyaleci2.westus2.cloudapp.azure.com:8080/job/royale-asjs_MXTests/ws/frameworks/js/libs/BasicJS.swc> could not be found
    [mxmlc] 
    [mxmlc] 
    [mxmlc] <http://apacheroyaleci2.westus2.cloudapp.azure.com:8080/job/royale-asjs_MXTests/ws/frameworks/js/libs/CoreJS.swc> Warning: The definition goog.events.BrowserEvent depended on by org.apache.royale.events.IBrowserEvent in the SWC <http://apacheroyaleci2.westus2.cloudapp.azure.com:8080/job/royale-asjs_MXTests/ws/frameworks/js/libs/CoreJS.swc> could not be found
    [mxmlc] 
    [mxmlc] 
    [mxmlc] <http://apacheroyaleci2.westus2.cloudapp.azure.com:8080/job/royale-asjs_MXTests/ws/frameworks/js/libs/CoreJS.swc> Warning: The definition goog.events.BrowserEvent depended on by org.apache.royale.events.KeyboardEvent in the SWC <http://apacheroyaleci2.westus2.cloudapp.azure.com:8080/job/royale-asjs_MXTests/ws/frameworks/js/libs/CoreJS.swc> could not be found
    [mxmlc] 
    [mxmlc] 
    [mxmlc] <http://apacheroyaleci2.westus2.cloudapp.azure.com:8080/job/royale-asjs_MXTests/ws/frameworks/js/libs/CoreJS.swc> Warning: The definition goog.DEBUG depended on by org.apache.royale.utils.BinaryData in the SWC <http://apacheroyaleci2.westus2.cloudapp.azure.com:8080/job/royale-asjs_MXTests/ws/frameworks/js/libs/CoreJS.swc> could not be found
    [mxmlc] 
    [mxmlc] 
    [mxmlc] <http://apacheroyaleci2.westus2.cloudapp.azure.com:8080/job/royale-asjs_MXTests/ws/frameworks/js/libs/CoreJS.swc> Warning: The definition goog.events.Event depended on by org.apache.royale.events.utils.KeyboardEventConverter in the SWC <http://apacheroyaleci2.westus2.cloudapp.azure.com:8080/job/royale-asjs_MXTests/ws/frameworks/js/libs/CoreJS.swc> could not be found
    [mxmlc] 
    [mxmlc] 
    [mxmlc] <http://apacheroyaleci2.westus2.cloudapp.azure.com:8080/job/royale-asjs_MXTests/ws/frameworks/js/libs/CoreJS.swc> Warning: The definition goog.events.BrowserEvent depended on by org.apache.royale.events.utils.KeyboardEventConverter in the SWC <http://apacheroyaleci2.westus2.cloudapp.azure.com:8080/job/royale-asjs_MXTests/ws/frameworks/js/libs/CoreJS.swc> could not be found
    [mxmlc] 
    [mxmlc] 
    [mxmlc] <http://apacheroyaleci2.westus2.cloudapp.azure.com:8080/job/royale-asjs_MXTests/ws/frameworks/js/libs/CoreJS.swc> Warning: The definition goog.events.Event depended on by org.apache.royale.events.utils.MouseEventConverter in the SWC <http://apacheroyaleci2.westus2.cloudapp.azure.com:8080/job/royale-asjs_MXTests/ws/frameworks/js/libs/CoreJS.swc> could not be found
    [mxmlc] 
    [mxmlc] 
    [mxmlc] <http://apacheroyaleci2.westus2.cloudapp.azure.com:8080/job/royale-asjs_MXTests/ws/frameworks/js/libs/CoreJS.swc> Warning: The definition goog.events.BrowserEvent depended on by org.apache.royale.events.utils.MouseEventConverter in the SWC <http://apacheroyaleci2.westus2.cloudapp.azure.com:8080/job/royale-asjs_MXTests/ws/frameworks/js/libs/CoreJS.swc> could not be found
    [mxmlc] 
    [mxmlc] 
    [mxmlc] <http://apacheroyaleci2.westus2.cloudapp.azure.com:8080/job/royale-asjs_MXTests/ws/frameworks/js/libs/CoreJS.swc> Warning: The definition goog.DEBUG depended on by org.apache.royale.debugging.assert in the SWC <http://apacheroyaleci2.westus2.cloudapp.azure.com:8080/job/royale-asjs_MXTests/ws/frameworks/js/libs/CoreJS.swc> could not be found
    [mxmlc] 
    [mxmlc] 
    [mxmlc] <http://apacheroyaleci2.westus2.cloudapp.azure.com:8080/job/royale-asjs_MXTests/ws/frameworks/js/libs/CoreJS.swc> Warning: The definition goog.bind depended on by org.apache.royale.utils.MXMLDataInterpreter in the SWC <http://apacheroyaleci2.westus2.cloudapp.azure.com:8080/job/royale-asjs_MXTests/ws/frameworks/js/libs/CoreJS.swc> could not be found
    [mxmlc] 
    [mxmlc] 
    [mxmlc] <http://apacheroyaleci2.westus2.cloudapp.azure.com:8080/job/royale-asjs_MXTests/ws/frameworks/js/libs/CoreJS.swc> Warning: The definition goog.events.Event depended on by org.apache.royale.events.Event in the SWC <http://apacheroyaleci2.westus2.cloudapp.azure.com:8080/job/royale-asjs_MXTests/ws/frameworks/js/libs/CoreJS.swc> could not be found
    [mxmlc] 
    [mxmlc] 
    [mxmlc] <http://apacheroyaleci2.westus2.cloudapp.azure.com:8080/job/royale-asjs_MXTests/ws/frameworks/js/libs/CoreJS.swc> Warning: The definition goog.events depended on by org.apache.royale.core.ElementWrapper in the SWC <http://apacheroyaleci2.westus2.cloudapp.azure.com:8080/job/royale-asjs_MXTests/ws/frameworks/js/libs/CoreJS.swc> could not be found
    [mxmlc] 
    [mxmlc] 
    [mxmlc] <http://apacheroyaleci2.westus2.cloudapp.azure.com:8080/job/royale-asjs_MXTests/ws/frameworks/js/libs/CoreJS.swc> Warning: The definition goog.events.BrowserEvent depended on by org.apache.royale.core.ElementWrapper in the SWC <http://apacheroyaleci2.westus2.cloudapp.azure.com:8080/job/royale-asjs_MXTests/ws/frameworks/js/libs/CoreJS.swc> could not be found
    [mxmlc] 
    [mxmlc] 
    [mxmlc] <http://apacheroyaleci2.westus2.cloudapp.azure.com:8080/job/royale-asjs_MXTests/ws/frameworks/js/libs/CoreJS.swc> Warning: The definition goog.DEBUG depended on by org.apache.royale.core.ElementWrapper in the SWC <http://apacheroyaleci2.westus2.cloudapp.azure.com:8080/job/royale-asjs_MXTests/ws/frameworks/js/libs/CoreJS.swc> could not be found
    [mxmlc] 
    [mxmlc] 
    [mxmlc] <http://apacheroyaleci2.westus2.cloudapp.azure.com:8080/job/royale-asjs_MXTests/ws/frameworks/js/libs/CoreJS.swc> Warning: The definition goog.events.BrowserEvent depended on by org.apache.royale.events.BrowserEvent in the SWC <http://apacheroyaleci2.westus2.cloudapp.azure.com:8080/job/royale-asjs_MXTests/ws/frameworks/js/libs/CoreJS.swc> could not be found
    [mxmlc] 
    [mxmlc] 
    [mxmlc] <http://apacheroyaleci2.westus2.cloudapp.azure.com:8080/job/royale-asjs_MXTests/ws/frameworks/js/libs/CoreJS.swc> Warning: The definition goog.DEBUG depended on by org.apache.royale.debugging.assertType in the SWC <http://apacheroyaleci2.westus2.cloudapp.azure.com:8080/job/royale-asjs_MXTests/ws/frameworks/js/libs/CoreJS.swc> could not be found
    [mxmlc] 
    [mxmlc] 
    [mxmlc] <http://apacheroyaleci2.westus2.cloudapp.azure.com:8080/job/royale-asjs_MXTests/ws/frameworks/js/libs/CoreJS.swc> Warning: The definition goog.events depended on by org.apache.royale.events.EventDispatcher in the SWC <http://apacheroyaleci2.westus2.cloudapp.azure.com:8080/job/royale-asjs_MXTests/ws/frameworks/js/libs/CoreJS.swc> could not be found
    [mxmlc] 
    [mxmlc] 
    [mxmlc] <http://apacheroyaleci2.westus2.cloudapp.azure.com:8080/job/royale-asjs_MXTests/ws/frameworks/js/libs/CoreJS.swc> Warning: The definition goog.events.EventTarget depended on by org.apache.royale.events.EventDispatcher in the SWC <http://apacheroyaleci2.westus2.cloudapp.azure.com:8080/job/royale-asjs_MXTests/ws/frameworks/js/libs/CoreJS.swc> could not be found
    [mxmlc] 
    [mxmlc] 
    [mxmlc] <http://apacheroyaleci2.westus2.cloudapp.azure.com:8080/job/royale-asjs_MXTests/ws/frameworks/js/libs/CoreJS.swc> Warning: The definition goog.events.Listener depended on by org.apache.royale.events.EventDispatcher in the SWC <http://apacheroyaleci2.westus2.cloudapp.azure.com:8080/job/royale-asjs_MXTests/ws/frameworks/js/libs/CoreJS.swc> could not be found
    [mxmlc] 
    [mxmlc] 
    [mxmlc] <http://apacheroyaleci2.westus2.cloudapp.azure.com:8080/job/royale-asjs_MXTests/ws/frameworks/js/libs/CoreJS.swc> Warning: The definition goog.DEBUG depended on by org.apache.royale.debugging.throwError in the SWC <http://apacheroyaleci2.westus2.cloudapp.azure.com:8080/job/royale-asjs_MXTests/ws/frameworks/js/libs/CoreJS.swc> could not be found
    [mxmlc] 
    [mxmlc] 
    [mxmlc] <http://apacheroyaleci2.westus2.cloudapp.azure.com:8080/job/royale-asjs_MXTests/ws/frameworks/js/libs/CoreJS.swc> Warning: The definition goog.events.BrowserEvent depended on by org.apache.royale.events.MouseEvent in the SWC <http://apacheroyaleci2.westus2.cloudapp.azure.com:8080/job/royale-asjs_MXTests/ws/frameworks/js/libs/CoreJS.swc> could not be found
    [mxmlc] 
    [mxmlc] 
    [mxmlc] <http://apacheroyaleci2.westus2.cloudapp.azure.com:8080/job/royale-asjs_MXTests/ws/frameworks/js/libs/LanguageJS.swc> Warning: The definition goog.bind depended on by org.apache.royale.utils.Language in the SWC <http://apacheroyaleci2.westus2.cloudapp.azure.com:8080/job/royale-asjs_MXTests/ws/frameworks/js/libs/LanguageJS.swc> could not be found
    [mxmlc] 
    [mxmlc] 
    [mxmlc] <http://apacheroyaleci2.westus2.cloudapp.azure.com:8080/job/royale-asjs_MXTests/ws/frameworks/js/libs/LanguageJS.swc> Warning: The definition goog.global depended on by org.apache.royale.utils.Language in the SWC <http://apacheroyaleci2.westus2.cloudapp.azure.com:8080/job/royale-asjs_MXTests/ws/frameworks/js/libs/LanguageJS.swc> could not be found
    [mxmlc] 
    [mxmlc] 
    [mxmlc] <http://apacheroyaleci2.westus2.cloudapp.azure.com:8080/job/royale-asjs_MXTests/ws/frameworks/js/libs/LanguageJS.swc> Warning: The definition goog.DEBUG depended on by org.apache.royale.utils.Language in the SWC <http://apacheroyaleci2.westus2.cloudapp.azure.com:8080/job/royale-asjs_MXTests/ws/frameworks/js/libs/LanguageJS.swc> could not be found
    [mxmlc] 
    [mxmlc] 
    [mxmlc] <http://apacheroyaleci2.westus2.cloudapp.azure.com:8080/job/royale-asjs_MXTests/ws/frameworks/js/libs/MXRoyaleJS.swc> Warning: The definition goog.events.Event depended on by mx.events.utils.KeyboardEventConverter in the SWC <http://apacheroyaleci2.westus2.cloudapp.azure.com:8080/job/royale-asjs_MXTests/ws/frameworks/js/libs/MXRoyaleJS.swc> could not be found
    [mxmlc] 
    [mxmlc] 
    [mxmlc] <http://apacheroyaleci2.westus2.cloudapp.azure.com:8080/job/royale-asjs_MXTests/ws/frameworks/js/libs/MXRoyaleJS.swc> Warning: The definition goog.events.BrowserEvent depended on by mx.events.utils.KeyboardEventConverter in the SWC <http://apacheroyaleci2.westus2.cloudapp.azure.com:8080/job/royale-asjs_MXTests/ws/frameworks/js/libs/MXRoyaleJS.swc> could not be found
    [mxmlc] 
    [mxmlc] 
    [mxmlc] <http://apacheroyaleci2.westus2.cloudapp.azure.com:8080/job/royale-asjs_MXTests/ws/frameworks/js/libs/MXRoyaleJS.swc> Warning: The definition goog.events depended on by mx.controls.TextInput in the SWC <http://apacheroyaleci2.westus2.cloudapp.azure.com:8080/job/royale-asjs_MXTests/ws/frameworks/js/libs/MXRoyaleJS.swc> could not be found
    [mxmlc] 
    [mxmlc] 
    [mxmlc] <http://apacheroyaleci2.westus2.cloudapp.azure.com:8080/job/royale-asjs_MXTests/ws/frameworks/js/libs/MXRoyaleJS.swc> Warning: The definition goog.events.BrowserEvent depended on by mx.events.utils.FocusEventConverter in the SWC <http://apacheroyaleci2.westus2.cloudapp.azure.com:8080/job/royale-asjs_MXTests/ws/frameworks/js/libs/MXRoyaleJS.swc> could not be found
    [mxmlc] 
    [mxmlc] 
    [mxmlc] <http://apacheroyaleci2.westus2.cloudapp.azure.com:8080/job/royale-asjs_MXTests/ws/frameworks/js/libs/MXRoyaleJS.swc> Warning: The definition goog.DEBUG depended on by mx.utils.ObjectUtil in the SWC <http://apacheroyaleci2.westus2.cloudapp.azure.com:8080/job/royale-asjs_MXTests/ws/frameworks/js/libs/MXRoyaleJS.swc> could not be found
    [mxmlc] 
    [mxmlc] 
    [mxmlc] <http://apacheroyaleci2.westus2.cloudapp.azure.com:8080/job/royale-asjs_MXTests/ws/frameworks/js/libs/MXRoyaleJS.swc> Warning: The definition goog.events.Event depended on by mx.events.utils.MouseEventConverter in the SWC <http://apacheroyaleci2.westus2.cloudapp.azure.com:8080/job/royale-asjs_MXTests/ws/frameworks/js/libs/MXRoyaleJS.swc> could not be found
    [mxmlc] 
    [mxmlc] 
    [mxmlc] <http://apacheroyaleci2.westus2.cloudapp.azure.com:8080/job/royale-asjs_MXTests/ws/frameworks/js/libs/MXRoyaleJS.swc> Warning: The definition goog.events.BrowserEvent depended on by mx.events.utils.MouseEventConverter in the SWC <http://apacheroyaleci2.westus2.cloudapp.azure.com:8080/job/royale-asjs_MXTests/ws/frameworks/js/libs/MXRoyaleJS.swc> could not be found
    [mxmlc] 
    [mxmlc] 
    [mxmlc] <http://apacheroyaleci2.westus2.cloudapp.azure.com:8080/job/royale-asjs_MXTests/ws/frameworks/js/libs/MXRoyaleJS.swc> Warning: The definition goog.events depended on by mx.controls.TextArea in the SWC <http://apacheroyaleci2.westus2.cloudapp.azure.com:8080/job/royale-asjs_MXTests/ws/frameworks/js/libs/MXRoyaleJS.swc> could not be found
    [mxmlc] 
    [mxmlc] 
    [mxmlc] <http://apacheroyaleci2.westus2.cloudapp.azure.com:8080/job/royale-asjs_MXTests/ws/frameworks/js/libs/NetworkJS.swc> Warning: The definition goog.DEBUG depended on by org.apache.royale.net.remoting.amf.AMFBinaryData in the SWC <http://apacheroyaleci2.westus2.cloudapp.azure.com:8080/job/royale-asjs_MXTests/ws/frameworks/js/libs/NetworkJS.swc> could not be found
    [mxmlc] 
    [mxmlc] 
    [mxmlc] <http://apacheroyaleci2.westus2.cloudapp.azure.com:8080/job/royale-asjs_MXTests/ws/frameworks/js/libs/ReflectionJS.swc> Warning: The definition goog.DEBUG depended on by org.apache.royale.reflection.AccessorDefinition in the SWC <http://apacheroyaleci2.westus2.cloudapp.azure.com:8080/job/royale-asjs_MXTests/ws/frameworks/js/libs/ReflectionJS.swc> could not be found
    [mxmlc] 
    [mxmlc] 
    [mxmlc] <http://apacheroyaleci2.westus2.cloudapp.azure.com:8080/job/royale-asjs_MXTests/ws/frameworks/js/libs/ReflectionJS.swc> Warning: The definition goog.DEBUG depended on by org.apache.royale.reflection.VariableDefinition in the SWC <http://apacheroyaleci2.westus2.cloudapp.azure.com:8080/job/royale-asjs_MXTests/ws/frameworks/js/libs/ReflectionJS.swc> could not be found
    [mxmlc] 
    [mxmlc] 
    [mxmlc] <http://apacheroyaleci2.westus2.cloudapp.azure.com:8080/job/royale-asjs_MXTests/ws/frameworks/js/libs/ReflectionJS.swc> Warning: The definition goog.DEBUG depended on by org.apache.royale.reflection.getDynamicFields in the SWC <http://apacheroyaleci2.westus2.cloudapp.azure.com:8080/job/royale-asjs_MXTests/ws/frameworks/js/libs/ReflectionJS.swc> could not be found
    [mxmlc] 
    [mxmlc] 
    [mxmlc] <http://apacheroyaleci2.westus2.cloudapp.azure.com:8080/job/royale-asjs_MXTests/ws/frameworks/js/libs/ReflectionJS.swc> Warning: The definition goog.global depended on by org.apache.royale.reflection.getDefinitionByName in the SWC <http://apacheroyaleci2.westus2.cloudapp.azure.com:8080/job/royale-asjs_MXTests/ws/frameworks/js/libs/ReflectionJS.swc> could not be found
    [mxmlc] 
    [mxmlc] 
    [mxmlc] <http://apacheroyaleci2.westus2.cloudapp.azure.com:8080/job/royale-asjs_MXTests/ws/frameworks/js/libs/SparkRoyaleJS.swc> Warning: The definition goog.DEBUG depended on by spark.components.supportClasses.SkinnableComponent in the SWC <http://apacheroyaleci2.westus2.cloudapp.azure.com:8080/job/royale-asjs_MXTests/ws/frameworks/js/libs/SparkRoyaleJS.swc> could not be found
    [mxmlc] 
    [mxmlc] 
    [mxmlc] 28.9427184 seconds
    [mxmlc] Picked up JAVA_TOOL_OPTIONS: -Dfile.encoding=UTF-8 -Xms384m -Xmx2g
     [echo] launching player and swf C:\adobe\flash\11.7\flashplayerdebugger.exe <http://apacheroyaleci2.westus2.cloudapp.azure.com:8080/job/royale-asjs_MXTests/ws/mustella/tests/mxtests/basicTests/BasicTests.swf>

mustellaresultsparser:
     [java] test case SetupListAndDataGridTest&result=fail&elapsed=626&phase=body&started=1583590012706&extraInfo=&msg=TypeError: failed
     [java] results: FAILED

BUILD FAILED
<http://apacheroyaleci2.westus2.cloudapp.azure.com:8080/job/royale-asjs_MXTests/ws/build.xml>:1532: The following error occurred while executing this line:
<http://apacheroyaleci2.westus2.cloudapp.azure.com:8080/job/royale-asjs_MXTests/ws/build.xml>:1459: Java returned: 1

Total time: 24 minutes 36 seconds
Picked up JAVA_TOOL_OPTIONS: -Dfile.encoding=UTF-8 -Xms384m -Xmx2g
Build step 'Invoke Ant' marked build as failure
Archiving artifacts

Build failed in Jenkins: royale-asjs_MXTests #731

Posted by ap...@gmail.com.
See <http://apacheroyaleci2.westus2.cloudapp.azure.com:8080/job/royale-asjs_MXTests/731/display/redirect>

Changes:


------------------------------------------
[...truncated 952.99 KB...]
checkintests:

mxtests-clean:
   [delete] Deleting directory <http://apacheroyaleci2.westus2.cloudapp.azure.com:8080/job/royale-asjs_MXTests/ws/mustella/tests/mxtests/basicTests/bin>

check-air-home:
     [echo] AIR_HOME is C:\adobe\air\4.0\AdobeAIRSDK

check-runtime-env:

runtime-setup:

load-task:

marmotinni-setup:

prepare:
     [echo] Making lib directory <http://apacheroyaleci2.westus2.cloudapp.azure.com:8080/job/royale-asjs_MXTests/ws/marmotinni/java/c>:\jenkins\workspace\royale-asjs_MXTests\marmotinni\java/lib

selenium3-jar-check:

selenium3-jar:

main:

clean:
   [delete] Deleting: <http://apacheroyaleci2.westus2.cloudapp.azure.com:8080/job/royale-asjs_MXTests/ws/mustella/mustella.swc>

check-compiler-home:

check-compiler:

compile:
     [echo] Compiling mustella.swc
     [echo] ROYALE_HOME: <http://apacheroyaleci2.westus2.cloudapp.azure.com:8080/job/royale-asjs_MXTests/ws/>
     [echo] ROYALE_COMPILER_HOME: <http://apacheroyaleci2.westus2.cloudapp.azure.com:8080/job/royale-asjs_MXTests/ws/js>
     [java] args:
     [java] +royalelib=<http://apacheroyaleci2.westus2.cloudapp.azure.com:8080/job/royale-asjs_MXTests/ws/frameworks>
     [java] +playerglobal.version=11.7
     [java] +env.PLAYERGLOBAL_HOME=C:\adobe\flash
     [java] +env.AIR_HOME=C:\adobe\air\4.0\AdobeAIRSDK
     [java] -compiler.strict-xml=true
     [java] -compiler.targets=SWF,JSRoyale
     [java] -output=<http://apacheroyaleci2.westus2.cloudapp.azure.com:8080/job/royale-asjs_MXTests/ws/mustella/mustella.swc>
     [java] -load-config=<http://apacheroyaleci2.westus2.cloudapp.azure.com:8080/job/royale-asjs_MXTests/ws/mustella/src/main/config/compile-swf-config.xml>
     [java] -js-load-config=<http://apacheroyaleci2.westus2.cloudapp.azure.com:8080/job/royale-asjs_MXTests/ws/frameworks/js-config.xml>
     [java] -js-load-config+=<http://apacheroyaleci2.westus2.cloudapp.azure.com:8080/job/royale-asjs_MXTests/ws/mustella/src/main/config/compile-js-config.xml>
     [java] target:SWF
     [java] target:JSRoyale
     [java] COMPC
     [java] Loading configuration: <http://apacheroyaleci2.westus2.cloudapp.azure.com:8080/job/royale-asjs_MXTests/ws/mustella/src/main/config/compile-swf-config.xml>
     [java] 
     [java] 58056 bytes written to C:\jenkins\workspace\royale-asjs_MXTests\mustella\mustella.swc in 4.454 seconds
     [java] COMPCJSCRoyale
     [java] <http://apacheroyaleci2.westus2.cloudapp.azure.com:8080/job/royale-asjs_MXTests/ws/mustella/src/main/royale/DontSendScriptComplete.as(21)>: col: 8 No definitions matching flash.net.* could be found.
     [java] 
     [java] import flash.net.*;
     [java]        ^
     [java] 
     [java] <http://apacheroyaleci2.westus2.cloudapp.azure.com:8080/job/royale-asjs_MXTests/ws/mustella/src/main/royale/DontSendScriptComplete.as(22)>: col: 8 Definition flash.events.Event could not be found.
     [java] 
     [java] import flash.events.Event;
     [java]        ^
     [java] 
     [java] 8.5061287 seconds
     [java] Picked up JAVA_TOOL_OPTIONS: -Dfile.encoding=UTF-8 -Xms384m -Xmx2g
     [java] Java Result: 2

compile-js:

main:

basictests-compile-java:
   [delete] Deleting directory <http://apacheroyaleci2.westus2.cloudapp.azure.com:8080/job/royale-asjs_MXTests/ws/mustella/target/classes>
    [mkdir] Created dir: <http://apacheroyaleci2.westus2.cloudapp.azure.com:8080/job/royale-asjs_MXTests/ws/mustella/target/classes>
    [javac] <http://apacheroyaleci2.westus2.cloudapp.azure.com:8080/job/royale-asjs_MXTests/ws/build.xml>:1336: warning: 'includeantruntime' was not set, defaulting to build.sysclasspath=last; set to false for repeatable builds
    [javac] Compiling 12 source files to <http://apacheroyaleci2.westus2.cloudapp.azure.com:8080/job/royale-asjs_MXTests/ws/mustella/target/classes>
    [javac] Note: <http://apacheroyaleci2.westus2.cloudapp.azure.com:8080/job/royale-asjs_MXTests/ws/mustella/src/main/java/marmotinni/DispatchMouseClickEvent.java> uses or overrides a deprecated API.
    [javac] Note: Recompile with -Xlint:deprecation for details.

mxtests-compile-java:

mxtests:
    [mxmlc] MXMLJSC
    [mxmlc] -sdk-js-lib=<http://apacheroyaleci2.westus2.cloudapp.azure.com:8080/job/royale-asjs_MXTests/ws/mustella/js>
    [mxmlc] +env.PLAYERGLOBAL_HOME=C:\adobe\flash
    [mxmlc] -compiler.debug=true
    [mxmlc] +royalelib=<http://apacheroyaleci2.westus2.cloudapp.azure.com:8080/job/royale-asjs_MXTests/ws/frameworks/>
    [mxmlc] -closure-lib=<http://apacheroyaleci2.westus2.cloudapp.azure.com:8080/job/royale-asjs_MXTests/ws/js/lib/google/closure-library>
    [mxmlc] +configname=flex
    [mxmlc] -compiler.library-path+=<http://apacheroyaleci2.westus2.cloudapp.azure.com:8080/job/royale-asjs_MXTests/ws/mustella/mustella.swc>
    [mxmlc] -compiler.js-external-library-path=<http://apacheroyaleci2.westus2.cloudapp.azure.com:8080/job/royale-asjs_MXTests/ws/js/libs/js.swc>
    [mxmlc] -compiler.js-library-path=<http://apacheroyaleci2.westus2.cloudapp.azure.com:8080/job/royale-asjs_MXTests/ws/frameworks/js/libs>
    [mxmlc] -compiler.js-library-path+=<http://apacheroyaleci2.westus2.cloudapp.azure.com:8080/job/royale-asjs_MXTests/ws/mustella/mustella.swc>
    [mxmlc] --
    [mxmlc] <http://apacheroyaleci2.westus2.cloudapp.azure.com:8080/job/royale-asjs_MXTests/ws/mustella/tests/mxtests/basicTests/BasicTests.mxml>
    [mxmlc] Loading configuration: <http://apacheroyaleci2.westus2.cloudapp.azure.com:8080/job/royale-asjs_MXTests/ws/frameworks/flex-config.xml>
    [mxmlc] Loading configuration: <http://apacheroyaleci2.westus2.cloudapp.azure.com:8080/job/royale-asjs_MXTests/ws/mustella/tests/mxtests/basicTests/BasicTests-config.xml>
    [mxmlc] 
    [mxmlc] 390454 bytes written to C:\jenkins\workspace\royale-asjs_MXTests\mustella\tests\mxtests\basicTests\BasicTests.swf in 8.108 seconds
    [mxmlc] The project 'BasicTests' has been successfully compiled.
    [mxmlc] <http://apacheroyaleci2.westus2.cloudapp.azure.com:8080/job/royale-asjs_MXTests/ws/frameworks/js/libs/BasicJS.swc> Warning: The definition goog.events depended on by org.apache.royale.html.TextInput in the SWC <http://apacheroyaleci2.westus2.cloudapp.azure.com:8080/job/royale-asjs_MXTests/ws/frameworks/js/libs/BasicJS.swc> could not be found
    [mxmlc] 
    [mxmlc] 
    [mxmlc] <http://apacheroyaleci2.westus2.cloudapp.azure.com:8080/job/royale-asjs_MXTests/ws/frameworks/js/libs/BasicJS.swc> Warning: The definition goog.events.BrowserEvent depended on by org.apache.royale.html.accessories.RestrictTextInputBead in the SWC <http://apacheroyaleci2.westus2.cloudapp.azure.com:8080/job/royale-asjs_MXTests/ws/frameworks/js/libs/BasicJS.swc> could not be found
    [mxmlc] 
    [mxmlc] 
    [mxmlc] <http://apacheroyaleci2.westus2.cloudapp.azure.com:8080/job/royale-asjs_MXTests/ws/frameworks/js/libs/BasicJS.swc> Warning: The definition goog.events depended on by org.apache.royale.html.beads.controllers.ItemRendererMouseController in the SWC <http://apacheroyaleci2.westus2.cloudapp.azure.com:8080/job/royale-asjs_MXTests/ws/frameworks/js/libs/BasicJS.swc> could not be found
    [mxmlc] 
    [mxmlc] 
    [mxmlc] <http://apacheroyaleci2.westus2.cloudapp.azure.com:8080/job/royale-asjs_MXTests/ws/frameworks/js/libs/BasicJS.swc> Warning: The definition goog.events.EventType depended on by org.apache.royale.html.beads.controllers.ItemRendererMouseController in the SWC <http://apacheroyaleci2.westus2.cloudapp.azure.com:8080/job/royale-asjs_MXTests/ws/frameworks/js/libs/BasicJS.swc> could not be found
    [mxmlc] 
    [mxmlc] 
    [mxmlc] <http://apacheroyaleci2.westus2.cloudapp.azure.com:8080/job/royale-asjs_MXTests/ws/frameworks/js/libs/BasicJS.swc> Warning: The definition goog.events.Event depended on by org.apache.royale.html.beads.controllers.ItemRendererMouseController in the SWC <http://apacheroyaleci2.westus2.cloudapp.azure.com:8080/job/royale-asjs_MXTests/ws/frameworks/js/libs/BasicJS.swc> could not be found
    [mxmlc] 
    [mxmlc] 
    [mxmlc] <http://apacheroyaleci2.westus2.cloudapp.azure.com:8080/job/royale-asjs_MXTests/ws/frameworks/js/libs/BasicJS.swc> Warning: The definition goog.events depended on by org.apache.royale.html.beads.controllers.SpinnerMouseController in the SWC <http://apacheroyaleci2.westus2.cloudapp.azure.com:8080/job/royale-asjs_MXTests/ws/frameworks/js/libs/BasicJS.swc> could not be found
    [mxmlc] 
    [mxmlc] 
    [mxmlc] <http://apacheroyaleci2.westus2.cloudapp.azure.com:8080/job/royale-asjs_MXTests/ws/frameworks/js/libs/BasicJS.swc> Warning: The definition goog.events.EventType depended on by org.apache.royale.html.beads.controllers.SpinnerMouseController in the SWC <http://apacheroyaleci2.westus2.cloudapp.azure.com:8080/job/royale-asjs_MXTests/ws/frameworks/js/libs/BasicJS.swc> could not be found
    [mxmlc] 
    [mxmlc] 
    [mxmlc] <http://apacheroyaleci2.westus2.cloudapp.azure.com:8080/job/royale-asjs_MXTests/ws/frameworks/js/libs/CoreJS.swc> Warning: The definition goog.events.Event depended on by org.apache.royale.events.utils.KeyboardEventConverter in the SWC <http://apacheroyaleci2.westus2.cloudapp.azure.com:8080/job/royale-asjs_MXTests/ws/frameworks/js/libs/CoreJS.swc> could not be found
    [mxmlc] 
    [mxmlc] 
    [mxmlc] <http://apacheroyaleci2.westus2.cloudapp.azure.com:8080/job/royale-asjs_MXTests/ws/frameworks/js/libs/CoreJS.swc> Warning: The definition goog.events.BrowserEvent depended on by org.apache.royale.events.utils.KeyboardEventConverter in the SWC <http://apacheroyaleci2.westus2.cloudapp.azure.com:8080/job/royale-asjs_MXTests/ws/frameworks/js/libs/CoreJS.swc> could not be found
    [mxmlc] 
    [mxmlc] 
    [mxmlc] <http://apacheroyaleci2.westus2.cloudapp.azure.com:8080/job/royale-asjs_MXTests/ws/frameworks/js/libs/CoreJS.swc> Warning: The definition goog.DEBUG depended on by org.apache.royale.debugging.throwError in the SWC <http://apacheroyaleci2.westus2.cloudapp.azure.com:8080/job/royale-asjs_MXTests/ws/frameworks/js/libs/CoreJS.swc> could not be found
    [mxmlc] 
    [mxmlc] 
    [mxmlc] <http://apacheroyaleci2.westus2.cloudapp.azure.com:8080/job/royale-asjs_MXTests/ws/frameworks/js/libs/CoreJS.swc> Warning: The definition goog.events.BrowserEvent depended on by org.apache.royale.events.IBrowserEvent in the SWC <http://apacheroyaleci2.westus2.cloudapp.azure.com:8080/job/royale-asjs_MXTests/ws/frameworks/js/libs/CoreJS.swc> could not be found
    [mxmlc] 
    [mxmlc] 
    [mxmlc] <http://apacheroyaleci2.westus2.cloudapp.azure.com:8080/job/royale-asjs_MXTests/ws/frameworks/js/libs/CoreJS.swc> Warning: The definition goog.events depended on by org.apache.royale.events.EventDispatcher in the SWC <http://apacheroyaleci2.westus2.cloudapp.azure.com:8080/job/royale-asjs_MXTests/ws/frameworks/js/libs/CoreJS.swc> could not be found
    [mxmlc] 
    [mxmlc] 
    [mxmlc] <http://apacheroyaleci2.westus2.cloudapp.azure.com:8080/job/royale-asjs_MXTests/ws/frameworks/js/libs/CoreJS.swc> Warning: The definition goog.events.EventTarget depended on by org.apache.royale.events.EventDispatcher in the SWC <http://apacheroyaleci2.westus2.cloudapp.azure.com:8080/job/royale-asjs_MXTests/ws/frameworks/js/libs/CoreJS.swc> could not be found
    [mxmlc] 
    [mxmlc] 
    [mxmlc] <http://apacheroyaleci2.westus2.cloudapp.azure.com:8080/job/royale-asjs_MXTests/ws/frameworks/js/libs/CoreJS.swc> Warning: The definition goog.events.Listener depended on by org.apache.royale.events.EventDispatcher in the SWC <http://apacheroyaleci2.westus2.cloudapp.azure.com:8080/job/royale-asjs_MXTests/ws/frameworks/js/libs/CoreJS.swc> could not be found
    [mxmlc] 
    [mxmlc] 
    [mxmlc] <http://apacheroyaleci2.westus2.cloudapp.azure.com:8080/job/royale-asjs_MXTests/ws/frameworks/js/libs/CoreJS.swc> Warning: The definition goog.events depended on by org.apache.royale.core.ElementWrapper in the SWC <http://apacheroyaleci2.westus2.cloudapp.azure.com:8080/job/royale-asjs_MXTests/ws/frameworks/js/libs/CoreJS.swc> could not be found
    [mxmlc] 
    [mxmlc] 
    [mxmlc] <http://apacheroyaleci2.westus2.cloudapp.azure.com:8080/job/royale-asjs_MXTests/ws/frameworks/js/libs/CoreJS.swc> Warning: The definition goog.events.BrowserEvent depended on by org.apache.royale.core.ElementWrapper in the SWC <http://apacheroyaleci2.westus2.cloudapp.azure.com:8080/job/royale-asjs_MXTests/ws/frameworks/js/libs/CoreJS.swc> could not be found
    [mxmlc] 
    [mxmlc] 
    [mxmlc] <http://apacheroyaleci2.westus2.cloudapp.azure.com:8080/job/royale-asjs_MXTests/ws/frameworks/js/libs/CoreJS.swc> Warning: The definition goog.DEBUG depended on by org.apache.royale.core.ElementWrapper in the SWC <http://apacheroyaleci2.westus2.cloudapp.azure.com:8080/job/royale-asjs_MXTests/ws/frameworks/js/libs/CoreJS.swc> could not be found
    [mxmlc] 
    [mxmlc] 
    [mxmlc] <http://apacheroyaleci2.westus2.cloudapp.azure.com:8080/job/royale-asjs_MXTests/ws/frameworks/js/libs/CoreJS.swc> Warning: The definition goog.events.BrowserEvent depended on by org.apache.royale.events.KeyboardEvent in the SWC <http://apacheroyaleci2.westus2.cloudapp.azure.com:8080/job/royale-asjs_MXTests/ws/frameworks/js/libs/CoreJS.swc> could not be found
    [mxmlc] 
    [mxmlc] 
    [mxmlc] <http://apacheroyaleci2.westus2.cloudapp.azure.com:8080/job/royale-asjs_MXTests/ws/frameworks/js/libs/CoreJS.swc> Warning: The definition goog.DEBUG depended on by org.apache.royale.debugging.assert in the SWC <http://apacheroyaleci2.westus2.cloudapp.azure.com:8080/job/royale-asjs_MXTests/ws/frameworks/js/libs/CoreJS.swc> could not be found
    [mxmlc] 
    [mxmlc] 
    [mxmlc] <http://apacheroyaleci2.westus2.cloudapp.azure.com:8080/job/royale-asjs_MXTests/ws/frameworks/js/libs/CoreJS.swc> Warning: The definition goog.DEBUG depended on by org.apache.royale.debugging.assertType in the SWC <http://apacheroyaleci2.westus2.cloudapp.azure.com:8080/job/royale-asjs_MXTests/ws/frameworks/js/libs/CoreJS.swc> could not be found
    [mxmlc] 
    [mxmlc] 
    [mxmlc] <http://apacheroyaleci2.westus2.cloudapp.azure.com:8080/job/royale-asjs_MXTests/ws/frameworks/js/libs/CoreJS.swc> Warning: The definition goog.events.BrowserEvent depended on by org.apache.royale.events.MouseEvent in the SWC <http://apacheroyaleci2.westus2.cloudapp.azure.com:8080/job/royale-asjs_MXTests/ws/frameworks/js/libs/CoreJS.swc> could not be found
    [mxmlc] 
    [mxmlc] 
    [mxmlc] <http://apacheroyaleci2.westus2.cloudapp.azure.com:8080/job/royale-asjs_MXTests/ws/frameworks/js/libs/CoreJS.swc> Warning: The definition goog.DEBUG depended on by org.apache.royale.utils.BinaryData in the SWC <http://apacheroyaleci2.westus2.cloudapp.azure.com:8080/job/royale-asjs_MXTests/ws/frameworks/js/libs/CoreJS.swc> could not be found
    [mxmlc] 
    [mxmlc] 
    [mxmlc] <http://apacheroyaleci2.westus2.cloudapp.azure.com:8080/job/royale-asjs_MXTests/ws/frameworks/js/libs/CoreJS.swc> Warning: The definition goog.events.BrowserEvent depended on by org.apache.royale.events.BrowserEvent in the SWC <http://apacheroyaleci2.westus2.cloudapp.azure.com:8080/job/royale-asjs_MXTests/ws/frameworks/js/libs/CoreJS.swc> could not be found
    [mxmlc] 
    [mxmlc] 
    [mxmlc] <http://apacheroyaleci2.westus2.cloudapp.azure.com:8080/job/royale-asjs_MXTests/ws/frameworks/js/libs/CoreJS.swc> Warning: The definition goog.events.Event depended on by org.apache.royale.events.utils.MouseEventConverter in the SWC <http://apacheroyaleci2.westus2.cloudapp.azure.com:8080/job/royale-asjs_MXTests/ws/frameworks/js/libs/CoreJS.swc> could not be found
    [mxmlc] 
    [mxmlc] 
    [mxmlc] <http://apacheroyaleci2.westus2.cloudapp.azure.com:8080/job/royale-asjs_MXTests/ws/frameworks/js/libs/CoreJS.swc> Warning: The definition goog.events.BrowserEvent depended on by org.apache.royale.events.utils.MouseEventConverter in the SWC <http://apacheroyaleci2.westus2.cloudapp.azure.com:8080/job/royale-asjs_MXTests/ws/frameworks/js/libs/CoreJS.swc> could not be found
    [mxmlc] 
    [mxmlc] 
    [mxmlc] <http://apacheroyaleci2.westus2.cloudapp.azure.com:8080/job/royale-asjs_MXTests/ws/frameworks/js/libs/CoreJS.swc> Warning: The definition goog.events.Event depended on by org.apache.royale.events.Event in the SWC <http://apacheroyaleci2.westus2.cloudapp.azure.com:8080/job/royale-asjs_MXTests/ws/frameworks/js/libs/CoreJS.swc> could not be found
    [mxmlc] 
    [mxmlc] 
    [mxmlc] <http://apacheroyaleci2.westus2.cloudapp.azure.com:8080/job/royale-asjs_MXTests/ws/frameworks/js/libs/CoreJS.swc> Warning: The definition goog.bind depended on by org.apache.royale.utils.MXMLDataInterpreter in the SWC <http://apacheroyaleci2.westus2.cloudapp.azure.com:8080/job/royale-asjs_MXTests/ws/frameworks/js/libs/CoreJS.swc> could not be found
    [mxmlc] 
    [mxmlc] 
    [mxmlc] <http://apacheroyaleci2.westus2.cloudapp.azure.com:8080/job/royale-asjs_MXTests/ws/frameworks/js/libs/LanguageJS.swc> Warning: The definition goog.bind depended on by org.apache.royale.utils.Language in the SWC <http://apacheroyaleci2.westus2.cloudapp.azure.com:8080/job/royale-asjs_MXTests/ws/frameworks/js/libs/LanguageJS.swc> could not be found
    [mxmlc] 
    [mxmlc] 
    [mxmlc] <http://apacheroyaleci2.westus2.cloudapp.azure.com:8080/job/royale-asjs_MXTests/ws/frameworks/js/libs/LanguageJS.swc> Warning: The definition goog.global depended on by org.apache.royale.utils.Language in the SWC <http://apacheroyaleci2.westus2.cloudapp.azure.com:8080/job/royale-asjs_MXTests/ws/frameworks/js/libs/LanguageJS.swc> could not be found
    [mxmlc] 
    [mxmlc] 
    [mxmlc] <http://apacheroyaleci2.westus2.cloudapp.azure.com:8080/job/royale-asjs_MXTests/ws/frameworks/js/libs/LanguageJS.swc> Warning: The definition goog.DEBUG depended on by org.apache.royale.utils.Language in the SWC <http://apacheroyaleci2.westus2.cloudapp.azure.com:8080/job/royale-asjs_MXTests/ws/frameworks/js/libs/LanguageJS.swc> could not be found
    [mxmlc] 
    [mxmlc] 
    [mxmlc] <http://apacheroyaleci2.westus2.cloudapp.azure.com:8080/job/royale-asjs_MXTests/ws/frameworks/js/libs/MXRoyaleJS.swc> Warning: The definition goog.events.BrowserEvent depended on by mx.events.utils.FocusEventConverter in the SWC <http://apacheroyaleci2.westus2.cloudapp.azure.com:8080/job/royale-asjs_MXTests/ws/frameworks/js/libs/MXRoyaleJS.swc> could not be found
    [mxmlc] 
    [mxmlc] 
    [mxmlc] <http://apacheroyaleci2.westus2.cloudapp.azure.com:8080/job/royale-asjs_MXTests/ws/frameworks/js/libs/MXRoyaleJS.swc> Warning: The definition goog.events.Event depended on by mx.events.utils.MouseEventConverter in the SWC <http://apacheroyaleci2.westus2.cloudapp.azure.com:8080/job/royale-asjs_MXTests/ws/frameworks/js/libs/MXRoyaleJS.swc> could not be found
    [mxmlc] 
    [mxmlc] 
    [mxmlc] <http://apacheroyaleci2.westus2.cloudapp.azure.com:8080/job/royale-asjs_MXTests/ws/frameworks/js/libs/MXRoyaleJS.swc> Warning: The definition goog.events.BrowserEvent depended on by mx.events.utils.MouseEventConverter in the SWC <http://apacheroyaleci2.westus2.cloudapp.azure.com:8080/job/royale-asjs_MXTests/ws/frameworks/js/libs/MXRoyaleJS.swc> could not be found
    [mxmlc] 
    [mxmlc] 
    [mxmlc] <http://apacheroyaleci2.westus2.cloudapp.azure.com:8080/job/royale-asjs_MXTests/ws/frameworks/js/libs/MXRoyaleJS.swc> Warning: The definition goog.events depended on by mx.controls.TextArea in the SWC <http://apacheroyaleci2.westus2.cloudapp.azure.com:8080/job/royale-asjs_MXTests/ws/frameworks/js/libs/MXRoyaleJS.swc> could not be found
    [mxmlc] 
    [mxmlc] 
    [mxmlc] <http://apacheroyaleci2.westus2.cloudapp.azure.com:8080/job/royale-asjs_MXTests/ws/frameworks/js/libs/MXRoyaleJS.swc> Warning: The definition goog.events.Event depended on by mx.events.utils.KeyboardEventConverter in the SWC <http://apacheroyaleci2.westus2.cloudapp.azure.com:8080/job/royale-asjs_MXTests/ws/frameworks/js/libs/MXRoyaleJS.swc> could not be found
    [mxmlc] 
    [mxmlc] 
    [mxmlc] <http://apacheroyaleci2.westus2.cloudapp.azure.com:8080/job/royale-asjs_MXTests/ws/frameworks/js/libs/MXRoyaleJS.swc> Warning: The definition goog.events.BrowserEvent depended on by mx.events.utils.KeyboardEventConverter in the SWC <http://apacheroyaleci2.westus2.cloudapp.azure.com:8080/job/royale-asjs_MXTests/ws/frameworks/js/libs/MXRoyaleJS.swc> could not be found
    [mxmlc] 
    [mxmlc] 
    [mxmlc] <http://apacheroyaleci2.westus2.cloudapp.azure.com:8080/job/royale-asjs_MXTests/ws/frameworks/js/libs/MXRoyaleJS.swc> Warning: The definition goog.DEBUG depended on by mx.utils.ObjectUtil in the SWC <http://apacheroyaleci2.westus2.cloudapp.azure.com:8080/job/royale-asjs_MXTests/ws/frameworks/js/libs/MXRoyaleJS.swc> could not be found
    [mxmlc] 
    [mxmlc] 
    [mxmlc] <http://apacheroyaleci2.westus2.cloudapp.azure.com:8080/job/royale-asjs_MXTests/ws/frameworks/js/libs/MXRoyaleJS.swc> Warning: The definition goog.events depended on by mx.controls.TextInput in the SWC <http://apacheroyaleci2.westus2.cloudapp.azure.com:8080/job/royale-asjs_MXTests/ws/frameworks/js/libs/MXRoyaleJS.swc> could not be found
    [mxmlc] 
    [mxmlc] 
    [mxmlc] <http://apacheroyaleci2.westus2.cloudapp.azure.com:8080/job/royale-asjs_MXTests/ws/frameworks/js/libs/NetworkJS.swc> Warning: The definition goog.DEBUG depended on by org.apache.royale.net.remoting.amf.AMFBinaryData in the SWC <http://apacheroyaleci2.westus2.cloudapp.azure.com:8080/job/royale-asjs_MXTests/ws/frameworks/js/libs/NetworkJS.swc> could not be found
    [mxmlc] 
    [mxmlc] 
    [mxmlc] <http://apacheroyaleci2.westus2.cloudapp.azure.com:8080/job/royale-asjs_MXTests/ws/frameworks/js/libs/ReflectionJS.swc> Warning: The definition goog.DEBUG depended on by org.apache.royale.reflection.VariableDefinition in the SWC <http://apacheroyaleci2.westus2.cloudapp.azure.com:8080/job/royale-asjs_MXTests/ws/frameworks/js/libs/ReflectionJS.swc> could not be found
    [mxmlc] 
    [mxmlc] 
    [mxmlc] <http://apacheroyaleci2.westus2.cloudapp.azure.com:8080/job/royale-asjs_MXTests/ws/frameworks/js/libs/ReflectionJS.swc> Warning: The definition goog.global depended on by org.apache.royale.reflection.getDefinitionByName in the SWC <http://apacheroyaleci2.westus2.cloudapp.azure.com:8080/job/royale-asjs_MXTests/ws/frameworks/js/libs/ReflectionJS.swc> could not be found
    [mxmlc] 
    [mxmlc] 
    [mxmlc] <http://apacheroyaleci2.westus2.cloudapp.azure.com:8080/job/royale-asjs_MXTests/ws/frameworks/js/libs/ReflectionJS.swc> Warning: The definition goog.DEBUG depended on by org.apache.royale.reflection.getDynamicFields in the SWC <http://apacheroyaleci2.westus2.cloudapp.azure.com:8080/job/royale-asjs_MXTests/ws/frameworks/js/libs/ReflectionJS.swc> could not be found
    [mxmlc] 
    [mxmlc] 
    [mxmlc] <http://apacheroyaleci2.westus2.cloudapp.azure.com:8080/job/royale-asjs_MXTests/ws/frameworks/js/libs/ReflectionJS.swc> Warning: The definition goog.DEBUG depended on by org.apache.royale.reflection.AccessorDefinition in the SWC <http://apacheroyaleci2.westus2.cloudapp.azure.com:8080/job/royale-asjs_MXTests/ws/frameworks/js/libs/ReflectionJS.swc> could not be found
    [mxmlc] 
    [mxmlc] 
    [mxmlc] <http://apacheroyaleci2.westus2.cloudapp.azure.com:8080/job/royale-asjs_MXTests/ws/frameworks/js/libs/SparkRoyaleJS.swc> Warning: The definition goog.DEBUG depended on by spark.components.supportClasses.SkinnableComponent in the SWC <http://apacheroyaleci2.westus2.cloudapp.azure.com:8080/job/royale-asjs_MXTests/ws/frameworks/js/libs/SparkRoyaleJS.swc> could not be found
    [mxmlc] 
    [mxmlc] 
    [mxmlc] Picked up JAVA_TOOL_OPTIONS: -Dfile.encoding=UTF-8 -Xms384m -Xmx2g
    [mxmlc] 24.6590506 seconds
     [echo] launching player and swf C:\adobe\flash\11.7\flashplayerdebugger.exe <http://apacheroyaleci2.westus2.cloudapp.azure.com:8080/job/royale-asjs_MXTests/ws/mustella/tests/mxtests/basicTests/BasicTests.swf>

mustellaresultsparser:
     [java] test case SetupListAndDataGridTest&result=fail&elapsed=684&phase=body&started=1583574599205&extraInfo=&msg=TypeError: failed
     [java] results: FAILED

BUILD FAILED
<http://apacheroyaleci2.westus2.cloudapp.azure.com:8080/job/royale-asjs_MXTests/ws/build.xml>:1532: The following error occurred while executing this line:
<http://apacheroyaleci2.westus2.cloudapp.azure.com:8080/job/royale-asjs_MXTests/ws/build.xml>:1459: Java returned: 1

Total time: 25 minutes 48 seconds
Picked up JAVA_TOOL_OPTIONS: -Dfile.encoding=UTF-8 -Xms384m -Xmx2g
Build step 'Invoke Ant' marked build as failure
Archiving artifacts

Build failed in Jenkins: royale-asjs_MXTests #730

Posted by ap...@gmail.com.
See <http://apacheroyaleci2.westus2.cloudapp.azure.com:8080/job/royale-asjs_MXTests/730/display/redirect>

Changes:


------------------------------------------
[...truncated 952.35 KB...]
checkintests:

mxtests-clean:
   [delete] Deleting directory <http://apacheroyaleci2.westus2.cloudapp.azure.com:8080/job/royale-asjs_MXTests/ws/mustella/tests/mxtests/basicTests/bin>

check-air-home:
     [echo] AIR_HOME is C:\adobe\air\4.0\AdobeAIRSDK

check-runtime-env:

runtime-setup:

load-task:

marmotinni-setup:

prepare:
     [echo] Making lib directory <http://apacheroyaleci2.westus2.cloudapp.azure.com:8080/job/royale-asjs_MXTests/ws/marmotinni/java/c>:\jenkins\workspace\royale-asjs_MXTests\marmotinni\java/lib

selenium3-jar-check:

selenium3-jar:

main:

clean:
   [delete] Deleting: <http://apacheroyaleci2.westus2.cloudapp.azure.com:8080/job/royale-asjs_MXTests/ws/mustella/mustella.swc>

check-compiler-home:

check-compiler:

compile:
     [echo] Compiling mustella.swc
     [echo] ROYALE_HOME: <http://apacheroyaleci2.westus2.cloudapp.azure.com:8080/job/royale-asjs_MXTests/ws/>
     [echo] ROYALE_COMPILER_HOME: <http://apacheroyaleci2.westus2.cloudapp.azure.com:8080/job/royale-asjs_MXTests/ws/js>
     [java] args:
     [java] +royalelib=<http://apacheroyaleci2.westus2.cloudapp.azure.com:8080/job/royale-asjs_MXTests/ws/frameworks>
     [java] +playerglobal.version=11.7
     [java] +env.PLAYERGLOBAL_HOME=C:\adobe\flash
     [java] +env.AIR_HOME=C:\adobe\air\4.0\AdobeAIRSDK
     [java] -compiler.strict-xml=true
     [java] -compiler.targets=SWF,JSRoyale
     [java] -output=<http://apacheroyaleci2.westus2.cloudapp.azure.com:8080/job/royale-asjs_MXTests/ws/mustella/mustella.swc>
     [java] -load-config=<http://apacheroyaleci2.westus2.cloudapp.azure.com:8080/job/royale-asjs_MXTests/ws/mustella/src/main/config/compile-swf-config.xml>
     [java] -js-load-config=<http://apacheroyaleci2.westus2.cloudapp.azure.com:8080/job/royale-asjs_MXTests/ws/frameworks/js-config.xml>
     [java] -js-load-config+=<http://apacheroyaleci2.westus2.cloudapp.azure.com:8080/job/royale-asjs_MXTests/ws/mustella/src/main/config/compile-js-config.xml>
     [java] target:SWF
     [java] target:JSRoyale
     [java] COMPC
     [java] Loading configuration: <http://apacheroyaleci2.westus2.cloudapp.azure.com:8080/job/royale-asjs_MXTests/ws/mustella/src/main/config/compile-swf-config.xml>
     [java] 
     [java] 58056 bytes written to C:\jenkins\workspace\royale-asjs_MXTests\mustella\mustella.swc in 4.513 seconds
     [java] COMPCJSCRoyale
     [java] 7.6665888 seconds
     [java] <http://apacheroyaleci2.westus2.cloudapp.azure.com:8080/job/royale-asjs_MXTests/ws/mustella/src/main/royale/DontSendScriptComplete.as(21)>: col: 8 No definitions matching flash.net.* could be found.
     [java] 
     [java] import flash.net.*;
     [java]        ^
     [java] 
     [java] <http://apacheroyaleci2.westus2.cloudapp.azure.com:8080/job/royale-asjs_MXTests/ws/mustella/src/main/royale/DontSendScriptComplete.as(22)>: col: 8 Definition flash.events.Event could not be found.
     [java] 
     [java] import flash.events.Event;
     [java]        ^
     [java] 
     [java] Picked up JAVA_TOOL_OPTIONS: -Dfile.encoding=UTF-8 -Xms384m -Xmx2g
     [java] Java Result: 2

compile-js:

main:

basictests-compile-java:
   [delete] Deleting directory <http://apacheroyaleci2.westus2.cloudapp.azure.com:8080/job/royale-asjs_MXTests/ws/mustella/target/classes>
    [mkdir] Created dir: <http://apacheroyaleci2.westus2.cloudapp.azure.com:8080/job/royale-asjs_MXTests/ws/mustella/target/classes>
    [javac] <http://apacheroyaleci2.westus2.cloudapp.azure.com:8080/job/royale-asjs_MXTests/ws/build.xml>:1336: warning: 'includeantruntime' was not set, defaulting to build.sysclasspath=last; set to false for repeatable builds
    [javac] Compiling 12 source files to <http://apacheroyaleci2.westus2.cloudapp.azure.com:8080/job/royale-asjs_MXTests/ws/mustella/target/classes>
    [javac] Note: <http://apacheroyaleci2.westus2.cloudapp.azure.com:8080/job/royale-asjs_MXTests/ws/mustella/src/main/java/marmotinni/DispatchMouseClickEvent.java> uses or overrides a deprecated API.
    [javac] Note: Recompile with -Xlint:deprecation for details.

mxtests-compile-java:

mxtests:
    [mxmlc] MXMLJSC
    [mxmlc] -sdk-js-lib=<http://apacheroyaleci2.westus2.cloudapp.azure.com:8080/job/royale-asjs_MXTests/ws/mustella/js>
    [mxmlc] +env.PLAYERGLOBAL_HOME=C:\adobe\flash
    [mxmlc] -compiler.debug=true
    [mxmlc] +royalelib=<http://apacheroyaleci2.westus2.cloudapp.azure.com:8080/job/royale-asjs_MXTests/ws/frameworks/>
    [mxmlc] -closure-lib=<http://apacheroyaleci2.westus2.cloudapp.azure.com:8080/job/royale-asjs_MXTests/ws/js/lib/google/closure-library>
    [mxmlc] +configname=flex
    [mxmlc] -compiler.library-path+=<http://apacheroyaleci2.westus2.cloudapp.azure.com:8080/job/royale-asjs_MXTests/ws/mustella/mustella.swc>
    [mxmlc] -compiler.js-external-library-path=<http://apacheroyaleci2.westus2.cloudapp.azure.com:8080/job/royale-asjs_MXTests/ws/js/libs/js.swc>
    [mxmlc] -compiler.js-library-path=<http://apacheroyaleci2.westus2.cloudapp.azure.com:8080/job/royale-asjs_MXTests/ws/frameworks/js/libs>
    [mxmlc] -compiler.js-library-path+=<http://apacheroyaleci2.westus2.cloudapp.azure.com:8080/job/royale-asjs_MXTests/ws/mustella/mustella.swc>
    [mxmlc] --
    [mxmlc] <http://apacheroyaleci2.westus2.cloudapp.azure.com:8080/job/royale-asjs_MXTests/ws/mustella/tests/mxtests/basicTests/BasicTests.mxml>
    [mxmlc] Loading configuration: <http://apacheroyaleci2.westus2.cloudapp.azure.com:8080/job/royale-asjs_MXTests/ws/frameworks/flex-config.xml>
    [mxmlc] Loading configuration: <http://apacheroyaleci2.westus2.cloudapp.azure.com:8080/job/royale-asjs_MXTests/ws/mustella/tests/mxtests/basicTests/BasicTests-config.xml>
    [mxmlc] 
    [mxmlc] 390456 bytes written to C:\jenkins\workspace\royale-asjs_MXTests\mustella\tests\mxtests\basicTests\BasicTests.swf in 10.852 seconds
    [mxmlc] The project 'BasicTests' has been successfully compiled.
    [mxmlc] <http://apacheroyaleci2.westus2.cloudapp.azure.com:8080/job/royale-asjs_MXTests/ws/frameworks/js/libs/BasicJS.swc> Warning: The definition goog.events.BrowserEvent depended on by org.apache.royale.html.accessories.RestrictTextInputBead in the SWC <http://apacheroyaleci2.westus2.cloudapp.azure.com:8080/job/royale-asjs_MXTests/ws/frameworks/js/libs/BasicJS.swc> could not be found
    [mxmlc] 
    [mxmlc] 
    [mxmlc] <http://apacheroyaleci2.westus2.cloudapp.azure.com:8080/job/royale-asjs_MXTests/ws/frameworks/js/libs/BasicJS.swc> Warning: The definition goog.events depended on by org.apache.royale.html.TextInput in the SWC <http://apacheroyaleci2.westus2.cloudapp.azure.com:8080/job/royale-asjs_MXTests/ws/frameworks/js/libs/BasicJS.swc> could not be found
    [mxmlc] 
    [mxmlc] 
    [mxmlc] <http://apacheroyaleci2.westus2.cloudapp.azure.com:8080/job/royale-asjs_MXTests/ws/frameworks/js/libs/BasicJS.swc> Warning: The definition goog.events depended on by org.apache.royale.html.beads.controllers.ItemRendererMouseController in the SWC <http://apacheroyaleci2.westus2.cloudapp.azure.com:8080/job/royale-asjs_MXTests/ws/frameworks/js/libs/BasicJS.swc> could not be found
    [mxmlc] 
    [mxmlc] 
    [mxmlc] <http://apacheroyaleci2.westus2.cloudapp.azure.com:8080/job/royale-asjs_MXTests/ws/frameworks/js/libs/BasicJS.swc> Warning: The definition goog.events.EventType depended on by org.apache.royale.html.beads.controllers.ItemRendererMouseController in the SWC <http://apacheroyaleci2.westus2.cloudapp.azure.com:8080/job/royale-asjs_MXTests/ws/frameworks/js/libs/BasicJS.swc> could not be found
    [mxmlc] 
    [mxmlc] 
    [mxmlc] <http://apacheroyaleci2.westus2.cloudapp.azure.com:8080/job/royale-asjs_MXTests/ws/frameworks/js/libs/BasicJS.swc> Warning: The definition goog.events.Event depended on by org.apache.royale.html.beads.controllers.ItemRendererMouseController in the SWC <http://apacheroyaleci2.westus2.cloudapp.azure.com:8080/job/royale-asjs_MXTests/ws/frameworks/js/libs/BasicJS.swc> could not be found
    [mxmlc] 
    [mxmlc] 
    [mxmlc] <http://apacheroyaleci2.westus2.cloudapp.azure.com:8080/job/royale-asjs_MXTests/ws/frameworks/js/libs/BasicJS.swc> Warning: The definition goog.events depended on by org.apache.royale.html.beads.controllers.SpinnerMouseController in the SWC <http://apacheroyaleci2.westus2.cloudapp.azure.com:8080/job/royale-asjs_MXTests/ws/frameworks/js/libs/BasicJS.swc> could not be found
    [mxmlc] 
    [mxmlc] 
    [mxmlc] <http://apacheroyaleci2.westus2.cloudapp.azure.com:8080/job/royale-asjs_MXTests/ws/frameworks/js/libs/BasicJS.swc> Warning: The definition goog.events.EventType depended on by org.apache.royale.html.beads.controllers.SpinnerMouseController in the SWC <http://apacheroyaleci2.westus2.cloudapp.azure.com:8080/job/royale-asjs_MXTests/ws/frameworks/js/libs/BasicJS.swc> could not be found
    [mxmlc] 
    [mxmlc] 
    [mxmlc] <http://apacheroyaleci2.westus2.cloudapp.azure.com:8080/job/royale-asjs_MXTests/ws/frameworks/js/libs/CoreJS.swc> Warning: The definition goog.events.BrowserEvent depended on by org.apache.royale.events.KeyboardEvent in the SWC <http://apacheroyaleci2.westus2.cloudapp.azure.com:8080/job/royale-asjs_MXTests/ws/frameworks/js/libs/CoreJS.swc> could not be found
    [mxmlc] 
    [mxmlc] 
    [mxmlc] <http://apacheroyaleci2.westus2.cloudapp.azure.com:8080/job/royale-asjs_MXTests/ws/frameworks/js/libs/CoreJS.swc> Warning: The definition goog.DEBUG depended on by org.apache.royale.debugging.assert in the SWC <http://apacheroyaleci2.westus2.cloudapp.azure.com:8080/job/royale-asjs_MXTests/ws/frameworks/js/libs/CoreJS.swc> could not be found
    [mxmlc] 
    [mxmlc] 
    [mxmlc] <http://apacheroyaleci2.westus2.cloudapp.azure.com:8080/job/royale-asjs_MXTests/ws/frameworks/js/libs/CoreJS.swc> Warning: The definition goog.bind depended on by org.apache.royale.utils.MXMLDataInterpreter in the SWC <http://apacheroyaleci2.westus2.cloudapp.azure.com:8080/job/royale-asjs_MXTests/ws/frameworks/js/libs/CoreJS.swc> could not be found
    [mxmlc] 
    [mxmlc] 
    [mxmlc] <http://apacheroyaleci2.westus2.cloudapp.azure.com:8080/job/royale-asjs_MXTests/ws/frameworks/js/libs/CoreJS.swc> Warning: The definition goog.DEBUG depended on by org.apache.royale.debugging.throwError in the SWC <http://apacheroyaleci2.westus2.cloudapp.azure.com:8080/job/royale-asjs_MXTests/ws/frameworks/js/libs/CoreJS.swc> could not be found
    [mxmlc] 
    [mxmlc] 
    [mxmlc] <http://apacheroyaleci2.westus2.cloudapp.azure.com:8080/job/royale-asjs_MXTests/ws/frameworks/js/libs/CoreJS.swc> Warning: The definition goog.events.BrowserEvent depended on by org.apache.royale.events.MouseEvent in the SWC <http://apacheroyaleci2.westus2.cloudapp.azure.com:8080/job/royale-asjs_MXTests/ws/frameworks/js/libs/CoreJS.swc> could not be found
    [mxmlc] 
    [mxmlc] 
    [mxmlc] <http://apacheroyaleci2.westus2.cloudapp.azure.com:8080/job/royale-asjs_MXTests/ws/frameworks/js/libs/CoreJS.swc> Warning: The definition goog.DEBUG depended on by org.apache.royale.utils.BinaryData in the SWC <http://apacheroyaleci2.westus2.cloudapp.azure.com:8080/job/royale-asjs_MXTests/ws/frameworks/js/libs/CoreJS.swc> could not be found
    [mxmlc] 
    [mxmlc] 
    [mxmlc] <http://apacheroyaleci2.westus2.cloudapp.azure.com:8080/job/royale-asjs_MXTests/ws/frameworks/js/libs/CoreJS.swc> Warning: The definition goog.events depended on by org.apache.royale.events.EventDispatcher in the SWC <http://apacheroyaleci2.westus2.cloudapp.azure.com:8080/job/royale-asjs_MXTests/ws/frameworks/js/libs/CoreJS.swc> could not be found
    [mxmlc] 
    [mxmlc] 
    [mxmlc] <http://apacheroyaleci2.westus2.cloudapp.azure.com:8080/job/royale-asjs_MXTests/ws/frameworks/js/libs/CoreJS.swc> Warning: The definition goog.events.EventTarget depended on by org.apache.royale.events.EventDispatcher in the SWC <http://apacheroyaleci2.westus2.cloudapp.azure.com:8080/job/royale-asjs_MXTests/ws/frameworks/js/libs/CoreJS.swc> could not be found
    [mxmlc] 
    [mxmlc] 
    [mxmlc] <http://apacheroyaleci2.westus2.cloudapp.azure.com:8080/job/royale-asjs_MXTests/ws/frameworks/js/libs/CoreJS.swc> Warning: The definition goog.events.Listener depended on by org.apache.royale.events.EventDispatcher in the SWC <http://apacheroyaleci2.westus2.cloudapp.azure.com:8080/job/royale-asjs_MXTests/ws/frameworks/js/libs/CoreJS.swc> could not be found
    [mxmlc] 
    [mxmlc] 
    [mxmlc] <http://apacheroyaleci2.westus2.cloudapp.azure.com:8080/job/royale-asjs_MXTests/ws/frameworks/js/libs/CoreJS.swc> Warning: The definition goog.DEBUG depended on by org.apache.royale.debugging.assertType in the SWC <http://apacheroyaleci2.westus2.cloudapp.azure.com:8080/job/royale-asjs_MXTests/ws/frameworks/js/libs/CoreJS.swc> could not be found
    [mxmlc] 
    [mxmlc] 
    [mxmlc] <http://apacheroyaleci2.westus2.cloudapp.azure.com:8080/job/royale-asjs_MXTests/ws/frameworks/js/libs/CoreJS.swc> Warning: The definition goog.events depended on by org.apache.royale.core.ElementWrapper in the SWC <http://apacheroyaleci2.westus2.cloudapp.azure.com:8080/job/royale-asjs_MXTests/ws/frameworks/js/libs/CoreJS.swc> could not be found
    [mxmlc] 
    [mxmlc] 
    [mxmlc] <http://apacheroyaleci2.westus2.cloudapp.azure.com:8080/job/royale-asjs_MXTests/ws/frameworks/js/libs/CoreJS.swc> Warning: The definition goog.events.BrowserEvent depended on by org.apache.royale.core.ElementWrapper in the SWC <http://apacheroyaleci2.westus2.cloudapp.azure.com:8080/job/royale-asjs_MXTests/ws/frameworks/js/libs/CoreJS.swc> could not be found
    [mxmlc] 
    [mxmlc] 
    [mxmlc] <http://apacheroyaleci2.westus2.cloudapp.azure.com:8080/job/royale-asjs_MXTests/ws/frameworks/js/libs/CoreJS.swc> Warning: The definition goog.DEBUG depended on by org.apache.royale.core.ElementWrapper in the SWC <http://apacheroyaleci2.westus2.cloudapp.azure.com:8080/job/royale-asjs_MXTests/ws/frameworks/js/libs/CoreJS.swc> could not be found
    [mxmlc] 
    [mxmlc] 
    [mxmlc] <http://apacheroyaleci2.westus2.cloudapp.azure.com:8080/job/royale-asjs_MXTests/ws/frameworks/js/libs/CoreJS.swc> Warning: The definition goog.events.Event depended on by org.apache.royale.events.utils.KeyboardEventConverter in the SWC <http://apacheroyaleci2.westus2.cloudapp.azure.com:8080/job/royale-asjs_MXTests/ws/frameworks/js/libs/CoreJS.swc> could not be found
    [mxmlc] 
    [mxmlc] 
    [mxmlc] <http://apacheroyaleci2.westus2.cloudapp.azure.com:8080/job/royale-asjs_MXTests/ws/frameworks/js/libs/CoreJS.swc> Warning: The definition goog.events.BrowserEvent depended on by org.apache.royale.events.utils.KeyboardEventConverter in the SWC <http://apacheroyaleci2.westus2.cloudapp.azure.com:8080/job/royale-asjs_MXTests/ws/frameworks/js/libs/CoreJS.swc> could not be found
    [mxmlc] 
    [mxmlc] 
    [mxmlc] <http://apacheroyaleci2.westus2.cloudapp.azure.com:8080/job/royale-asjs_MXTests/ws/frameworks/js/libs/CoreJS.swc> Warning: The definition goog.events.Event depended on by org.apache.royale.events.Event in the SWC <http://apacheroyaleci2.westus2.cloudapp.azure.com:8080/job/royale-asjs_MXTests/ws/frameworks/js/libs/CoreJS.swc> could not be found
    [mxmlc] 
    [mxmlc] 
    [mxmlc] <http://apacheroyaleci2.westus2.cloudapp.azure.com:8080/job/royale-asjs_MXTests/ws/frameworks/js/libs/CoreJS.swc> Warning: The definition goog.events.BrowserEvent depended on by org.apache.royale.events.IBrowserEvent in the SWC <http://apacheroyaleci2.westus2.cloudapp.azure.com:8080/job/royale-asjs_MXTests/ws/frameworks/js/libs/CoreJS.swc> could not be found
    [mxmlc] 
    [mxmlc] 
    [mxmlc] <http://apacheroyaleci2.westus2.cloudapp.azure.com:8080/job/royale-asjs_MXTests/ws/frameworks/js/libs/CoreJS.swc> Warning: The definition goog.events.BrowserEvent depended on by org.apache.royale.events.BrowserEvent in the SWC <http://apacheroyaleci2.westus2.cloudapp.azure.com:8080/job/royale-asjs_MXTests/ws/frameworks/js/libs/CoreJS.swc> could not be found
    [mxmlc] 
    [mxmlc] 
    [mxmlc] <http://apacheroyaleci2.westus2.cloudapp.azure.com:8080/job/royale-asjs_MXTests/ws/frameworks/js/libs/CoreJS.swc> Warning: The definition goog.events.Event depended on by org.apache.royale.events.utils.MouseEventConverter in the SWC <http://apacheroyaleci2.westus2.cloudapp.azure.com:8080/job/royale-asjs_MXTests/ws/frameworks/js/libs/CoreJS.swc> could not be found
    [mxmlc] 
    [mxmlc] 
    [mxmlc] <http://apacheroyaleci2.westus2.cloudapp.azure.com:8080/job/royale-asjs_MXTests/ws/frameworks/js/libs/CoreJS.swc> Warning: The definition goog.events.BrowserEvent depended on by org.apache.royale.events.utils.MouseEventConverter in the SWC <http://apacheroyaleci2.westus2.cloudapp.azure.com:8080/job/royale-asjs_MXTests/ws/frameworks/js/libs/CoreJS.swc> could not be found
    [mxmlc] 
    [mxmlc] 
    [mxmlc] <http://apacheroyaleci2.westus2.cloudapp.azure.com:8080/job/royale-asjs_MXTests/ws/frameworks/js/libs/LanguageJS.swc> Warning: The definition goog.bind depended on by org.apache.royale.utils.Language in the SWC <http://apacheroyaleci2.westus2.cloudapp.azure.com:8080/job/royale-asjs_MXTests/ws/frameworks/js/libs/LanguageJS.swc> could not be found
    [mxmlc] 
    [mxmlc] 
    [mxmlc] <http://apacheroyaleci2.westus2.cloudapp.azure.com:8080/job/royale-asjs_MXTests/ws/frameworks/js/libs/LanguageJS.swc> Warning: The definition goog.global depended on by org.apache.royale.utils.Language in the SWC <http://apacheroyaleci2.westus2.cloudapp.azure.com:8080/job/royale-asjs_MXTests/ws/frameworks/js/libs/LanguageJS.swc> could not be found
    [mxmlc] 
    [mxmlc] 
    [mxmlc] <http://apacheroyaleci2.westus2.cloudapp.azure.com:8080/job/royale-asjs_MXTests/ws/frameworks/js/libs/LanguageJS.swc> Warning: The definition goog.DEBUG depended on by org.apache.royale.utils.Language in the SWC <http://apacheroyaleci2.westus2.cloudapp.azure.com:8080/job/royale-asjs_MXTests/ws/frameworks/js/libs/LanguageJS.swc> could not be found
    [mxmlc] 
    [mxmlc] 
    [mxmlc] <http://apacheroyaleci2.westus2.cloudapp.azure.com:8080/job/royale-asjs_MXTests/ws/frameworks/js/libs/MXRoyaleJS.swc> Warning: The definition goog.events.BrowserEvent depended on by mx.events.utils.FocusEventConverter in the SWC <http://apacheroyaleci2.westus2.cloudapp.azure.com:8080/job/royale-asjs_MXTests/ws/frameworks/js/libs/MXRoyaleJS.swc> could not be found
    [mxmlc] 
    [mxmlc] 
    [mxmlc] <http://apacheroyaleci2.westus2.cloudapp.azure.com:8080/job/royale-asjs_MXTests/ws/frameworks/js/libs/MXRoyaleJS.swc> Warning: The definition goog.events.Event depended on by mx.events.utils.MouseEventConverter in the SWC <http://apacheroyaleci2.westus2.cloudapp.azure.com:8080/job/royale-asjs_MXTests/ws/frameworks/js/libs/MXRoyaleJS.swc> could not be found
    [mxmlc] 
    [mxmlc] 
    [mxmlc] <http://apacheroyaleci2.westus2.cloudapp.azure.com:8080/job/royale-asjs_MXTests/ws/frameworks/js/libs/MXRoyaleJS.swc> Warning: The definition goog.events.BrowserEvent depended on by mx.events.utils.MouseEventConverter in the SWC <http://apacheroyaleci2.westus2.cloudapp.azure.com:8080/job/royale-asjs_MXTests/ws/frameworks/js/libs/MXRoyaleJS.swc> could not be found
    [mxmlc] 
    [mxmlc] 
    [mxmlc] <http://apacheroyaleci2.westus2.cloudapp.azure.com:8080/job/royale-asjs_MXTests/ws/frameworks/js/libs/MXRoyaleJS.swc> Warning: The definition goog.events depended on by mx.controls.TextArea in the SWC <http://apacheroyaleci2.westus2.cloudapp.azure.com:8080/job/royale-asjs_MXTests/ws/frameworks/js/libs/MXRoyaleJS.swc> could not be found
    [mxmlc] 
    [mxmlc] 
    [mxmlc] <http://apacheroyaleci2.westus2.cloudapp.azure.com:8080/job/royale-asjs_MXTests/ws/frameworks/js/libs/MXRoyaleJS.swc> Warning: The definition goog.DEBUG depended on by mx.utils.ObjectUtil in the SWC <http://apacheroyaleci2.westus2.cloudapp.azure.com:8080/job/royale-asjs_MXTests/ws/frameworks/js/libs/MXRoyaleJS.swc> could not be found
    [mxmlc] 
    [mxmlc] 
    [mxmlc] <http://apacheroyaleci2.westus2.cloudapp.azure.com:8080/job/royale-asjs_MXTests/ws/frameworks/js/libs/MXRoyaleJS.swc> Warning: The definition goog.events depended on by mx.controls.TextInput in the SWC <http://apacheroyaleci2.westus2.cloudapp.azure.com:8080/job/royale-asjs_MXTests/ws/frameworks/js/libs/MXRoyaleJS.swc> could not be found
    [mxmlc] 
    [mxmlc] 
    [mxmlc] <http://apacheroyaleci2.westus2.cloudapp.azure.com:8080/job/royale-asjs_MXTests/ws/frameworks/js/libs/MXRoyaleJS.swc> Warning: The definition goog.events.Event depended on by mx.events.utils.KeyboardEventConverter in the SWC <http://apacheroyaleci2.westus2.cloudapp.azure.com:8080/job/royale-asjs_MXTests/ws/frameworks/js/libs/MXRoyaleJS.swc> could not be found
    [mxmlc] 
    [mxmlc] 
    [mxmlc] <http://apacheroyaleci2.westus2.cloudapp.azure.com:8080/job/royale-asjs_MXTests/ws/frameworks/js/libs/MXRoyaleJS.swc> Warning: The definition goog.events.BrowserEvent depended on by mx.events.utils.KeyboardEventConverter in the SWC <http://apacheroyaleci2.westus2.cloudapp.azure.com:8080/job/royale-asjs_MXTests/ws/frameworks/js/libs/MXRoyaleJS.swc> could not be found
    [mxmlc] 
    [mxmlc] 
    [mxmlc] <http://apacheroyaleci2.westus2.cloudapp.azure.com:8080/job/royale-asjs_MXTests/ws/frameworks/js/libs/NetworkJS.swc> Warning: The definition goog.DEBUG depended on by org.apache.royale.net.remoting.amf.AMFBinaryData in the SWC <http://apacheroyaleci2.westus2.cloudapp.azure.com:8080/job/royale-asjs_MXTests/ws/frameworks/js/libs/NetworkJS.swc> could not be found
    [mxmlc] 
    [mxmlc] 
    [mxmlc] <http://apacheroyaleci2.westus2.cloudapp.azure.com:8080/job/royale-asjs_MXTests/ws/frameworks/js/libs/ReflectionJS.swc> Warning: The definition goog.DEBUG depended on by org.apache.royale.reflection.AccessorDefinition in the SWC <http://apacheroyaleci2.westus2.cloudapp.azure.com:8080/job/royale-asjs_MXTests/ws/frameworks/js/libs/ReflectionJS.swc> could not be found
    [mxmlc] 
    [mxmlc] 
    [mxmlc] <http://apacheroyaleci2.westus2.cloudapp.azure.com:8080/job/royale-asjs_MXTests/ws/frameworks/js/libs/ReflectionJS.swc> Warning: The definition goog.DEBUG depended on by org.apache.royale.reflection.VariableDefinition in the SWC <http://apacheroyaleci2.westus2.cloudapp.azure.com:8080/job/royale-asjs_MXTests/ws/frameworks/js/libs/ReflectionJS.swc> could not be found
    [mxmlc] 
    [mxmlc] 
    [mxmlc] <http://apacheroyaleci2.westus2.cloudapp.azure.com:8080/job/royale-asjs_MXTests/ws/frameworks/js/libs/ReflectionJS.swc> Warning: The definition goog.DEBUG depended on by org.apache.royale.reflection.getDynamicFields in the SWC <http://apacheroyaleci2.westus2.cloudapp.azure.com:8080/job/royale-asjs_MXTests/ws/frameworks/js/libs/ReflectionJS.swc> could not be found
    [mxmlc] 
    [mxmlc] 
    [mxmlc] <http://apacheroyaleci2.westus2.cloudapp.azure.com:8080/job/royale-asjs_MXTests/ws/frameworks/js/libs/ReflectionJS.swc> Warning: The definition goog.global depended on by org.apache.royale.reflection.getDefinitionByName in the SWC <http://apacheroyaleci2.westus2.cloudapp.azure.com:8080/job/royale-asjs_MXTests/ws/frameworks/js/libs/ReflectionJS.swc> could not be found
    [mxmlc] 
    [mxmlc] 
    [mxmlc] <http://apacheroyaleci2.westus2.cloudapp.azure.com:8080/job/royale-asjs_MXTests/ws/frameworks/js/libs/SparkRoyaleJS.swc> Warning: The definition goog.DEBUG depended on by spark.components.supportClasses.SkinnableComponent in the SWC <http://apacheroyaleci2.westus2.cloudapp.azure.com:8080/job/royale-asjs_MXTests/ws/frameworks/js/libs/SparkRoyaleJS.swc> could not be found
    [mxmlc] 
    [mxmlc] 
    [mxmlc] 29.5625723 seconds
    [mxmlc] Picked up JAVA_TOOL_OPTIONS: -Dfile.encoding=UTF-8 -Xms384m -Xmx2g
     [echo] launching player and swf C:\adobe\flash\11.7\flashplayerdebugger.exe <http://apacheroyaleci2.westus2.cloudapp.azure.com:8080/job/royale-asjs_MXTests/ws/mustella/tests/mxtests/basicTests/BasicTests.swf>

mustellaresultsparser:
     [java] test case SetupListAndDataGridTest&result=fail&elapsed=741&phase=body&started=1583561436652&extraInfo=&msg=TypeError: failed
     [java] results: FAILED

BUILD FAILED
<http://apacheroyaleci2.westus2.cloudapp.azure.com:8080/job/royale-asjs_MXTests/ws/build.xml>:1532: The following error occurred while executing this line:
<http://apacheroyaleci2.westus2.cloudapp.azure.com:8080/job/royale-asjs_MXTests/ws/build.xml>:1459: Java returned: 1

Total time: 26 minutes 17 seconds
Picked up JAVA_TOOL_OPTIONS: -Dfile.encoding=UTF-8 -Xms384m -Xmx2g
Build step 'Invoke Ant' marked build as failure
Archiving artifacts

Build failed in Jenkins: royale-asjs_MXTests #729

Posted by ap...@gmail.com.
See <http://apacheroyaleci2.westus2.cloudapp.azure.com:8080/job/royale-asjs_MXTests/729/display/redirect>

Changes:


------------------------------------------
[...truncated 952.38 KB...]
checkintests:

mxtests-clean:
   [delete] Deleting directory <http://apacheroyaleci2.westus2.cloudapp.azure.com:8080/job/royale-asjs_MXTests/ws/mustella/tests/mxtests/basicTests/bin>

check-air-home:
     [echo] AIR_HOME is C:\adobe\air\4.0\AdobeAIRSDK

check-runtime-env:

runtime-setup:

load-task:

marmotinni-setup:

prepare:
     [echo] Making lib directory <http://apacheroyaleci2.westus2.cloudapp.azure.com:8080/job/royale-asjs_MXTests/ws/marmotinni/java/c>:\jenkins\workspace\royale-asjs_MXTests\marmotinni\java/lib

selenium3-jar-check:

selenium3-jar:

main:

clean:
   [delete] Deleting: <http://apacheroyaleci2.westus2.cloudapp.azure.com:8080/job/royale-asjs_MXTests/ws/mustella/mustella.swc>

check-compiler-home:

check-compiler:

compile:
     [echo] Compiling mustella.swc
     [echo] ROYALE_HOME: <http://apacheroyaleci2.westus2.cloudapp.azure.com:8080/job/royale-asjs_MXTests/ws/>
     [echo] ROYALE_COMPILER_HOME: <http://apacheroyaleci2.westus2.cloudapp.azure.com:8080/job/royale-asjs_MXTests/ws/js>
     [java] args:
     [java] +royalelib=<http://apacheroyaleci2.westus2.cloudapp.azure.com:8080/job/royale-asjs_MXTests/ws/frameworks>
     [java] +playerglobal.version=11.7
     [java] +env.PLAYERGLOBAL_HOME=C:\adobe\flash
     [java] +env.AIR_HOME=C:\adobe\air\4.0\AdobeAIRSDK
     [java] -compiler.strict-xml=true
     [java] -compiler.targets=SWF,JSRoyale
     [java] -output=<http://apacheroyaleci2.westus2.cloudapp.azure.com:8080/job/royale-asjs_MXTests/ws/mustella/mustella.swc>
     [java] -load-config=<http://apacheroyaleci2.westus2.cloudapp.azure.com:8080/job/royale-asjs_MXTests/ws/mustella/src/main/config/compile-swf-config.xml>
     [java] -js-load-config=<http://apacheroyaleci2.westus2.cloudapp.azure.com:8080/job/royale-asjs_MXTests/ws/frameworks/js-config.xml>
     [java] -js-load-config+=<http://apacheroyaleci2.westus2.cloudapp.azure.com:8080/job/royale-asjs_MXTests/ws/mustella/src/main/config/compile-js-config.xml>
     [java] target:SWF
     [java] target:JSRoyale
     [java] COMPC
     [java] Loading configuration: <http://apacheroyaleci2.westus2.cloudapp.azure.com:8080/job/royale-asjs_MXTests/ws/mustella/src/main/config/compile-swf-config.xml>
     [java] 
     [java] 58056 bytes written to C:\jenkins\workspace\royale-asjs_MXTests\mustella\mustella.swc in 4.485 seconds
     [java] COMPCJSCRoyale
     [java] <http://apacheroyaleci2.westus2.cloudapp.azure.com:8080/job/royale-asjs_MXTests/ws/mustella/src/main/royale/DontSendScriptComplete.as(21)>: col: 8 No definitions matching flash.net.* could be found.
     [java] 
     [java] import flash.net.*;
     [java]        ^
     [java] 
     [java] <http://apacheroyaleci2.westus2.cloudapp.azure.com:8080/job/royale-asjs_MXTests/ws/mustella/src/main/royale/DontSendScriptComplete.as(22)>: col: 8 Definition flash.events.Event could not be found.
     [java] 
     [java] import flash.events.Event;
     [java]        ^
     [java] 
     [java] Picked up JAVA_TOOL_OPTIONS: -Dfile.encoding=UTF-8 -Xms384m -Xmx2g
     [java] 8.9724369 seconds
     [java] Java Result: 2

compile-js:

main:

basictests-compile-java:
   [delete] Deleting directory <http://apacheroyaleci2.westus2.cloudapp.azure.com:8080/job/royale-asjs_MXTests/ws/mustella/target/classes>
    [mkdir] Created dir: <http://apacheroyaleci2.westus2.cloudapp.azure.com:8080/job/royale-asjs_MXTests/ws/mustella/target/classes>
    [javac] <http://apacheroyaleci2.westus2.cloudapp.azure.com:8080/job/royale-asjs_MXTests/ws/build.xml>:1336: warning: 'includeantruntime' was not set, defaulting to build.sysclasspath=last; set to false for repeatable builds
    [javac] Compiling 12 source files to <http://apacheroyaleci2.westus2.cloudapp.azure.com:8080/job/royale-asjs_MXTests/ws/mustella/target/classes>
    [javac] Note: <http://apacheroyaleci2.westus2.cloudapp.azure.com:8080/job/royale-asjs_MXTests/ws/mustella/src/main/java/marmotinni/DispatchMouseClickEvent.java> uses or overrides a deprecated API.
    [javac] Note: Recompile with -Xlint:deprecation for details.

mxtests-compile-java:

mxtests:
    [mxmlc] MXMLJSC
    [mxmlc] -sdk-js-lib=<http://apacheroyaleci2.westus2.cloudapp.azure.com:8080/job/royale-asjs_MXTests/ws/mustella/js>
    [mxmlc] +env.PLAYERGLOBAL_HOME=C:\adobe\flash
    [mxmlc] -compiler.debug=true
    [mxmlc] +royalelib=<http://apacheroyaleci2.westus2.cloudapp.azure.com:8080/job/royale-asjs_MXTests/ws/frameworks/>
    [mxmlc] -closure-lib=<http://apacheroyaleci2.westus2.cloudapp.azure.com:8080/job/royale-asjs_MXTests/ws/js/lib/google/closure-library>
    [mxmlc] +configname=flex
    [mxmlc] -compiler.library-path+=<http://apacheroyaleci2.westus2.cloudapp.azure.com:8080/job/royale-asjs_MXTests/ws/mustella/mustella.swc>
    [mxmlc] -compiler.js-external-library-path=<http://apacheroyaleci2.westus2.cloudapp.azure.com:8080/job/royale-asjs_MXTests/ws/js/libs/js.swc>
    [mxmlc] -compiler.js-library-path=<http://apacheroyaleci2.westus2.cloudapp.azure.com:8080/job/royale-asjs_MXTests/ws/frameworks/js/libs>
    [mxmlc] -compiler.js-library-path+=<http://apacheroyaleci2.westus2.cloudapp.azure.com:8080/job/royale-asjs_MXTests/ws/mustella/mustella.swc>
    [mxmlc] --
    [mxmlc] <http://apacheroyaleci2.westus2.cloudapp.azure.com:8080/job/royale-asjs_MXTests/ws/mustella/tests/mxtests/basicTests/BasicTests.mxml>
    [mxmlc] Loading configuration: <http://apacheroyaleci2.westus2.cloudapp.azure.com:8080/job/royale-asjs_MXTests/ws/frameworks/flex-config.xml>
    [mxmlc] Loading configuration: <http://apacheroyaleci2.westus2.cloudapp.azure.com:8080/job/royale-asjs_MXTests/ws/mustella/tests/mxtests/basicTests/BasicTests-config.xml>
    [mxmlc] 
    [mxmlc] 390454 bytes written to C:\jenkins\workspace\royale-asjs_MXTests\mustella\tests\mxtests\basicTests\BasicTests.swf in 13.160 seconds
    [mxmlc] The project 'BasicTests' has been successfully compiled.
    [mxmlc] <http://apacheroyaleci2.westus2.cloudapp.azure.com:8080/job/royale-asjs_MXTests/ws/frameworks/js/libs/BasicJS.swc> Warning: The definition goog.events depended on by org.apache.royale.html.beads.controllers.ItemRendererMouseController in the SWC <http://apacheroyaleci2.westus2.cloudapp.azure.com:8080/job/royale-asjs_MXTests/ws/frameworks/js/libs/BasicJS.swc> could not be found
    [mxmlc] 
    [mxmlc] 
    [mxmlc] <http://apacheroyaleci2.westus2.cloudapp.azure.com:8080/job/royale-asjs_MXTests/ws/frameworks/js/libs/BasicJS.swc> Warning: The definition goog.events.EventType depended on by org.apache.royale.html.beads.controllers.ItemRendererMouseController in the SWC <http://apacheroyaleci2.westus2.cloudapp.azure.com:8080/job/royale-asjs_MXTests/ws/frameworks/js/libs/BasicJS.swc> could not be found
    [mxmlc] 
    [mxmlc] 
    [mxmlc] <http://apacheroyaleci2.westus2.cloudapp.azure.com:8080/job/royale-asjs_MXTests/ws/frameworks/js/libs/BasicJS.swc> Warning: The definition goog.events.Event depended on by org.apache.royale.html.beads.controllers.ItemRendererMouseController in the SWC <http://apacheroyaleci2.westus2.cloudapp.azure.com:8080/job/royale-asjs_MXTests/ws/frameworks/js/libs/BasicJS.swc> could not be found
    [mxmlc] 
    [mxmlc] 
    [mxmlc] <http://apacheroyaleci2.westus2.cloudapp.azure.com:8080/job/royale-asjs_MXTests/ws/frameworks/js/libs/BasicJS.swc> Warning: The definition goog.events.BrowserEvent depended on by org.apache.royale.html.accessories.RestrictTextInputBead in the SWC <http://apacheroyaleci2.westus2.cloudapp.azure.com:8080/job/royale-asjs_MXTests/ws/frameworks/js/libs/BasicJS.swc> could not be found
    [mxmlc] 
    [mxmlc] 
    [mxmlc] <http://apacheroyaleci2.westus2.cloudapp.azure.com:8080/job/royale-asjs_MXTests/ws/frameworks/js/libs/BasicJS.swc> Warning: The definition goog.events depended on by org.apache.royale.html.TextInput in the SWC <http://apacheroyaleci2.westus2.cloudapp.azure.com:8080/job/royale-asjs_MXTests/ws/frameworks/js/libs/BasicJS.swc> could not be found
    [mxmlc] 
    [mxmlc] 
    [mxmlc] <http://apacheroyaleci2.westus2.cloudapp.azure.com:8080/job/royale-asjs_MXTests/ws/frameworks/js/libs/BasicJS.swc> Warning: The definition goog.events depended on by org.apache.royale.html.beads.controllers.SpinnerMouseController in the SWC <http://apacheroyaleci2.westus2.cloudapp.azure.com:8080/job/royale-asjs_MXTests/ws/frameworks/js/libs/BasicJS.swc> could not be found
    [mxmlc] 
    [mxmlc] 
    [mxmlc] <http://apacheroyaleci2.westus2.cloudapp.azure.com:8080/job/royale-asjs_MXTests/ws/frameworks/js/libs/BasicJS.swc> Warning: The definition goog.events.EventType depended on by org.apache.royale.html.beads.controllers.SpinnerMouseController in the SWC <http://apacheroyaleci2.westus2.cloudapp.azure.com:8080/job/royale-asjs_MXTests/ws/frameworks/js/libs/BasicJS.swc> could not be found
    [mxmlc] 
    [mxmlc] 
    [mxmlc] <http://apacheroyaleci2.westus2.cloudapp.azure.com:8080/job/royale-asjs_MXTests/ws/frameworks/js/libs/CoreJS.swc> Warning: The definition goog.events.BrowserEvent depended on by org.apache.royale.events.IBrowserEvent in the SWC <http://apacheroyaleci2.westus2.cloudapp.azure.com:8080/job/royale-asjs_MXTests/ws/frameworks/js/libs/CoreJS.swc> could not be found
    [mxmlc] 
    [mxmlc] 
    [mxmlc] <http://apacheroyaleci2.westus2.cloudapp.azure.com:8080/job/royale-asjs_MXTests/ws/frameworks/js/libs/CoreJS.swc> Warning: The definition goog.events.Event depended on by org.apache.royale.events.Event in the SWC <http://apacheroyaleci2.westus2.cloudapp.azure.com:8080/job/royale-asjs_MXTests/ws/frameworks/js/libs/CoreJS.swc> could not be found
    [mxmlc] 
    [mxmlc] 
    [mxmlc] <http://apacheroyaleci2.westus2.cloudapp.azure.com:8080/job/royale-asjs_MXTests/ws/frameworks/js/libs/CoreJS.swc> Warning: The definition goog.events.BrowserEvent depended on by org.apache.royale.events.BrowserEvent in the SWC <http://apacheroyaleci2.westus2.cloudapp.azure.com:8080/job/royale-asjs_MXTests/ws/frameworks/js/libs/CoreJS.swc> could not be found
    [mxmlc] 
    [mxmlc] 
    [mxmlc] <http://apacheroyaleci2.westus2.cloudapp.azure.com:8080/job/royale-asjs_MXTests/ws/frameworks/js/libs/CoreJS.swc> Warning: The definition goog.DEBUG depended on by org.apache.royale.debugging.assert in the SWC <http://apacheroyaleci2.westus2.cloudapp.azure.com:8080/job/royale-asjs_MXTests/ws/frameworks/js/libs/CoreJS.swc> could not be found
    [mxmlc] 
    [mxmlc] 
    [mxmlc] <http://apacheroyaleci2.westus2.cloudapp.azure.com:8080/job/royale-asjs_MXTests/ws/frameworks/js/libs/CoreJS.swc> Warning: The definition goog.DEBUG depended on by org.apache.royale.debugging.assertType in the SWC <http://apacheroyaleci2.westus2.cloudapp.azure.com:8080/job/royale-asjs_MXTests/ws/frameworks/js/libs/CoreJS.swc> could not be found
    [mxmlc] 
    [mxmlc] 
    [mxmlc] <http://apacheroyaleci2.westus2.cloudapp.azure.com:8080/job/royale-asjs_MXTests/ws/frameworks/js/libs/CoreJS.swc> Warning: The definition goog.DEBUG depended on by org.apache.royale.utils.BinaryData in the SWC <http://apacheroyaleci2.westus2.cloudapp.azure.com:8080/job/royale-asjs_MXTests/ws/frameworks/js/libs/CoreJS.swc> could not be found
    [mxmlc] 
    [mxmlc] 
    [mxmlc] <http://apacheroyaleci2.westus2.cloudapp.azure.com:8080/job/royale-asjs_MXTests/ws/frameworks/js/libs/CoreJS.swc> Warning: The definition goog.DEBUG depended on by org.apache.royale.debugging.throwError in the SWC <http://apacheroyaleci2.westus2.cloudapp.azure.com:8080/job/royale-asjs_MXTests/ws/frameworks/js/libs/CoreJS.swc> could not be found
    [mxmlc] 
    [mxmlc] 
    [mxmlc] <http://apacheroyaleci2.westus2.cloudapp.azure.com:8080/job/royale-asjs_MXTests/ws/frameworks/js/libs/CoreJS.swc> Warning: The definition goog.events.Event depended on by org.apache.royale.events.utils.KeyboardEventConverter in the SWC <http://apacheroyaleci2.westus2.cloudapp.azure.com:8080/job/royale-asjs_MXTests/ws/frameworks/js/libs/CoreJS.swc> could not be found
    [mxmlc] 
    [mxmlc] 
    [mxmlc] <http://apacheroyaleci2.westus2.cloudapp.azure.com:8080/job/royale-asjs_MXTests/ws/frameworks/js/libs/CoreJS.swc> Warning: The definition goog.events.BrowserEvent depended on by org.apache.royale.events.utils.KeyboardEventConverter in the SWC <http://apacheroyaleci2.westus2.cloudapp.azure.com:8080/job/royale-asjs_MXTests/ws/frameworks/js/libs/CoreJS.swc> could not be found
    [mxmlc] 
    [mxmlc] 
    [mxmlc] <http://apacheroyaleci2.westus2.cloudapp.azure.com:8080/job/royale-asjs_MXTests/ws/frameworks/js/libs/CoreJS.swc> Warning: The definition goog.events depended on by org.apache.royale.events.EventDispatcher in the SWC <http://apacheroyaleci2.westus2.cloudapp.azure.com:8080/job/royale-asjs_MXTests/ws/frameworks/js/libs/CoreJS.swc> could not be found
    [mxmlc] 
    [mxmlc] 
    [mxmlc] <http://apacheroyaleci2.westus2.cloudapp.azure.com:8080/job/royale-asjs_MXTests/ws/frameworks/js/libs/CoreJS.swc> Warning: The definition goog.events.EventTarget depended on by org.apache.royale.events.EventDispatcher in the SWC <http://apacheroyaleci2.westus2.cloudapp.azure.com:8080/job/royale-asjs_MXTests/ws/frameworks/js/libs/CoreJS.swc> could not be found
    [mxmlc] 
    [mxmlc] 
    [mxmlc] <http://apacheroyaleci2.westus2.cloudapp.azure.com:8080/job/royale-asjs_MXTests/ws/frameworks/js/libs/CoreJS.swc> Warning: The definition goog.events.Listener depended on by org.apache.royale.events.EventDispatcher in the SWC <http://apacheroyaleci2.westus2.cloudapp.azure.com:8080/job/royale-asjs_MXTests/ws/frameworks/js/libs/CoreJS.swc> could not be found
    [mxmlc] 
    [mxmlc] 
    [mxmlc] <http://apacheroyaleci2.westus2.cloudapp.azure.com:8080/job/royale-asjs_MXTests/ws/frameworks/js/libs/CoreJS.swc> Warning: The definition goog.events.BrowserEvent depended on by org.apache.royale.events.KeyboardEvent in the SWC <http://apacheroyaleci2.westus2.cloudapp.azure.com:8080/job/royale-asjs_MXTests/ws/frameworks/js/libs/CoreJS.swc> could not be found
    [mxmlc] 
    [mxmlc] 
    [mxmlc] <http://apacheroyaleci2.westus2.cloudapp.azure.com:8080/job/royale-asjs_MXTests/ws/frameworks/js/libs/CoreJS.swc> Warning: The definition goog.bind depended on by org.apache.royale.utils.MXMLDataInterpreter in the SWC <http://apacheroyaleci2.westus2.cloudapp.azure.com:8080/job/royale-asjs_MXTests/ws/frameworks/js/libs/CoreJS.swc> could not be found
    [mxmlc] 
    [mxmlc] 
    [mxmlc] <http://apacheroyaleci2.westus2.cloudapp.azure.com:8080/job/royale-asjs_MXTests/ws/frameworks/js/libs/CoreJS.swc> Warning: The definition goog.events.BrowserEvent depended on by org.apache.royale.events.MouseEvent in the SWC <http://apacheroyaleci2.westus2.cloudapp.azure.com:8080/job/royale-asjs_MXTests/ws/frameworks/js/libs/CoreJS.swc> could not be found
    [mxmlc] 
    [mxmlc] 
    [mxmlc] <http://apacheroyaleci2.westus2.cloudapp.azure.com:8080/job/royale-asjs_MXTests/ws/frameworks/js/libs/CoreJS.swc> Warning: The definition goog.events depended on by org.apache.royale.core.ElementWrapper in the SWC <http://apacheroyaleci2.westus2.cloudapp.azure.com:8080/job/royale-asjs_MXTests/ws/frameworks/js/libs/CoreJS.swc> could not be found
    [mxmlc] 
    [mxmlc] 
    [mxmlc] <http://apacheroyaleci2.westus2.cloudapp.azure.com:8080/job/royale-asjs_MXTests/ws/frameworks/js/libs/CoreJS.swc> Warning: The definition goog.events.BrowserEvent depended on by org.apache.royale.core.ElementWrapper in the SWC <http://apacheroyaleci2.westus2.cloudapp.azure.com:8080/job/royale-asjs_MXTests/ws/frameworks/js/libs/CoreJS.swc> could not be found
    [mxmlc] 
    [mxmlc] 
    [mxmlc] <http://apacheroyaleci2.westus2.cloudapp.azure.com:8080/job/royale-asjs_MXTests/ws/frameworks/js/libs/CoreJS.swc> Warning: The definition goog.DEBUG depended on by org.apache.royale.core.ElementWrapper in the SWC <http://apacheroyaleci2.westus2.cloudapp.azure.com:8080/job/royale-asjs_MXTests/ws/frameworks/js/libs/CoreJS.swc> could not be found
    [mxmlc] 
    [mxmlc] 
    [mxmlc] <http://apacheroyaleci2.westus2.cloudapp.azure.com:8080/job/royale-asjs_MXTests/ws/frameworks/js/libs/CoreJS.swc> Warning: The definition goog.events.Event depended on by org.apache.royale.events.utils.MouseEventConverter in the SWC <http://apacheroyaleci2.westus2.cloudapp.azure.com:8080/job/royale-asjs_MXTests/ws/frameworks/js/libs/CoreJS.swc> could not be found
    [mxmlc] 
    [mxmlc] 
    [mxmlc] <http://apacheroyaleci2.westus2.cloudapp.azure.com:8080/job/royale-asjs_MXTests/ws/frameworks/js/libs/CoreJS.swc> Warning: The definition goog.events.BrowserEvent depended on by org.apache.royale.events.utils.MouseEventConverter in the SWC <http://apacheroyaleci2.westus2.cloudapp.azure.com:8080/job/royale-asjs_MXTests/ws/frameworks/js/libs/CoreJS.swc> could not be found
    [mxmlc] 
    [mxmlc] 
    [mxmlc] <http://apacheroyaleci2.westus2.cloudapp.azure.com:8080/job/royale-asjs_MXTests/ws/frameworks/js/libs/LanguageJS.swc> Warning: The definition goog.bind depended on by org.apache.royale.utils.Language in the SWC <http://apacheroyaleci2.westus2.cloudapp.azure.com:8080/job/royale-asjs_MXTests/ws/frameworks/js/libs/LanguageJS.swc> could not be found
    [mxmlc] 
    [mxmlc] 
    [mxmlc] <http://apacheroyaleci2.westus2.cloudapp.azure.com:8080/job/royale-asjs_MXTests/ws/frameworks/js/libs/LanguageJS.swc> Warning: The definition goog.global depended on by org.apache.royale.utils.Language in the SWC <http://apacheroyaleci2.westus2.cloudapp.azure.com:8080/job/royale-asjs_MXTests/ws/frameworks/js/libs/LanguageJS.swc> could not be found
    [mxmlc] 
    [mxmlc] 
    [mxmlc] <http://apacheroyaleci2.westus2.cloudapp.azure.com:8080/job/royale-asjs_MXTests/ws/frameworks/js/libs/LanguageJS.swc> Warning: The definition goog.DEBUG depended on by org.apache.royale.utils.Language in the SWC <http://apacheroyaleci2.westus2.cloudapp.azure.com:8080/job/royale-asjs_MXTests/ws/frameworks/js/libs/LanguageJS.swc> could not be found
    [mxmlc] 
    [mxmlc] 
    [mxmlc] <http://apacheroyaleci2.westus2.cloudapp.azure.com:8080/job/royale-asjs_MXTests/ws/frameworks/js/libs/MXRoyaleJS.swc> Warning: The definition goog.events.Event depended on by mx.events.utils.KeyboardEventConverter in the SWC <http://apacheroyaleci2.westus2.cloudapp.azure.com:8080/job/royale-asjs_MXTests/ws/frameworks/js/libs/MXRoyaleJS.swc> could not be found
    [mxmlc] 
    [mxmlc] 
    [mxmlc] <http://apacheroyaleci2.westus2.cloudapp.azure.com:8080/job/royale-asjs_MXTests/ws/frameworks/js/libs/MXRoyaleJS.swc> Warning: The definition goog.events.BrowserEvent depended on by mx.events.utils.KeyboardEventConverter in the SWC <http://apacheroyaleci2.westus2.cloudapp.azure.com:8080/job/royale-asjs_MXTests/ws/frameworks/js/libs/MXRoyaleJS.swc> could not be found
    [mxmlc] 
    [mxmlc] 
    [mxmlc] <http://apacheroyaleci2.westus2.cloudapp.azure.com:8080/job/royale-asjs_MXTests/ws/frameworks/js/libs/MXRoyaleJS.swc> Warning: The definition goog.events depended on by mx.controls.TextInput in the SWC <http://apacheroyaleci2.westus2.cloudapp.azure.com:8080/job/royale-asjs_MXTests/ws/frameworks/js/libs/MXRoyaleJS.swc> could not be found
    [mxmlc] 
    [mxmlc] 
    [mxmlc] <http://apacheroyaleci2.westus2.cloudapp.azure.com:8080/job/royale-asjs_MXTests/ws/frameworks/js/libs/MXRoyaleJS.swc> Warning: The definition goog.events.Event depended on by mx.events.utils.MouseEventConverter in the SWC <http://apacheroyaleci2.westus2.cloudapp.azure.com:8080/job/royale-asjs_MXTests/ws/frameworks/js/libs/MXRoyaleJS.swc> could not be found
    [mxmlc] 
    [mxmlc] 
    [mxmlc] <http://apacheroyaleci2.westus2.cloudapp.azure.com:8080/job/royale-asjs_MXTests/ws/frameworks/js/libs/MXRoyaleJS.swc> Warning: The definition goog.events.BrowserEvent depended on by mx.events.utils.MouseEventConverter in the SWC <http://apacheroyaleci2.westus2.cloudapp.azure.com:8080/job/royale-asjs_MXTests/ws/frameworks/js/libs/MXRoyaleJS.swc> could not be found
    [mxmlc] 
    [mxmlc] 
    [mxmlc] <http://apacheroyaleci2.westus2.cloudapp.azure.com:8080/job/royale-asjs_MXTests/ws/frameworks/js/libs/MXRoyaleJS.swc> Warning: The definition goog.events.BrowserEvent depended on by mx.events.utils.FocusEventConverter in the SWC <http://apacheroyaleci2.westus2.cloudapp.azure.com:8080/job/royale-asjs_MXTests/ws/frameworks/js/libs/MXRoyaleJS.swc> could not be found
    [mxmlc] 
    [mxmlc] 
    [mxmlc] <http://apacheroyaleci2.westus2.cloudapp.azure.com:8080/job/royale-asjs_MXTests/ws/frameworks/js/libs/MXRoyaleJS.swc> Warning: The definition goog.events depended on by mx.controls.TextArea in the SWC <http://apacheroyaleci2.westus2.cloudapp.azure.com:8080/job/royale-asjs_MXTests/ws/frameworks/js/libs/MXRoyaleJS.swc> could not be found
    [mxmlc] 
    [mxmlc] 
    [mxmlc] <http://apacheroyaleci2.westus2.cloudapp.azure.com:8080/job/royale-asjs_MXTests/ws/frameworks/js/libs/MXRoyaleJS.swc> Warning: The definition goog.DEBUG depended on by mx.utils.ObjectUtil in the SWC <http://apacheroyaleci2.westus2.cloudapp.azure.com:8080/job/royale-asjs_MXTests/ws/frameworks/js/libs/MXRoyaleJS.swc> could not be found
    [mxmlc] 
    [mxmlc] 
    [mxmlc] <http://apacheroyaleci2.westus2.cloudapp.azure.com:8080/job/royale-asjs_MXTests/ws/frameworks/js/libs/NetworkJS.swc> Warning: The definition goog.DEBUG depended on by org.apache.royale.net.remoting.amf.AMFBinaryData in the SWC <http://apacheroyaleci2.westus2.cloudapp.azure.com:8080/job/royale-asjs_MXTests/ws/frameworks/js/libs/NetworkJS.swc> could not be found
    [mxmlc] 
    [mxmlc] 
    [mxmlc] <http://apacheroyaleci2.westus2.cloudapp.azure.com:8080/job/royale-asjs_MXTests/ws/frameworks/js/libs/ReflectionJS.swc> Warning: The definition goog.global depended on by org.apache.royale.reflection.getDefinitionByName in the SWC <http://apacheroyaleci2.westus2.cloudapp.azure.com:8080/job/royale-asjs_MXTests/ws/frameworks/js/libs/ReflectionJS.swc> could not be found
    [mxmlc] 
    [mxmlc] 
    [mxmlc] <http://apacheroyaleci2.westus2.cloudapp.azure.com:8080/job/royale-asjs_MXTests/ws/frameworks/js/libs/ReflectionJS.swc> Warning: The definition goog.DEBUG depended on by org.apache.royale.reflection.VariableDefinition in the SWC <http://apacheroyaleci2.westus2.cloudapp.azure.com:8080/job/royale-asjs_MXTests/ws/frameworks/js/libs/ReflectionJS.swc> could not be found
    [mxmlc] 
    [mxmlc] 
    [mxmlc] <http://apacheroyaleci2.westus2.cloudapp.azure.com:8080/job/royale-asjs_MXTests/ws/frameworks/js/libs/ReflectionJS.swc> Warning: The definition goog.DEBUG depended on by org.apache.royale.reflection.AccessorDefinition in the SWC <http://apacheroyaleci2.westus2.cloudapp.azure.com:8080/job/royale-asjs_MXTests/ws/frameworks/js/libs/ReflectionJS.swc> could not be found
    [mxmlc] 
    [mxmlc] 
    [mxmlc] <http://apacheroyaleci2.westus2.cloudapp.azure.com:8080/job/royale-asjs_MXTests/ws/frameworks/js/libs/ReflectionJS.swc> Warning: The definition goog.DEBUG depended on by org.apache.royale.reflection.getDynamicFields in the SWC <http://apacheroyaleci2.westus2.cloudapp.azure.com:8080/job/royale-asjs_MXTests/ws/frameworks/js/libs/ReflectionJS.swc> could not be found
    [mxmlc] 
    [mxmlc] 
    [mxmlc] <http://apacheroyaleci2.westus2.cloudapp.azure.com:8080/job/royale-asjs_MXTests/ws/frameworks/js/libs/SparkRoyaleJS.swc> Warning: The definition goog.DEBUG depended on by spark.components.supportClasses.SkinnableComponent in the SWC <http://apacheroyaleci2.westus2.cloudapp.azure.com:8080/job/royale-asjs_MXTests/ws/frameworks/js/libs/SparkRoyaleJS.swc> could not be found
    [mxmlc] 
    [mxmlc] 
    [mxmlc] Picked up JAVA_TOOL_OPTIONS: -Dfile.encoding=UTF-8 -Xms384m -Xmx2g
    [mxmlc] 38.4877925 seconds
     [echo] launching player and swf C:\adobe\flash\11.7\flashplayerdebugger.exe <http://apacheroyaleci2.westus2.cloudapp.azure.com:8080/job/royale-asjs_MXTests/ws/mustella/tests/mxtests/basicTests/BasicTests.swf>

mustellaresultsparser:
     [java] test case SetupListAndDataGridTest&result=fail&elapsed=748&phase=body&started=1583548492808&extraInfo=&msg=TypeError: failed
     [java] results: FAILED

BUILD FAILED
<http://apacheroyaleci2.westus2.cloudapp.azure.com:8080/job/royale-asjs_MXTests/ws/build.xml>:1532: The following error occurred while executing this line:
<http://apacheroyaleci2.westus2.cloudapp.azure.com:8080/job/royale-asjs_MXTests/ws/build.xml>:1459: Java returned: 1

Total time: 26 minutes 48 seconds
Picked up JAVA_TOOL_OPTIONS: -Dfile.encoding=UTF-8 -Xms384m -Xmx2g
Build step 'Invoke Ant' marked build as failure
Archiving artifacts