You are viewing a plain text version of this content. The canonical link for it is here.
Posted to dev@lucene.apache.org by bu...@flonkings.com on 2012/10/08 14:20:18 UTC
[JENKINS] Lucene-trunk-Linux-Java6-64-test-only-compressed - Build
# 227 - Failure!
Build: builds.flonkings.com/job/Lucene-trunk-Linux-Java6-64-test-only-compressed/227/
No tests ran.
Build Log:
[...truncated 24 lines...]
BUILD FAILED
Target "clean-jars" does not exist in the project "lucene".
Total time: 0 seconds
Build step 'Invoke Ant' marked build as failure
Recording test results
Email was triggered for: Failure
Sending email for trigger: Failure
[JENKINS] Lucene-trunk-Linux-Java6-64-test-only-compressed - Build
# 236 - Still Failing!
Posted by bu...@flonkings.com.
Build: builds.flonkings.com/job/Lucene-trunk-Linux-Java6-64-test-only-compressed/236/
No tests ran.
Build Log:
[...truncated 15 lines...]
BUILD FAILED
Target "clean-jars" does not exist in the project "lucene".
Total time: 0 seconds
Build step 'Invoke Ant' marked build as failure
Recording test results
Email was triggered for: Failure
Sending email for trigger: Failure
[JENKINS] Lucene-trunk-Linux-Java6-64-test-only-compressed - Build
# 235 - Still Failing!
Posted by bu...@flonkings.com.
Build: builds.flonkings.com/job/Lucene-trunk-Linux-Java6-64-test-only-compressed/235/
No tests ran.
Build Log:
[...truncated 16 lines...]
BUILD FAILED
Target "clean-jars" does not exist in the project "lucene".
Total time: 0 seconds
Build step 'Invoke Ant' marked build as failure
Recording test results
Email was triggered for: Failure
Sending email for trigger: Failure
[JENKINS] Lucene-trunk-Linux-Java6-64-test-only-compressed - Build
# 234 - Still Failing!
Posted by bu...@flonkings.com.
Build: builds.flonkings.com/job/Lucene-trunk-Linux-Java6-64-test-only-compressed/234/
No tests ran.
Build Log:
[...truncated 15 lines...]
BUILD FAILED
Target "clean-jars" does not exist in the project "lucene".
Total time: 0 seconds
Build step 'Invoke Ant' marked build as failure
Recording test results
Email was triggered for: Failure
Sending email for trigger: Failure
[JENKINS] Lucene-trunk-Linux-Java6-64-test-only-compressed - Build
# 233 - Still Failing!
Posted by bu...@flonkings.com.
Build: builds.flonkings.com/job/Lucene-trunk-Linux-Java6-64-test-only-compressed/233/
No tests ran.
Build Log:
[...truncated 15 lines...]
BUILD FAILED
Target "clean-jars" does not exist in the project "lucene".
Total time: 0 seconds
Build step 'Invoke Ant' marked build as failure
Recording test results
Email was triggered for: Failure
Sending email for trigger: Failure
[JENKINS] Lucene-trunk-Linux-Java6-64-test-only-compressed - Build
# 232 - Still Failing!
Posted by bu...@flonkings.com.
Build: builds.flonkings.com/job/Lucene-trunk-Linux-Java6-64-test-only-compressed/232/
No tests ran.
Build Log:
[...truncated 15 lines...]
BUILD FAILED
Target "clean-jars" does not exist in the project "lucene".
Total time: 0 seconds
Build step 'Invoke Ant' marked build as failure
Recording test results
Email was triggered for: Failure
Sending email for trigger: Failure
[JENKINS] Lucene-trunk-Linux-Java6-64-test-only-compressed - Build
# 231 - Still Failing!
Posted by bu...@flonkings.com.
Build: builds.flonkings.com/job/Lucene-trunk-Linux-Java6-64-test-only-compressed/231/
No tests ran.
Build Log:
[...truncated 15 lines...]
BUILD FAILED
Target "clean-jars" does not exist in the project "lucene".
Total time: 0 seconds
Build step 'Invoke Ant' marked build as failure
Recording test results
Email was triggered for: Failure
Sending email for trigger: Failure
[JENKINS] Lucene-trunk-Linux-Java6-64-test-only-compressed - Build
# 230 - Still Failing!
Posted by bu...@flonkings.com.
Build: builds.flonkings.com/job/Lucene-trunk-Linux-Java6-64-test-only-compressed/230/
No tests ran.
Build Log:
[...truncated 15 lines...]
BUILD FAILED
Target "clean-jars" does not exist in the project "lucene".
Total time: 0 seconds
Build step 'Invoke Ant' marked build as failure
Recording test results
Email was triggered for: Failure
Sending email for trigger: Failure
[JENKINS] Lucene-trunk-Linux-Java6-64-test-only-compressed - Build
# 229 - Still Failing!
Posted by bu...@flonkings.com.
Build: builds.flonkings.com/job/Lucene-trunk-Linux-Java6-64-test-only-compressed/229/
No tests ran.
Build Log:
[...truncated 15 lines...]
BUILD FAILED
Target "clean-jars" does not exist in the project "lucene".
Total time: 0 seconds
Build step 'Invoke Ant' marked build as failure
Recording test results
Email was triggered for: Failure
Sending email for trigger: Failure
[JENKINS] Lucene-trunk-Linux-Java6-64-test-only-compressed - Build
# 228 - Still Failing!
Posted by bu...@flonkings.com.
Build: builds.flonkings.com/job/Lucene-trunk-Linux-Java6-64-test-only-compressed/228/
No tests ran.
Build Log:
[...truncated 15 lines...]
BUILD FAILED
Target "clean-jars" does not exist in the project "lucene".
Total time: 0 seconds
Build step 'Invoke Ant' marked build as failure
Recording test results
Email was triggered for: Failure
Sending email for trigger: Failure