You are viewing a plain text version of this content. The canonical link for it is here.
Posted to builds@beam.apache.org by Apache Jenkins Server <je...@builds.apache.org> on 2018/11/20 03:04:02 UTC

Build failed in Jenkins: beam_PostCommit_Java_GradleBuild #1939

See <https://builds.apache.org/job/beam_PostCommit_Java_GradleBuild/1939/display/redirect>

------------------------------------------
[...truncated 57.89 MB...]
    Nov 20, 2018 2:59:56 AM org.apache.beam.runners.dataflow.util.PackageUtil tryStagePackage
    INFO: Uploading /home/jenkins/.gradle/caches/modules-2/files-2.1/com.esotericsoftware.minlog/minlog/1.2/59bfcd171d82f9981a5e242b9e840191f650e209/minlog-1.2.jar to gs://temp-storage-for-end-to-end-tests/spannerwriteit0testreportfailures-jenkins-1120025954-5eedc925/output/results/staging/minlog-1.2-98-99jtn3wu_pMfLJgiFvA.jar
    Nov 20, 2018 2:59:56 AM org.apache.beam.runners.dataflow.util.PackageUtil tryStagePackage
    INFO: Uploading /home/jenkins/.gradle/caches/modules-2/files-2.1/com.google.api/api-common/1.6.0/fea8ce6b7d8629f1646641e07a3ab712b56b901e/api-common-1.6.0.jar to gs://temp-storage-for-end-to-end-tests/spannerwriteit0testreportfailures-jenkins-1120025954-5eedc925/output/results/staging/api-common-1.6.0-MS47vK7oXbZDFTmyaX9_0A.jar
    Nov 20, 2018 2:59:56 AM org.apache.beam.runners.dataflow.util.PackageUtil tryStagePackage
    INFO: Uploading /home/jenkins/.gradle/caches/modules-2/files-2.1/com.esotericsoftware.kryo/kryo/2.21/9a4e69cff8d225729656f7e97e40893b23bffef/kryo-2.21.jar to gs://temp-storage-for-end-to-end-tests/spannerwriteit0testreportfailures-jenkins-1120025954-5eedc925/output/results/staging/kryo-2.21-olkSUBNMYGe-WXkdlwcytQ.jar
    Nov 20, 2018 2:59:56 AM org.apache.beam.runners.dataflow.util.PackageUtil tryStagePackage
    INFO: Uploading /home/jenkins/.gradle/caches/modules-2/files-2.1/com.esotericsoftware.reflectasm/reflectasm/1.07/76f11c94a53ee975a0d9154b325c408b210155bd/reflectasm-1.07-shaded.jar to gs://temp-storage-for-end-to-end-tests/spannerwriteit0testreportfailures-jenkins-1120025954-5eedc925/output/results/staging/reflectasm-1.07-shaded-IELCIoQPsh49E873w5ZYMQ.jar
    Nov 20, 2018 2:59:56 AM org.apache.beam.runners.dataflow.util.PackageUtil tryStagePackage
    INFO: Uploading /home/jenkins/.gradle/caches/modules-2/files-2.1/commons-codec/commons-codec/1.10/4b95f4897fa13f2cd904aee711aeafc0c5295cd8/commons-codec-1.10.jar to gs://temp-storage-for-end-to-end-tests/spannerwriteit0testreportfailures-jenkins-1120025954-5eedc925/output/results/staging/commons-codec-1.10-NTz2or26CVlcz6Bzt4x_yw.jar
    Nov 20, 2018 2:59:56 AM org.apache.beam.runners.dataflow.util.PackageUtil tryStagePackage
    INFO: Uploading /home/jenkins/.gradle/caches/modules-2/files-2.1/org.beanshell/bsh/2.0b4/a05f0a0feefa8d8467ac80e16e7de071489f0d9c/bsh-2.0b4.jar to gs://temp-storage-for-end-to-end-tests/spannerwriteit0testreportfailures-jenkins-1120025954-5eedc925/output/results/staging/bsh-2.0b4-ocYKqDycmmyyORwcG4XrAA.jar
    Nov 20, 2018 2:59:56 AM org.apache.beam.runners.dataflow.util.PackageUtil tryStagePackage
    INFO: Uploading /home/jenkins/.gradle/caches/modules-2/files-2.1/com.google.protobuf.nano/protobuf-javanano/3.0.0-alpha-5/357e60f95cebb87c72151e49ba1f570d899734f8/protobuf-javanano-3.0.0-alpha-5.jar to gs://temp-storage-for-end-to-end-tests/spannerwriteit0testreportfailures-jenkins-1120025954-5eedc925/output/results/staging/protobuf-javanano-3.0.0-alpha-5-SsS7fZe7brffHbAGUgRrnw.jar
    Nov 20, 2018 2:59:56 AM org.apache.beam.runners.dataflow.util.PackageUtil tryStagePackage
    INFO: Uploading /home/jenkins/.gradle/caches/modules-2/files-2.1/ognl/ognl/3.1.12/a7fa0db32f882cd3bb41ec6c489853b3bfb6aebc/ognl-3.1.12.jar to gs://temp-storage-for-end-to-end-tests/spannerwriteit0testreportfailures-jenkins-1120025954-5eedc925/output/results/staging/ognl-3.1.12-aq6HFAi1aHiNX6qcImOsmw.jar
    Nov 20, 2018 2:59:56 AM org.apache.beam.runners.dataflow.util.PackageUtil tryStagePackage
    INFO: Uploading /home/jenkins/.gradle/caches/modules-2/files-2.1/io.netty/netty-common/4.1.25.Final/e17d5c05c101fe14536ce3fb34b36c54e04791f6/netty-common-4.1.25.Final.jar to gs://temp-storage-for-end-to-end-tests/spannerwriteit0testreportfailures-jenkins-1120025954-5eedc925/output/results/staging/netty-common-4.1.25.Final-cYwMY1_F2pzboFUnBL3CxQ.jar
    Nov 20, 2018 2:59:56 AM org.apache.beam.runners.dataflow.util.PackageUtil tryStagePackage
    INFO: Uploading /home/jenkins/.gradle/caches/modules-2/files-2.1/ru.vyarus/generics-resolver/2.0.1/2182e67f161ddbe3ff8cb055bb54398354fda3f5/generics-resolver-2.0.1.jar to gs://temp-storage-for-end-to-end-tests/spannerwriteit0testreportfailures-jenkins-1120025954-5eedc925/output/results/staging/generics-resolver-2.0.1-VrpA4CuIscdXm0wF6oMTaQ.jar
    Nov 20, 2018 2:59:56 AM org.apache.beam.runners.dataflow.util.PackageUtil tryStagePackage
    INFO: Uploading /home/jenkins/.gradle/caches/modules-2/files-2.1/com.squareup.okhttp/okhttp/2.5.0/4de2b4ed3445c37ec1720a7d214712e845a24636/okhttp-2.5.0.jar to gs://temp-storage-for-end-to-end-tests/spannerwriteit0testreportfailures-jenkins-1120025954-5eedc925/output/results/staging/okhttp-2.5.0-64v0X4G_nxfR_PsuymOqpg.jar
    Nov 20, 2018 2:59:56 AM org.apache.beam.runners.dataflow.util.PackageUtil tryStagePackage
    INFO: Uploading /home/jenkins/.gradle/caches/modules-2/files-2.1/io.netty/netty-tcnative-boringssl-static/2.0.8.Final/5c3483dfa33cd04f5469c95abf67e1b69a8f1221/netty-tcnative-boringssl-static-2.0.8.Final.jar to gs://temp-storage-for-end-to-end-tests/spannerwriteit0testreportfailures-jenkins-1120025954-5eedc925/output/results/staging/netty-tcnative-boringssl-static-2.0.8.Final-RCm0wU8kBdzNqqi47Z837A.jar
    Nov 20, 2018 2:59:56 AM org.apache.beam.runners.dataflow.util.PackageUtil tryStagePackage
    INFO: Uploading /home/jenkins/.gradle/caches/modules-2/files-2.1/org.apache.httpcomponents/httpcore/4.4.9/a86ce739e5a7175b4b234c290a00a5fdb80957a0/httpcore-4.4.9.jar to gs://temp-storage-for-end-to-end-tests/spannerwriteit0testreportfailures-jenkins-1120025954-5eedc925/output/results/staging/httpcore-4.4.9-uJRVUHg5wJ1hGWYd79IWag.jar
    Nov 20, 2018 2:59:56 AM org.apache.beam.runners.dataflow.util.PackageUtil tryStagePackage
    INFO: Uploading /home/jenkins/.gradle/caches/modules-2/files-2.1/org.javaruntype/javaruntype/1.3/26ba963f4b20c751e07b58b990bb41bf850622d8/javaruntype-1.3.jar to gs://temp-storage-for-end-to-end-tests/spannerwriteit0testreportfailures-jenkins-1120025954-5eedc925/output/results/staging/javaruntype-1.3-rOez6Sa6vLqndviPQ7_noQ.jar
    Nov 20, 2018 2:59:56 AM org.apache.beam.runners.dataflow.util.PackageUtil tryStagePackage
    INFO: Uploading /home/jenkins/.gradle/caches/modules-2/files-2.1/org.antlr/antlr-runtime/3.1.2/c4ca32c2be1b22a5553dd3171f51f9b2b04030b/antlr-runtime-3.1.2.jar to gs://temp-storage-for-end-to-end-tests/spannerwriteit0testreportfailures-jenkins-1120025954-5eedc925/output/results/staging/antlr-runtime-3.1.2-dpdEvr2kPK4dWHj9fUOv1A.jar
    Nov 20, 2018 2:59:56 AM org.apache.beam.runners.dataflow.util.PackageUtil tryStagePackage
    INFO: Uploading /home/jenkins/.gradle/caches/modules-2/files-2.1/org.ow2.asm/asm/4.0/659add6efc75a4715d738e73f07505246edf4d66/asm-4.0.jar to gs://temp-storage-for-end-to-end-tests/spannerwriteit0testreportfailures-jenkins-1120025954-5eedc925/output/results/staging/asm-4.0-Mi2PiMURGvYS34OMAZHNfg.jar
    Nov 20, 2018 2:59:56 AM org.apache.beam.runners.dataflow.util.PackageUtil tryStagePackage
    INFO: Uploading /home/jenkins/.gradle/caches/modules-2/files-2.1/org.yaml/snakeyaml/1.18/e4a441249ade301985cb8d009d4e4a72b85bf68e/snakeyaml-1.18.jar to gs://temp-storage-for-end-to-end-tests/spannerwriteit0testreportfailures-jenkins-1120025954-5eedc925/output/results/staging/snakeyaml-1.18-R-oOCdgXK4J6PV-saHyToQ.jar
    Nov 20, 2018 2:59:56 AM org.apache.beam.runners.dataflow.util.PackageUtil tryStagePackage
    INFO: Uploading /home/jenkins/.gradle/caches/modules-2/files-2.1/org.javassist/javassist/3.20.0-GA/a9cbcdfb7e9f86fbc74d3afae65f2248bfbf82a0/javassist-3.20.0-GA.jar to gs://temp-storage-for-end-to-end-tests/spannerwriteit0testreportfailures-jenkins-1120025954-5eedc925/output/results/staging/javassist-3.20.0-GA-qJ3XkH124GHsLAfnYqdCVg.jar
    Nov 20, 2018 2:59:56 AM org.apache.beam.runners.dataflow.util.PackageUtil tryStagePackage
    INFO: Uploading /home/jenkins/.gradle/caches/modules-2/files-2.1/io.grpc/grpc-netty-shaded/1.13.1/ccdc4f2c2791d93164c574fbfb90d614aa0849ae/grpc-netty-shaded-1.13.1.jar to gs://temp-storage-for-end-to-end-tests/spannerwriteit0testreportfailures-jenkins-1120025954-5eedc925/output/results/staging/grpc-netty-shaded-1.13.1-YS-LK7_gIZl0B4Kw_7Rw7A.jar
    Nov 20, 2018 2:59:56 AM org.apache.beam.runners.dataflow.util.PackageUtil tryStagePackage
    INFO: Uploading /home/jenkins/.gradle/caches/modules-2/files-2.1/com.beust/jcommander/1.27/58c9cbf0f1fa296f93c712f2cf46de50471920f9/jcommander-1.27.jar to gs://temp-storage-for-end-to-end-tests/spannerwriteit0testreportfailures-jenkins-1120025954-5eedc925/output/results/staging/jcommander-1.27-YxYbyOYD5gurYr1hw0nzcA.jar
    Nov 20, 2018 2:59:56 AM org.apache.beam.runners.dataflow.util.PackageUtil tryStagePackage
    INFO: Uploading <https://builds.apache.org/job/beam_PostCommit_Java_GradleBuild/ws/src/runners/direct-java/build/libs/beam-runners-direct-java-2.9.0-SNAPSHOT.jar> to gs://temp-storage-for-end-to-end-tests/spannerwriteit0testreportfailures-jenkins-1120025954-5eedc925/output/results/staging/beam-runners-direct-java-2.9.0-SNAPSHOT-DEzWQl18Zr-Um5uV9QKJYA.jar
    Nov 20, 2018 2:59:56 AM org.apache.beam.runners.dataflow.util.PackageUtil tryStagePackage
    INFO: Uploading /home/jenkins/.gradle/caches/modules-2/files-2.1/org.testng/testng/6.8.21/15e02d8d7be3c3640b585b97eda56026fdb5bf4d/testng-6.8.21.jar to gs://temp-storage-for-end-to-end-tests/spannerwriteit0testreportfailures-jenkins-1120025954-5eedc925/output/results/staging/testng-6.8.21-4nE6Pd5l58HFjEGfLzL88Q.jar
    Nov 20, 2018 2:59:56 AM org.apache.beam.runners.dataflow.util.PackageUtil tryStagePackage
    INFO: Uploading <https://builds.apache.org/job/beam_PostCommit_Java_GradleBuild/ws/src/runners/google-cloud-dataflow-java/worker/legacy-worker/build/libs/beam-runners-google-cloud-dataflow-java-legacy-worker-2.9.0-SNAPSHOT.jar> to gs://temp-storage-for-end-to-end-tests/spannerwriteit0testreportfailures-jenkins-1120025954-5eedc925/output/results/staging/beam-runners-google-cloud-dataflow-java-legacy-worker-2.9.0-SNAPSHOT-aC1zTl2iMjx8kpLtaa8zgA.jar
    Nov 20, 2018 2:59:59 AM org.apache.beam.runners.dataflow.util.PackageUtil stageClasspathElements
    INFO: Staging files complete: 0 files cached, 162 files newly uploaded
    Nov 20, 2018 2:59:59 AM org.apache.beam.runners.dataflow.DataflowPipelineTranslator$Translator addStep
    INFO: Adding GenerateSequence/Read(BoundedCountingSource) as step s1
    Nov 20, 2018 2:59:59 AM org.apache.beam.runners.dataflow.DataflowPipelineTranslator$Translator addStep
    INFO: Adding ParDo(GenerateMutations) as step s2
    Nov 20, 2018 2:59:59 AM org.apache.beam.runners.dataflow.DataflowPipelineTranslator$Translator addStep
    INFO: Adding SpannerIO.Write/To mutation group as step s3
    Nov 20, 2018 2:59:59 AM org.apache.beam.runners.dataflow.DataflowPipelineTranslator$Translator addStep
    INFO: Adding SpannerIO.Write/Write mutations to Cloud Spanner/Create Seed/Read(CreateSource) as step s4
    Nov 20, 2018 2:59:59 AM org.apache.beam.runners.dataflow.DataflowPipelineTranslator$Translator addStep
    INFO: Adding SpannerIO.Write/Write mutations to Cloud Spanner/Read information schema as step s5
    Nov 20, 2018 2:59:59 AM org.apache.beam.runners.dataflow.DataflowPipelineTranslator$Translator addStep
    INFO: Adding SpannerIO.Write/Write mutations to Cloud Spanner/Schema View/Combine.GloballyAsSingletonView/Combine.globally(Singleton)/WithKeys/AddKeys/Map as step s6
    Nov 20, 2018 2:59:59 AM org.apache.beam.runners.dataflow.DataflowPipelineTranslator$Translator addStep
    INFO: Adding SpannerIO.Write/Write mutations to Cloud Spanner/Schema View/Combine.GloballyAsSingletonView/Combine.globally(Singleton)/Combine.perKey(Singleton)/GroupByKey as step s7
    Nov 20, 2018 2:59:59 AM org.apache.beam.runners.dataflow.DataflowPipelineTranslator$Translator addStep
    INFO: Adding SpannerIO.Write/Write mutations to Cloud Spanner/Schema View/Combine.GloballyAsSingletonView/Combine.globally(Singleton)/Combine.perKey(Singleton)/Combine.GroupedValues as step s8
    Nov 20, 2018 2:59:59 AM org.apache.beam.runners.dataflow.DataflowPipelineTranslator$Translator addStep
    INFO: Adding SpannerIO.Write/Write mutations to Cloud Spanner/Schema View/Combine.GloballyAsSingletonView/Combine.globally(Singleton)/Values/Values/Map as step s9
    Nov 20, 2018 2:59:59 AM org.apache.beam.runners.dataflow.DataflowPipelineTranslator$Translator addStep
    INFO: Adding SpannerIO.Write/Write mutations to Cloud Spanner/Schema View/Combine.GloballyAsSingletonView/BatchViewOverrides.GroupByWindowHashAsKeyAndWindowAsSortKey/ParDo(UseWindowHashAsKeyAndWindowAsSortKey) as step s10
    Nov 20, 2018 2:59:59 AM org.apache.beam.runners.dataflow.DataflowPipelineTranslator$Translator addStep
    INFO: Adding SpannerIO.Write/Write mutations to Cloud Spanner/Schema View/Combine.GloballyAsSingletonView/BatchViewOverrides.GroupByWindowHashAsKeyAndWindowAsSortKey/BatchViewOverrides.GroupByKeyAndSortValuesOnly as step s11
    Nov 20, 2018 2:59:59 AM org.apache.beam.runners.dataflow.DataflowPipelineTranslator$Translator addStep
    INFO: Adding SpannerIO.Write/Write mutations to Cloud Spanner/Schema View/Combine.GloballyAsSingletonView/ParDo(IsmRecordForSingularValuePerWindow) as step s12
    Nov 20, 2018 2:59:59 AM org.apache.beam.runners.dataflow.DataflowPipelineTranslator$Translator addStep
    INFO: Adding SpannerIO.Write/Write mutations to Cloud Spanner/Schema View/Combine.GloballyAsSingletonView/CreateDataflowView as step s13
    Nov 20, 2018 2:59:59 AM org.apache.beam.runners.dataflow.DataflowPipelineTranslator$Translator addStep
    INFO: Adding SpannerIO.Write/Write mutations to Cloud Spanner/To Global Window/Window.Assign as step s14
    Nov 20, 2018 2:59:59 AM org.apache.beam.runners.dataflow.DataflowPipelineTranslator$Translator addStep
    INFO: Adding SpannerIO.Write/Write mutations to Cloud Spanner/Filter Unbatchable Mutations as step s15
    Nov 20, 2018 2:59:59 AM org.apache.beam.runners.dataflow.DataflowPipelineTranslator$Translator addStep
    INFO: Adding SpannerIO.Write/Write mutations to Cloud Spanner/Gather And Sort as step s16
    Nov 20, 2018 2:59:59 AM org.apache.beam.runners.dataflow.DataflowPipelineTranslator$Translator addStep
    INFO: Adding SpannerIO.Write/Write mutations to Cloud Spanner/Create Batches as step s17
    Nov 20, 2018 2:59:59 AM org.apache.beam.runners.dataflow.DataflowPipelineTranslator$Translator addStep
    INFO: Adding SpannerIO.Write/Write mutations to Cloud Spanner/Merge as step s18
    Nov 20, 2018 2:59:59 AM org.apache.beam.runners.dataflow.DataflowPipelineTranslator$Translator addStep
    INFO: Adding SpannerIO.Write/Write mutations to Cloud Spanner/Write mutations to Spanner as step s19
    Nov 20, 2018 2:59:59 AM org.apache.beam.runners.dataflow.DataflowRunner run
    INFO: Staging pipeline description to gs://temp-storage-for-end-to-end-tests/spannerwriteit0testreportfailures-jenkins-1120025954-5eedc925/output/results/staging/
    Nov 20, 2018 2:59:59 AM org.apache.beam.runners.dataflow.util.PackageUtil tryStagePackage
    INFO: Uploading <56387 bytes, hash y63qL0WxomFYxcTXrcHgGw> to gs://temp-storage-for-end-to-end-tests/spannerwriteit0testreportfailures-jenkins-1120025954-5eedc925/output/results/staging/pipeline-y63qL0WxomFYxcTXrcHgGw.pb

org.apache.beam.sdk.io.gcp.spanner.SpannerWriteIT > testReportFailures STANDARD_OUT
    Dataflow SDK version: 2.9.0-SNAPSHOT

org.apache.beam.sdk.io.gcp.spanner.SpannerWriteIT > testReportFailures STANDARD_ERROR
    Nov 20, 2018 3:00:01 AM org.apache.beam.runners.dataflow.DataflowRunner run
    INFO: To access the Dataflow monitoring console, please navigate to https://console.cloud.google.com/dataflow/jobsDetail/locations/us-central1/jobs/2018-11-19_19_00_00-3627712720612645169?project=apache-beam-testing

org.apache.beam.sdk.io.gcp.spanner.SpannerWriteIT > testReportFailures STANDARD_OUT
    Submitted job: 2018-11-19_19_00_00-3627712720612645169

org.apache.beam.sdk.io.gcp.spanner.SpannerWriteIT > testReportFailures STANDARD_ERROR
    Nov 20, 2018 3:00:01 AM org.apache.beam.runners.dataflow.DataflowRunner run
    INFO: To cancel the job using the 'gcloud' tool, run:
    > gcloud dataflow jobs --project=apache-beam-testing cancel --region=us-central1 2018-11-19_19_00_00-3627712720612645169
    Nov 20, 2018 3:00:01 AM org.apache.beam.runners.dataflow.TestDataflowRunner run
    INFO: Running Dataflow job 2018-11-19_19_00_00-3627712720612645169 with 0 expected assertions.
    Nov 20, 2018 3:00:10 AM org.apache.beam.runners.dataflow.util.MonitoringUtil$LoggingHandler process
    INFO: 2018-11-20T03:00:00.329Z: Autoscaling is enabled for job 2018-11-19_19_00_00-3627712720612645169. The number of workers will be between 1 and 1000.
    Nov 20, 2018 3:00:10 AM org.apache.beam.runners.dataflow.util.MonitoringUtil$LoggingHandler process
    INFO: 2018-11-20T03:00:00.391Z: Autoscaling was automatically enabled for job 2018-11-19_19_00_00-3627712720612645169.
    Nov 20, 2018 3:00:10 AM org.apache.beam.runners.dataflow.util.MonitoringUtil$LoggingHandler process
    INFO: 2018-11-20T03:00:03.094Z: Checking permissions granted to controller Service Account.
    Nov 20, 2018 3:00:10 AM org.apache.beam.runners.dataflow.util.MonitoringUtil$LoggingHandler process
    INFO: 2018-11-20T03:00:08.331Z: Worker configuration: n1-standard-1 in us-central1-b.
    Nov 20, 2018 3:00:10 AM org.apache.beam.runners.dataflow.util.MonitoringUtil$LoggingHandler process
    INFO: 2018-11-20T03:00:08.934Z: Expanding CoGroupByKey operations into optimizable parts.
    Nov 20, 2018 3:00:10 AM org.apache.beam.runners.dataflow.util.MonitoringUtil$LoggingHandler process
    INFO: 2018-11-20T03:00:09.005Z: Expanding GroupByKey operations into optimizable parts.
    Nov 20, 2018 3:00:10 AM org.apache.beam.runners.dataflow.util.MonitoringUtil$LoggingHandler process
    INFO: 2018-11-20T03:00:09.041Z: Lifting ValueCombiningMappingFns into MergeBucketsMappingFns
    Nov 20, 2018 3:00:10 AM org.apache.beam.runners.dataflow.util.MonitoringUtil$LoggingHandler process
    INFO: 2018-11-20T03:00:09.147Z: Fusing adjacent ParDo, Read, Write, and Flatten operations
    Nov 20, 2018 3:00:10 AM org.apache.beam.runners.dataflow.util.MonitoringUtil$LoggingHandler process
    INFO: 2018-11-20T03:00:09.177Z: Fusing consumer SpannerIO.Write/Write mutations to Cloud Spanner/Read information schema into SpannerIO.Write/Write mutations to Cloud Spanner/Create Seed/Read(CreateSource)
    Nov 20, 2018 3:00:10 AM org.apache.beam.runners.dataflow.util.MonitoringUtil$LoggingHandler process
    INFO: 2018-11-20T03:00:09.218Z: Fusing consumer SpannerIO.Write/Write mutations to Cloud Spanner/Schema View/Combine.GloballyAsSingletonView/Combine.globally(Singleton)/Combine.perKey(Singleton)/GroupByKey+SpannerIO.Write/Write mutations to Cloud Spanner/Schema View/Combine.GloballyAsSingletonView/Combine.globally(Singleton)/Combine.perKey(Singleton)/Combine.GroupedValues/Partial into SpannerIO.Write/Write mutations to Cloud Spanner/Schema View/Combine.GloballyAsSingletonView/Combine.globally(Singleton)/WithKeys/AddKeys/Map
    Nov 20, 2018 3:00:10 AM org.apache.beam.runners.dataflow.util.MonitoringUtil$LoggingHandler process
    INFO: 2018-11-20T03:00:09.256Z: Fusing consumer SpannerIO.Write/Write mutations to Cloud Spanner/Schema View/Combine.GloballyAsSingletonView/Combine.globally(Singleton)/Combine.perKey(Singleton)/Combine.GroupedValues into SpannerIO.Write/Write mutations to Cloud Spanner/Schema View/Combine.GloballyAsSingletonView/Combine.globally(Singleton)/Combine.perKey(Singleton)/GroupByKey/Read
    Nov 20, 2018 3:00:10 AM org.apache.beam.runners.dataflow.util.MonitoringUtil$LoggingHandler process
    INFO: 2018-11-20T03:00:09.293Z: Fusing consumer SpannerIO.Write/Write mutations to Cloud Spanner/Schema View/Combine.GloballyAsSingletonView/Combine.globally(Singleton)/Combine.perKey(Singleton)/GroupByKey/Write into SpannerIO.Write/Write mutations to Cloud Spanner/Schema View/Combine.GloballyAsSingletonView/Combine.globally(Singleton)/Combine.perKey(Singleton)/GroupByKey/Reify
    Nov 20, 2018 3:00:10 AM org.apache.beam.runners.dataflow.util.MonitoringUtil$LoggingHandler process
    INFO: 2018-11-20T03:00:09.332Z: Fusing consumer SpannerIO.Write/Write mutations to Cloud Spanner/Schema View/Combine.GloballyAsSingletonView/ParDo(IsmRecordForSingularValuePerWindow) into SpannerIO.Write/Write mutations to Cloud Spanner/Schema View/Combine.GloballyAsSingletonView/BatchViewOverrides.GroupByWindowHashAsKeyAndWindowAsSortKey/BatchViewOverrides.GroupByKeyAndSortValuesOnly/Read
    Nov 20, 2018 3:00:10 AM org.apache.beam.runners.dataflow.util.MonitoringUtil$LoggingHandler process
    INFO: 2018-11-20T03:00:09.366Z: Fusing consumer SpannerIO.Write/Write mutations to Cloud Spanner/Schema View/Combine.GloballyAsSingletonView/Combine.globally(Singleton)/WithKeys/AddKeys/Map into SpannerIO.Write/Write mutations to Cloud Spanner/Read information schema
    Nov 20, 2018 3:00:10 AM org.apache.beam.runners.dataflow.util.MonitoringUtil$LoggingHandler process
    INFO: 2018-11-20T03:00:09.400Z: Fusing consumer SpannerIO.Write/Write mutations to Cloud Spanner/Schema View/Combine.GloballyAsSingletonView/BatchViewOverrides.GroupByWindowHashAsKeyAndWindowAsSortKey/ParDo(UseWindowHashAsKeyAndWindowAsSortKey) into SpannerIO.Write/Write mutations to Cloud Spanner/Schema View/Combine.GloballyAsSingletonView/Combine.globally(Singleton)/Values/Values/Map
    Nov 20, 2018 3:00:10 AM org.apache.beam.runners.dataflow.util.MonitoringUtil$LoggingHandler process
    INFO: 2018-11-20T03:00:09.438Z: Fusing consumer SpannerIO.Write/Write mutations to Cloud Spanner/Schema View/Combine.GloballyAsSingletonView/BatchViewOverrides.GroupByWindowHashAsKeyAndWindowAsSortKey/BatchViewOverrides.GroupByKeyAndSortValuesOnly/Write into SpannerIO.Write/Write mutations to Cloud Spanner/Schema View/Combine.GloballyAsSingletonView/BatchViewOverrides.GroupByWindowHashAsKeyAndWindowAsSortKey/ParDo(UseWindowHashAsKeyAndWindowAsSortKey)
    Nov 20, 2018 3:00:10 AM org.apache.beam.runners.dataflow.util.MonitoringUtil$LoggingHandler process
    INFO: 2018-11-20T03:00:09.477Z: Fusing consumer SpannerIO.Write/Write mutations to Cloud Spanner/Schema View/Combine.GloballyAsSingletonView/Combine.globally(Singleton)/Combine.perKey(Singleton)/GroupByKey/Reify into SpannerIO.Write/Write mutations to Cloud Spanner/Schema View/Combine.GloballyAsSingletonView/Combine.globally(Singleton)/Combine.perKey(Singleton)/GroupByKey+SpannerIO.Write/Write mutations to Cloud Spanner/Schema View/Combine.GloballyAsSingletonView/Combine.globally(Singleton)/Combine.perKey(Singleton)/Combine.GroupedValues/Partial
    Nov 20, 2018 3:00:10 AM org.apache.beam.runners.dataflow.util.MonitoringUtil$LoggingHandler process
    INFO: 2018-11-20T03:00:09.516Z: Fusing consumer SpannerIO.Write/Write mutations to Cloud Spanner/Schema View/Combine.GloballyAsSingletonView/Combine.globally(Singleton)/Values/Values/Map into SpannerIO.Write/Write mutations to Cloud Spanner/Schema View/Combine.GloballyAsSingletonView/Combine.globally(Singleton)/Combine.perKey(Singleton)/Combine.GroupedValues/Extract
    Nov 20, 2018 3:00:10 AM org.apache.beam.runners.dataflow.util.MonitoringUtil$LoggingHandler process
    INFO: 2018-11-20T03:00:09.553Z: Fusing consumer SpannerIO.Write/Write mutations to Cloud Spanner/Schema View/Combine.GloballyAsSingletonView/Combine.globally(Singleton)/Combine.perKey(Singleton)/Combine.GroupedValues/Extract into SpannerIO.Write/Write mutations to Cloud Spanner/Schema View/Combine.GloballyAsSingletonView/Combine.globally(Singleton)/Combine.perKey(Singleton)/Combine.GroupedValues
    Nov 20, 2018 3:00:10 AM org.apache.beam.runners.dataflow.util.MonitoringUtil$LoggingHandler process
    INFO: 2018-11-20T03:00:09.590Z: Unzipping flatten s18 for input s15.unbatchableMutations
    Nov 20, 2018 3:00:10 AM org.apache.beam.runners.dataflow.util.MonitoringUtil$LoggingHandler process
    INFO: 2018-11-20T03:00:09.628Z: Fusing unzipped copy of SpannerIO.Write/Write mutations to Cloud Spanner/Write mutations to Spanner, through flatten SpannerIO.Write/Write mutations to Cloud Spanner/Merge, into producer SpannerIO.Write/Write mutations to Cloud Spanner/Filter Unbatchable Mutations
    Nov 20, 2018 3:00:10 AM org.apache.beam.runners.dataflow.util.MonitoringUtil$LoggingHandler process
    INFO: 2018-11-20T03:00:09.670Z: Fusing consumer SpannerIO.Write/Write mutations to Cloud Spanner/Write mutations to Spanner into SpannerIO.Write/Write mutations to Cloud Spanner/Create Batches
    Nov 20, 2018 3:00:10 AM org.apache.beam.runners.dataflow.util.MonitoringUtil$LoggingHandler process
    INFO: 2018-11-20T03:00:09.705Z: Fusing consumer SpannerIO.Write/Write mutations to Cloud Spanner/To Global Window/Window.Assign into SpannerIO.Write/To mutation group
    Nov 20, 2018 3:00:10 AM org.apache.beam.runners.dataflow.util.MonitoringUtil$LoggingHandler process
    INFO: 2018-11-20T03:00:09.743Z: Fusing consumer SpannerIO.Write/To mutation group into ParDo(GenerateMutations)
    Nov 20, 2018 3:00:10 AM org.apache.beam.runners.dataflow.util.MonitoringUtil$LoggingHandler process
    INFO: 2018-11-20T03:00:09.774Z: Fusing consumer ParDo(GenerateMutations) into GenerateSequence/Read(BoundedCountingSource)
    Nov 20, 2018 3:00:10 AM org.apache.beam.runners.dataflow.util.MonitoringUtil$LoggingHandler process
    INFO: 2018-11-20T03:00:09.811Z: Fusing consumer SpannerIO.Write/Write mutations to Cloud Spanner/Create Batches into SpannerIO.Write/Write mutations to Cloud Spanner/Gather And Sort
    Nov 20, 2018 3:00:10 AM org.apache.beam.runners.dataflow.util.MonitoringUtil$LoggingHandler process
    INFO: 2018-11-20T03:00:09.850Z: Fusing consumer SpannerIO.Write/Write mutations to Cloud Spanner/Gather And Sort into SpannerIO.Write/Write mutations to Cloud Spanner/Filter Unbatchable Mutations
    Nov 20, 2018 3:00:10 AM org.apache.beam.runners.dataflow.util.MonitoringUtil$LoggingHandler process
    INFO: 2018-11-20T03:00:09.888Z: Fusing consumer SpannerIO.Write/Write mutations to Cloud Spanner/Filter Unbatchable Mutations into SpannerIO.Write/Write mutations to Cloud Spanner/To Global Window/Window.Assign
    Nov 20, 2018 3:00:10 AM org.apache.beam.runners.dataflow.util.MonitoringUtil$LoggingHandler process
    INFO: 2018-11-20T03:00:10.310Z: Executing operation SpannerIO.Write/Write mutations to Cloud Spanner/Schema View/Combine.GloballyAsSingletonView/BatchViewOverrides.GroupByWindowHashAsKeyAndWindowAsSortKey/BatchViewOverrides.GroupByKeyAndSortValuesOnly/Create
    Nov 20, 2018 3:00:10 AM org.apache.beam.runners.dataflow.util.MonitoringUtil$LoggingHandler process
    INFO: 2018-11-20T03:00:10.347Z: Executing operation SpannerIO.Write/Write mutations to Cloud Spanner/Schema View/Combine.GloballyAsSingletonView/Combine.globally(Singleton)/Combine.perKey(Singleton)/GroupByKey/Create
    Nov 20, 2018 3:00:13 AM org.apache.beam.runners.dataflow.util.MonitoringUtil$LoggingHandler process
    INFO: 2018-11-20T03:00:10.401Z: Starting 1 workers in us-central1-b...
    Nov 20, 2018 3:00:13 AM org.apache.beam.runners.dataflow.util.MonitoringUtil$LoggingHandler process
    INFO: 2018-11-20T03:00:10.619Z: Executing operation SpannerIO.Write/Write mutations to Cloud Spanner/Create Seed/Read(CreateSource)+SpannerIO.Write/Write mutations to Cloud Spanner/Read information schema+SpannerIO.Write/Write mutations to Cloud Spanner/Schema View/Combine.GloballyAsSingletonView/Combine.globally(Singleton)/WithKeys/AddKeys/Map+SpannerIO.Write/Write mutations to Cloud Spanner/Schema View/Combine.GloballyAsSingletonView/Combine.globally(Singleton)/Combine.perKey(Singleton)/GroupByKey+SpannerIO.Write/Write mutations to Cloud Spanner/Schema View/Combine.GloballyAsSingletonView/Combine.globally(Singleton)/Combine.perKey(Singleton)/Combine.GroupedValues/Partial+SpannerIO.Write/Write mutations to Cloud Spanner/Schema View/Combine.GloballyAsSingletonView/Combine.globally(Singleton)/Combine.perKey(Singleton)/GroupByKey/Reify+SpannerIO.Write/Write mutations to Cloud Spanner/Schema View/Combine.GloballyAsSingletonView/Combine.globally(Singleton)/Combine.perKey(Singleton)/GroupByKey/Write
    Nov 20, 2018 3:00:23 AM org.apache.beam.runners.dataflow.util.MonitoringUtil$LoggingHandler process
    INFO: 2018-11-20T03:00:22.949Z: Autoscaling: Raised the number of workers to 0 based on the rate of progress in the currently running step(s).
    Nov 20, 2018 3:00:53 AM org.apache.beam.runners.dataflow.util.MonitoringUtil$LoggingHandler process
    INFO: 2018-11-20T03:00:52.221Z: Autoscaling: Raised the number of workers to 1 based on the rate of progress in the currently running step(s).
    Nov 20, 2018 3:00:53 AM org.apache.beam.runners.dataflow.util.MonitoringUtil$LoggingHandler process
    INFO: 2018-11-20T03:00:52.271Z: Autoscaling: Would further reduce the number of workers but reached the minimum number allowed for the job.
    Nov 20, 2018 3:00:57 AM org.apache.beam.runners.dataflow.util.MonitoringUtil$LoggingHandler process
    INFO: 2018-11-20T03:00:55.599Z: Workers have started successfully.
    Nov 20, 2018 3:00:57 AM org.apache.beam.runners.dataflow.util.MonitoringUtil$LoggingHandler process
    INFO: 2018-11-20T03:00:55.651Z: Workers have started successfully.
    Nov 20, 2018 3:01:15 AM org.apache.beam.runners.dataflow.util.MonitoringUtil$LoggingHandler process
    INFO: 2018-11-20T03:01:15.683Z: Executing operation SpannerIO.Write/Write mutations to Cloud Spanner/Schema View/Combine.GloballyAsSingletonView/Combine.globally(Singleton)/Combine.perKey(Singleton)/GroupByKey/Close
    Nov 20, 2018 3:01:17 AM org.apache.beam.runners.dataflow.util.MonitoringUtil$LoggingHandler process
    INFO: 2018-11-20T03:01:15.781Z: Executing operation SpannerIO.Write/Write mutations to Cloud Spanner/Schema View/Combine.GloballyAsSingletonView/Combine.globally(Singleton)/Combine.perKey(Singleton)/GroupByKey/Read+SpannerIO.Write/Write mutations to Cloud Spanner/Schema View/Combine.GloballyAsSingletonView/Combine.globally(Singleton)/Combine.perKey(Singleton)/Combine.GroupedValues+SpannerIO.Write/Write mutations to Cloud Spanner/Schema View/Combine.GloballyAsSingletonView/Combine.globally(Singleton)/Combine.perKey(Singleton)/Combine.GroupedValues/Extract+SpannerIO.Write/Write mutations to Cloud Spanner/Schema View/Combine.GloballyAsSingletonView/Combine.globally(Singleton)/Values/Values/Map+SpannerIO.Write/Write mutations to Cloud Spanner/Schema View/Combine.GloballyAsSingletonView/BatchViewOverrides.GroupByWindowHashAsKeyAndWindowAsSortKey/ParDo(UseWindowHashAsKeyAndWindowAsSortKey)+SpannerIO.Write/Write mutations to Cloud Spanner/Schema View/Combine.GloballyAsSingletonView/BatchViewOverrides.GroupByWindowHashAsKeyAndWindowAsSortKey/BatchViewOverrides.GroupByKeyAndSortValuesOnly/Write
    Nov 20, 2018 3:01:22 AM org.apache.beam.runners.dataflow.util.MonitoringUtil$LoggingHandler process
    INFO: 2018-11-20T03:01:22.556Z: Executing operation SpannerIO.Write/Write mutations to Cloud Spanner/Schema View/Combine.GloballyAsSingletonView/BatchViewOverrides.GroupByWindowHashAsKeyAndWindowAsSortKey/BatchViewOverrides.GroupByKeyAndSortValuesOnly/Close
    Nov 20, 2018 3:01:25 AM org.apache.beam.runners.dataflow.util.MonitoringUtil$LoggingHandler process
    INFO: 2018-11-20T03:01:22.645Z: Executing operation SpannerIO.Write/Write mutations to Cloud Spanner/Schema View/Combine.GloballyAsSingletonView/BatchViewOverrides.GroupByWindowHashAsKeyAndWindowAsSortKey/BatchViewOverrides.GroupByKeyAndSortValuesOnly/Read+SpannerIO.Write/Write mutations to Cloud Spanner/Schema View/Combine.GloballyAsSingletonView/ParDo(IsmRecordForSingularValuePerWindow)
    Nov 20, 2018 3:01:32 AM org.apache.beam.runners.dataflow.util.MonitoringUtil$LoggingHandler process
    INFO: 2018-11-20T03:01:30.328Z: Executing operation SpannerIO.Write/Write mutations to Cloud Spanner/Schema View/Combine.GloballyAsSingletonView/CreateDataflowView
    Nov 20, 2018 3:01:32 AM org.apache.beam.runners.dataflow.util.MonitoringUtil$LoggingHandler process
    INFO: 2018-11-20T03:01:30.502Z: Executing operation GenerateSequence/Read(BoundedCountingSource)+ParDo(GenerateMutations)+SpannerIO.Write/To mutation group+SpannerIO.Write/Write mutations to Cloud Spanner/To Global Window/Window.Assign+SpannerIO.Write/Write mutations to Cloud Spanner/Filter Unbatchable Mutations+SpannerIO.Write/Write mutations to Cloud Spanner/Write mutations to Spanner+SpannerIO.Write/Write mutations to Cloud Spanner/Gather And Sort+SpannerIO.Write/Write mutations to Cloud Spanner/Create Batches+SpannerIO.Write/Write mutations to Cloud Spanner/Write mutations to Spanner
    Nov 20, 2018 3:01:41 AM org.apache.beam.runners.dataflow.util.MonitoringUtil$LoggingHandler process
    INFO: 2018-11-20T03:01:40.651Z: Cleaning up.
    Nov 20, 2018 3:01:41 AM org.apache.beam.runners.dataflow.util.MonitoringUtil$LoggingHandler process
    INFO: 2018-11-20T03:01:40.833Z: Stopping worker pool...
    Nov 20, 2018 3:03:50 AM org.apache.beam.runners.dataflow.util.MonitoringUtil$LoggingHandler process
    INFO: 2018-11-20T03:03:50.335Z: Autoscaling: Resized worker pool from 1 to 0.
    Nov 20, 2018 3:03:52 AM org.apache.beam.runners.dataflow.util.MonitoringUtil$LoggingHandler process
    INFO: 2018-11-20T03:03:50.373Z: Autoscaling: Would further reduce the number of workers but reached the minimum number allowed for the job.
    Nov 20, 2018 3:03:52 AM org.apache.beam.runners.dataflow.util.MonitoringUtil$LoggingHandler process
    INFO: 2018-11-20T03:03:50.423Z: Worker pool stopped.
    Nov 20, 2018 3:03:57 AM org.apache.beam.runners.dataflow.DataflowPipelineJob waitUntilFinish
    INFO: Job 2018-11-19_19_00_00-3627712720612645169 finished with status DONE.
    Nov 20, 2018 3:03:57 AM org.apache.beam.runners.dataflow.TestDataflowRunner checkForPAssertSuccess
    INFO: Success result for Dataflow job 2018-11-19_19_00_00-3627712720612645169. Found 0 success, 0 failures out of 0 expected assertions.
    Nov 20, 2018 3:03:57 AM org.apache.beam.runners.dataflow.DataflowPipelineJob waitUntilFinish
    INFO: Job 2018-11-19_19_00_00-3627712720612645169 finished with status DONE.

Gradle Test Executor 159 finished executing tests.

> Task :beam-runners-google-cloud-dataflow-java:googleCloudPlatformLegacyWorkerIntegrationTest
Finished generating test XML results (0.023 secs) into: <https://builds.apache.org/job/beam_PostCommit_Java_GradleBuild/ws/src/runners/google-cloud-dataflow-java/build/test-results/googleCloudPlatformLegacyWorkerIntegrationTest>
Generating HTML test report...
Finished generating test html results (0.021 secs) into: <https://builds.apache.org/job/beam_PostCommit_Java_GradleBuild/ws/src/runners/google-cloud-dataflow-java/build/reports/tests/googleCloudPlatformLegacyWorkerIntegrationTest>
Packing task ':beam-runners-google-cloud-dataflow-java:googleCloudPlatformLegacyWorkerIntegrationTest'
Invalidating in-memory cache of /home/jenkins/.gradle/caches/journal-1/file-access.bin
:beam-runners-google-cloud-dataflow-java:googleCloudPlatformLegacyWorkerIntegrationTest (Thread[Daemon worker,5,main]) completed. Took 1 hrs 21 mins 16.397 secs.
:beam-runners-google-cloud-dataflow-java:postCommit (Thread[Daemon worker,5,main]) started.

> Task :beam-runners-google-cloud-dataflow-java:postCommit
Skipping task ':beam-runners-google-cloud-dataflow-java:postCommit' as it has no actions.
:beam-runners-google-cloud-dataflow-java:postCommit (Thread[Daemon worker,5,main]) completed. Took 0.0 secs.

FAILURE: Build failed with an exception.

* What went wrong:
Execution failed for task ':beam-runners-java-fn-execution:test'.
> There were failing tests. See the report at: file://<https://builds.apache.org/job/beam_PostCommit_Java_GradleBuild/ws/src/runners/java-fn-execution/build/reports/tests/test/index.html>

* Try:
Run with --stacktrace option to get the stack trace. Run with --debug option to get more log output. Run with --scan to get full insights.

* Get more help at https://help.gradle.org

Deprecated Gradle features were used in this build, making it incompatible with Gradle 5.0.
Use '--warning-mode all' to show the individual deprecation warnings.
See https://docs.gradle.org/4.10.2/userguide/command_line_interface.html#sec:command_line_warnings

BUILD FAILED in 1h 51m 32s
920 actionable tasks: 914 executed, 6 from cache

Publishing build scan...
https://gradle.com/s/whtksxv72dbui

Closing Git repo: <https://builds.apache.org/job/beam_PostCommit_Java_GradleBuild/ws/src/.git>
Build step 'Invoke Gradle script' changed build result to FAILURE
Build step 'Invoke Gradle script' marked build as failure

---------------------------------------------------------------------
To unsubscribe, e-mail: builds-unsubscribe@beam.apache.org
For additional commands, e-mail: builds-help@beam.apache.org


Jenkins build is back to normal : beam_PostCommit_Java_GradleBuild #1940

Posted by Apache Jenkins Server <je...@builds.apache.org>.
See <https://builds.apache.org/job/beam_PostCommit_Java_GradleBuild/1940/display/redirect?page=changes>


---------------------------------------------------------------------
To unsubscribe, e-mail: builds-unsubscribe@beam.apache.org
For additional commands, e-mail: builds-help@beam.apache.org