You are viewing a plain text version of this content. The canonical link for it is here.
Posted to issues@tez.apache.org by Apache Jenkins Server <je...@builds.apache.org> on 2015/02/03 14:02:19 UTC

Failed: TEZ-2024 PreCommit Build #114

Jira: https://issues.apache.org/jira/browse/TEZ-2024
Build: https://builds.apache.org/job/PreCommit-TEZ-Build/114/

###################################################################################
########################## LAST 60 LINES OF THE CONSOLE ###########################
[...truncated 2594 lines...]



{color:red}-1 overall{color}.  Here are the results of testing the latest attachment
  http://issues.apache.org/jira/secure/attachment/12696152/TEZ-2024-1.patch
  against master revision cfa637a.

    {color:green}+1 @author{color}.  The patch does not contain any @author tags.

    {color:red}-1 tests included{color}.  The patch doesn't appear to include any new or modified tests.
                        Please justify why no new tests are needed for this patch.
                        Also please list what manual steps were performed to verify this patch.

    {color:green}+1 javac{color}.  The applied patch does not increase the total number of javac compiler warnings.

    {color:green}+1 javadoc{color}.  There were no new javadoc warning messages.

    {color:green}+1 findbugs{color}.  The patch does not introduce any new Findbugs (version 2.0.3) warnings.

    {color:green}+1 release audit{color}.  The applied patch does not increase the total number of release audit warnings.

    {color:green}+1 core tests{color}.  The patch passed unit tests in .

Test results: https://builds.apache.org/job/PreCommit-TEZ-Build/114//testReport/
Console output: https://builds.apache.org/job/PreCommit-TEZ-Build/114//console

This message is automatically generated.


======================================================================
======================================================================
    Adding comment to Jira.
======================================================================
======================================================================


Comment added.
5cb1b480b6430b77cb377a189c56ee09aee37c88 logged out


======================================================================
======================================================================
    Finished build.
======================================================================
======================================================================


Build step 'Execute shell' marked build as failure
Archiving artifacts
Sending artifact delta relative to PreCommit-TEZ-Build #113
Archived 41 artifacts
Archive block size is 32768
Received 6 blocks and 2432886 bytes
Compression is 7.5%
Took 0.78 sec
[description-setter] Could not determine description.
Recording test results
Email was triggered for: Failure
Sending email for trigger: Failure



###################################################################################
############################## FAILED TESTS (if any) ##############################
All tests passed

Success: TEZ-2018 PreCommit Build #122

Posted by Apache Jenkins Server <je...@builds.apache.org>.
Jira: https://issues.apache.org/jira/browse/TEZ-2018
Build: https://builds.apache.org/job/PreCommit-TEZ-Build/122/

###################################################################################
########################## LAST 60 LINES OF THE CONSOLE ###########################
[...truncated 2604 lines...]
[INFO] Final Memory: 65M/752M
[INFO] ------------------------------------------------------------------------




{color:green}+1 overall{color}.  Here are the results of testing the latest attachment
  http://issues.apache.org/jira/secure/attachment/12696491/TEZ-2018.3.patch
  against master revision cfa637a.

    {color:green}+1 @author{color}.  The patch does not contain any @author tags.

    {color:green}+1 tests included{color}.  The patch appears to include 4 new or modified test files.

    {color:green}+1 javac{color}.  The applied patch does not increase the total number of javac compiler warnings.

    {color:green}+1 javadoc{color}.  There were no new javadoc warning messages.

    {color:green}+1 findbugs{color}.  The patch does not introduce any new Findbugs (version 2.0.3) warnings.

    {color:green}+1 release audit{color}.  The applied patch does not increase the total number of release audit warnings.

    {color:green}+1 core tests{color}.  The patch passed unit tests in .

Test results: https://builds.apache.org/job/PreCommit-TEZ-Build/122//testReport/
Console output: https://builds.apache.org/job/PreCommit-TEZ-Build/122//console

This message is automatically generated.


======================================================================
======================================================================
    Adding comment to Jira.
======================================================================
======================================================================


Comment added.
cf216260775442f57939288dfc830e5db5961c05 logged out


======================================================================
======================================================================
    Finished build.
======================================================================
======================================================================


Archiving artifacts
Sending artifact delta relative to PreCommit-TEZ-Build #113
Archived 41 artifacts
Archive block size is 32768
Received 4 blocks and 2506613 bytes
Compression is 5.0%
Took 0.76 sec
Description set: TEZ-2018
Recording test results
Email was triggered for: Success
Sending email for trigger: Success



###################################################################################
############################## FAILED TESTS (if any) ##############################
All tests passed

Failed: TEZ-2018 PreCommit Build #121

Posted by Apache Jenkins Server <je...@builds.apache.org>.
Jira: https://issues.apache.org/jira/browse/TEZ-2018
Build: https://builds.apache.org/job/PreCommit-TEZ-Build/121/

###################################################################################
########################## LAST 60 LINES OF THE CONSOLE ###########################
[...truncated 2322 lines...]




{color:red}-1 overall{color}.  Here are the results of testing the latest attachment
  http://issues.apache.org/jira/secure/attachment/12696474/TEZ-2018.2.patch
  against master revision cfa637a.

    {color:green}+1 @author{color}.  The patch does not contain any @author tags.

    {color:green}+1 tests included{color}.  The patch appears to include 3 new or modified test files.

    {color:green}+1 javac{color}.  The applied patch does not increase the total number of javac compiler warnings.

    {color:green}+1 javadoc{color}.  There were no new javadoc warning messages.

    {color:green}+1 findbugs{color}.  The patch does not introduce any new Findbugs (version 2.0.3) warnings.

    {color:green}+1 release audit{color}.  The applied patch does not increase the total number of release audit warnings.

    {color:red}-1 core tests{color}.  The patch failed these unit tests in :
                   org.apache.tez.dag.app.rm.TestContainerReuse

Test results: https://builds.apache.org/job/PreCommit-TEZ-Build/121//testReport/
Console output: https://builds.apache.org/job/PreCommit-TEZ-Build/121//console

This message is automatically generated.


======================================================================
======================================================================
    Adding comment to Jira.
======================================================================
======================================================================


Comment added.
56afe98a3beaaaba6eff9eed4984b0632b59b166 logged out


======================================================================
======================================================================
    Finished build.
======================================================================
======================================================================


Build step 'Execute shell' marked build as failure
Archiving artifacts
Sending artifact delta relative to PreCommit-TEZ-Build #113
Archived 41 artifacts
Archive block size is 32768
Received 4 blocks and 2489376 bytes
Compression is 5.0%
Took 2.8 sec
[description-setter] Could not determine description.
Recording test results
Email was triggered for: Failure
Sending email for trigger: Failure



###################################################################################
############################## FAILED TESTS (if any) ##############################
7 tests failed.
REGRESSION:  org.apache.tez.dag.app.rm.TestContainerReuse.testSimpleReuse

Error Message:
null

Stack Trace:
java.lang.NullPointerException: null
	at org.apache.tez.dag.app.rm.TaskSchedulerEventHandler.getHistoryUrl(TaskSchedulerEventHandler.java:594)
	at org.apache.tez.dag.app.rm.TaskSchedulerEventHandler.<init>(TaskSchedulerEventHandler.java:119)
	at org.apache.tez.dag.app.rm.TestTaskSchedulerHelpers$TaskSchedulerEventHandlerForTest.<init>(TestTaskSchedulerHelpers.java:130)
	at org.apache.tez.dag.app.rm.TestContainerReuse.testSimpleReuse(TestContainerReuse.java:390)


REGRESSION:  org.apache.tez.dag.app.rm.TestContainerReuse.testReuseWithTaskSpecificLaunchCmdOption

Error Message:
null

Stack Trace:
java.lang.NullPointerException: null
	at org.apache.tez.dag.app.rm.TaskSchedulerEventHandler.getHistoryUrl(TaskSchedulerEventHandler.java:594)
	at org.apache.tez.dag.app.rm.TaskSchedulerEventHandler.<init>(TaskSchedulerEventHandler.java:119)
	at org.apache.tez.dag.app.rm.TestTaskSchedulerHelpers$TaskSchedulerEventHandlerForTest.<init>(TestTaskSchedulerHelpers.java:130)
	at org.apache.tez.dag.app.rm.TestContainerReuse.testReuseWithTaskSpecificLaunchCmdOption(TestContainerReuse.java:530)


REGRESSION:  org.apache.tez.dag.app.rm.TestContainerReuse.testReuseNonLocalRequest

Error Message:
null

Stack Trace:
java.lang.NullPointerException: null
	at org.apache.tez.dag.app.rm.TaskSchedulerEventHandler.getHistoryUrl(TaskSchedulerEventHandler.java:594)
	at org.apache.tez.dag.app.rm.TaskSchedulerEventHandler.<init>(TaskSchedulerEventHandler.java:119)
	at org.apache.tez.dag.app.rm.TestTaskSchedulerHelpers$TaskSchedulerEventHandlerForTest.<init>(TestTaskSchedulerHelpers.java:130)
	at org.apache.tez.dag.app.rm.TestContainerReuse.testReuseNonLocalRequest(TestContainerReuse.java:721)


REGRESSION:  org.apache.tez.dag.app.rm.TestContainerReuse.testReuseAcrossVertices

Error Message:
null

Stack Trace:
java.lang.NullPointerException: null
	at org.apache.tez.dag.app.rm.TaskSchedulerEventHandler.getHistoryUrl(TaskSchedulerEventHandler.java:594)
	at org.apache.tez.dag.app.rm.TaskSchedulerEventHandler.<init>(TaskSchedulerEventHandler.java:119)
	at org.apache.tez.dag.app.rm.TestTaskSchedulerHelpers$TaskSchedulerEventHandlerForTest.<init>(TestTaskSchedulerHelpers.java:130)
	at org.apache.tez.dag.app.rm.TestContainerReuse.testReuseAcrossVertices(TestContainerReuse.java:850)


REGRESSION:  org.apache.tez.dag.app.rm.TestContainerReuse.testReuseLocalResourcesChanged

Error Message:
null

Stack Trace:
java.lang.NullPointerException: null
	at org.apache.tez.dag.app.rm.TaskSchedulerEventHandler.getHistoryUrl(TaskSchedulerEventHandler.java:594)
	at org.apache.tez.dag.app.rm.TaskSchedulerEventHandler.<init>(TaskSchedulerEventHandler.java:119)
	at org.apache.tez.dag.app.rm.TestTaskSchedulerHelpers$TaskSchedulerEventHandlerForTest.<init>(TestTaskSchedulerHelpers.java:130)
	at org.apache.tez.dag.app.rm.TestContainerReuse.testReuseLocalResourcesChanged(TestContainerReuse.java:970)


REGRESSION:  org.apache.tez.dag.app.rm.TestContainerReuse.testDelayedReuseContainerNotAvailable

Error Message:
null

Stack Trace:
java.lang.NullPointerException: null
	at org.apache.tez.dag.app.rm.TaskSchedulerEventHandler.getHistoryUrl(TaskSchedulerEventHandler.java:594)
	at org.apache.tez.dag.app.rm.TaskSchedulerEventHandler.<init>(TaskSchedulerEventHandler.java:119)
	at org.apache.tez.dag.app.rm.TestTaskSchedulerHelpers$TaskSchedulerEventHandlerForTest.<init>(TestTaskSchedulerHelpers.java:130)
	at org.apache.tez.dag.app.rm.TestContainerReuse.testDelayedReuseContainerNotAvailable(TestContainerReuse.java:288)


REGRESSION:  org.apache.tez.dag.app.rm.TestContainerReuse.testDelayedReuseContainerBecomesAvailable

Error Message:
null

Stack Trace:
java.lang.NullPointerException: null
	at org.apache.tez.dag.app.rm.TaskSchedulerEventHandler.getHistoryUrl(TaskSchedulerEventHandler.java:594)
	at org.apache.tez.dag.app.rm.TaskSchedulerEventHandler.<init>(TaskSchedulerEventHandler.java:119)
	at org.apache.tez.dag.app.rm.TestTaskSchedulerHelpers$TaskSchedulerEventHandlerForTest.<init>(TestTaskSchedulerHelpers.java:130)
	at org.apache.tez.dag.app.rm.TestContainerReuse.testDelayedReuseContainerBecomesAvailable(TestContainerReuse.java:151)



Failed: TEZ-2023 PreCommit Build #120

Posted by Apache Jenkins Server <je...@builds.apache.org>.
Jira: https://issues.apache.org/jira/browse/TEZ-2023
Build: https://builds.apache.org/job/PreCommit-TEZ-Build/120/

###################################################################################
########################## LAST 60 LINES OF THE CONSOLE ###########################
[...truncated 2597 lines...]



{color:red}-1 overall{color}.  Here are the results of testing the latest attachment
  http://issues.apache.org/jira/secure/attachment/12696453/TEZ-2023.4.patch
  against master revision cfa637a.

    {color:green}+1 @author{color}.  The patch does not contain any @author tags.

    {color:red}-1 tests included{color}.  The patch doesn't appear to include any new or modified tests.
                        Please justify why no new tests are needed for this patch.
                        Also please list what manual steps were performed to verify this patch.

    {color:green}+1 javac{color}.  The applied patch does not increase the total number of javac compiler warnings.

    {color:green}+1 javadoc{color}.  There were no new javadoc warning messages.

    {color:green}+1 findbugs{color}.  The patch does not introduce any new Findbugs (version 2.0.3) warnings.

    {color:green}+1 release audit{color}.  The applied patch does not increase the total number of release audit warnings.

    {color:green}+1 core tests{color}.  The patch passed unit tests in .

Test results: https://builds.apache.org/job/PreCommit-TEZ-Build/120//testReport/
Console output: https://builds.apache.org/job/PreCommit-TEZ-Build/120//console

This message is automatically generated.


======================================================================
======================================================================
    Adding comment to Jira.
======================================================================
======================================================================


Comment added.
8d65ac36f01d53a75583ef11524fe902ab176439 logged out


======================================================================
======================================================================
    Finished build.
======================================================================
======================================================================


Build step 'Execute shell' marked build as failure
Archiving artifacts
Sending artifact delta relative to PreCommit-TEZ-Build #113
Archived 41 artifacts
Archive block size is 32768
Received 4 blocks and 2498482 bytes
Compression is 5.0%
Took 1.3 sec
[description-setter] Could not determine description.
Recording test results
Email was triggered for: Failure
Sending email for trigger: Failure



###################################################################################
############################## FAILED TESTS (if any) ##############################
All tests passed

Failed: TEZ-2020 PreCommit Build #119

Posted by Apache Jenkins Server <je...@builds.apache.org>.
Jira: https://issues.apache.org/jira/browse/TEZ-2020
Build: https://builds.apache.org/job/PreCommit-TEZ-Build/119/

###################################################################################
########################## LAST 60 LINES OF THE CONSOLE ###########################
[...truncated 22 lines...]


======================================================================
======================================================================
    Testing patch for TEZ-2020.
======================================================================
======================================================================


HEAD is now at cfa637a TEZ-1895. Vertex reRunning should decrease successfulMembers of VertexGroupInfo (zjffdu)
Switched to branch 'master'
Your branch is up-to-date with 'origin/master'.
Current branch master is up to date.
TEZ-2020 patch is being downloaded at Wed Feb  4 09:00:22 UTC 2015 from
http://issues.apache.org/jira/secure/attachment/12696412/synthetic_job.png
patch: **** Only garbage was found in the patch input.
patch: **** Only garbage was found in the patch input.
patch: **** Only garbage was found in the patch input.
The patch does not appear to apply with p0 to p2
PATCH APPLICATION FAILED




{color:red}-1 overall{color}.  Here are the results of testing the latest attachment
  http://issues.apache.org/jira/secure/attachment/12696412/synthetic_job.png
  against master revision cfa637a.

    {color:red}-1 patch{color}.  The patch command could not apply the patch.

Console output: https://builds.apache.org/job/PreCommit-TEZ-Build/119//console

This message is automatically generated.


======================================================================
======================================================================
    Adding comment to Jira.
======================================================================
======================================================================


Comment added.
c8aecb483da6e4796d0361f6f4efcef0c3e3e240 logged out


======================================================================
======================================================================
    Finished build.
======================================================================
======================================================================


Build step 'Execute shell' marked build as failure
Archiving artifacts
[description-setter] Could not determine description.
Recording test results
Email was triggered for: Failure
Sending email for trigger: Failure



###################################################################################
############################## FAILED TESTS (if any) ##############################
No tests ran.

Failed: TEZ-2023 PreCommit Build #118

Posted by Apache Jenkins Server <je...@builds.apache.org>.
Jira: https://issues.apache.org/jira/browse/TEZ-2023
Build: https://builds.apache.org/job/PreCommit-TEZ-Build/118/

###################################################################################
########################## LAST 60 LINES OF THE CONSOLE ###########################
[...truncated 2596 lines...]



{color:red}-1 overall{color}.  Here are the results of testing the latest attachment
  http://issues.apache.org/jira/secure/attachment/12696348/TEZ-2023.3.patch
  against master revision cfa637a.

    {color:green}+1 @author{color}.  The patch does not contain any @author tags.

    {color:red}-1 tests included{color}.  The patch doesn't appear to include any new or modified tests.
                        Please justify why no new tests are needed for this patch.
                        Also please list what manual steps were performed to verify this patch.

    {color:green}+1 javac{color}.  The applied patch does not increase the total number of javac compiler warnings.

    {color:green}+1 javadoc{color}.  There were no new javadoc warning messages.

    {color:green}+1 findbugs{color}.  The patch does not introduce any new Findbugs (version 2.0.3) warnings.

    {color:green}+1 release audit{color}.  The applied patch does not increase the total number of release audit warnings.

    {color:green}+1 core tests{color}.  The patch passed unit tests in .

Test results: https://builds.apache.org/job/PreCommit-TEZ-Build/118//testReport/
Console output: https://builds.apache.org/job/PreCommit-TEZ-Build/118//console

This message is automatically generated.


======================================================================
======================================================================
    Adding comment to Jira.
======================================================================
======================================================================


Comment added.
272fa6848e081a5dd3e6c14498dc4020e2646fb7 logged out


======================================================================
======================================================================
    Finished build.
======================================================================
======================================================================


Build step 'Execute shell' marked build as failure
Archiving artifacts
Sending artifact delta relative to PreCommit-TEZ-Build #113
Archived 41 artifacts
Archive block size is 32768
Received 4 blocks and 2497590 bytes
Compression is 5.0%
Took 6.3 sec
[description-setter] Could not determine description.
Recording test results
Email was triggered for: Failure
Sending email for trigger: Failure



###################################################################################
############################## FAILED TESTS (if any) ##############################
All tests passed

Failed: TEZ-900 PreCommit Build #117

Posted by Apache Jenkins Server <je...@builds.apache.org>.
Jira: https://issues.apache.org/jira/browse/TEZ-900
Build: https://builds.apache.org/job/PreCommit-TEZ-Build/117/

###################################################################################
########################## LAST 60 LINES OF THE CONSOLE ###########################
Started by remote host 127.0.0.1
Building remotely on H8 (Mapreduce Falcon Hadoop Pig Zookeeper Tez Hdfs) in workspace /home/jenkins/jenkins-slave/workspace/PreCommit-TEZ-Build
 > git rev-parse --is-inside-work-tree # timeout=10
Fetching changes from the remote Git repository
 > git config remote.origin.url https://git-wip-us.apache.org/repos/asf/tez.git # timeout=10
Cleaning workspace
 > git rev-parse --verify HEAD # timeout=10
Resetting working tree
 > git reset --hard # timeout=10
 > git clean -fdx # timeout=10
Fetching upstream changes from https://git-wip-us.apache.org/repos/asf/tez.git
 > git --version # timeout=10
 > git fetch --tags --progress https://git-wip-us.apache.org/repos/asf/tez.git +refs/heads/*:refs/remotes/origin/*
 > git rev-parse refs/remotes/origin/master^{commit} # timeout=10
 > git rev-parse refs/remotes/origin/origin/master^{commit} # timeout=10
Checking out Revision cfa637a16fa01b197c0310e03ef4a6e19883aaf1 (refs/remotes/origin/master)
 > git config core.sparsecheckout # timeout=10
 > git checkout -f cfa637a16fa01b197c0310e03ef4a6e19883aaf1
 > git rev-list cfa637a16fa01b197c0310e03ef4a6e19883aaf1 # timeout=10
No emails were triggered.
[PreCommit-TEZ-Build] $ /bin/bash /tmp/hudson6260932661111309726.sh
Running in Jenkins mode


======================================================================
======================================================================
    Testing patch for TEZ-900.
======================================================================
======================================================================


HEAD is now at cfa637a TEZ-1895. Vertex reRunning should decrease successfulMembers of VertexGroupInfo (zjffdu)
Previous HEAD position was cfa637a... TEZ-1895. Vertex reRunning should decrease successfulMembers of VertexGroupInfo (zjffdu)
Switched to branch 'master'
Your branch is behind 'origin/master' by 9 commits, and can be fast-forwarded.
  (use "git pull" to update your local branch)
First, rewinding head to replay your work on top of it...
Fast-forwarded master to cfa637a16fa01b197c0310e03ef4a6e19883aaf1.
TEZ-900 is not "Patch Available".  Exiting.


======================================================================
======================================================================
    Finished build.
======================================================================
======================================================================


Archiving artifacts
ERROR: No artifacts found that match the file pattern "patchprocess/*.*". Configuration error?
ERROR: ?patchprocess/*.*? doesn?t match anything, but ?*.*? does. Perhaps that?s what you mean?
Build step 'Archive the artifacts' changed build result to FAILURE
[description-setter] Could not determine description.
Recording test results
Email was triggered for: Failure
Sending email for trigger: Failure



###################################################################################
############################## FAILED TESTS (if any) ##############################
No tests ran.

Failed: TEZ-2018 PreCommit Build #116

Posted by Apache Jenkins Server <je...@builds.apache.org>.
Jira: https://issues.apache.org/jira/browse/TEZ-2018
Build: https://builds.apache.org/job/PreCommit-TEZ-Build/116/

###################################################################################
########################## LAST 60 LINES OF THE CONSOLE ###########################
[...truncated 2608 lines...]




{color:red}-1 overall{color}.  Here are the results of testing the latest attachment
  http://issues.apache.org/jira/secure/attachment/12696216/TEZ-2018.1.patch
  against master revision cfa637a.

    {color:green}+1 @author{color}.  The patch does not contain any @author tags.

    {color:green}+1 tests included{color}.  The patch appears to include 4 new or modified test files.

    {color:green}+1 javac{color}.  The applied patch does not increase the total number of javac compiler warnings.

    {color:green}+1 javadoc{color}.  There were no new javadoc warning messages.

    {color:red}-1 findbugs{color}.  The patch appears to introduce 2 new Findbugs (version 2.0.3) warnings.

    {color:green}+1 release audit{color}.  The applied patch does not increase the total number of release audit warnings.

    {color:green}+1 core tests{color}.  The patch passed unit tests in .

Test results: https://builds.apache.org/job/PreCommit-TEZ-Build/116//testReport/
Findbugs warnings: https://builds.apache.org/job/PreCommit-TEZ-Build/116//artifact/patchprocess/newPatchFindbugsWarningstez-dag.html
Console output: https://builds.apache.org/job/PreCommit-TEZ-Build/116//console

This message is automatically generated.


======================================================================
======================================================================
    Adding comment to Jira.
======================================================================
======================================================================


Comment added.
bfbb031c0f1063a49849942474c91735010e6919 logged out


======================================================================
======================================================================
    Finished build.
======================================================================
======================================================================


Build step 'Execute shell' marked build as failure
Archiving artifacts
Sending artifact delta relative to PreCommit-TEZ-Build #113
Archived 41 artifacts
Archive block size is 32768
Received 4 blocks and 2513762 bytes
Compression is 5.0%
Took 2.8 sec
[description-setter] Could not determine description.
Recording test results
Email was triggered for: Failure
Sending email for trigger: Failure



###################################################################################
############################## FAILED TESTS (if any) ##############################
All tests passed

Failed: TEZ-2023 PreCommit Build #115

Posted by Apache Jenkins Server <je...@builds.apache.org>.
Jira: https://issues.apache.org/jira/browse/TEZ-2023
Build: https://builds.apache.org/job/PreCommit-TEZ-Build/115/

###################################################################################
########################## LAST 60 LINES OF THE CONSOLE ###########################
[...truncated 2597 lines...]


{color:red}-1 overall{color}.  Here are the results of testing the latest attachment
  http://issues.apache.org/jira/secure/attachment/12696183/TEZ-2023.2.patch
  against master revision cfa637a.

    {color:green}+1 @author{color}.  The patch does not contain any @author tags.

    {color:red}-1 tests included{color}.  The patch doesn't appear to include any new or modified tests.
                        Please justify why no new tests are needed for this patch.
                        Also please list what manual steps were performed to verify this patch.

    {color:green}+1 javac{color}.  The applied patch does not increase the total number of javac compiler warnings.

    {color:green}+1 javadoc{color}.  There were no new javadoc warning messages.

    {color:red}-1 findbugs{color}.  The patch appears to introduce 1 new Findbugs (version 2.0.3) warnings.

    {color:green}+1 release audit{color}.  The applied patch does not increase the total number of release audit warnings.

    {color:green}+1 core tests{color}.  The patch passed unit tests in .

Test results: https://builds.apache.org/job/PreCommit-TEZ-Build/115//testReport/
Findbugs warnings: https://builds.apache.org/job/PreCommit-TEZ-Build/115//artifact/patchprocess/newPatchFindbugsWarningstez-runtime-library.html
Console output: https://builds.apache.org/job/PreCommit-TEZ-Build/115//console

This message is automatically generated.


======================================================================
======================================================================
    Adding comment to Jira.
======================================================================
======================================================================


Comment added.
0c906da73553154a53c1b5f16918e802d8672863 logged out


======================================================================
======================================================================
    Finished build.
======================================================================
======================================================================


Build step 'Execute shell' marked build as failure
Archiving artifacts
Sending artifact delta relative to PreCommit-TEZ-Build #113
Archived 41 artifacts
Archive block size is 32768
Received 4 blocks and 2507690 bytes
Compression is 5.0%
Took 1.2 sec
[description-setter] Could not determine description.
Recording test results
Email was triggered for: Failure
Sending email for trigger: Failure



###################################################################################
############################## FAILED TESTS (if any) ##############################
All tests passed