You are viewing a plain text version of this content. The canonical link for it is here.
Posted to solr-dev@lucene.apache.org by Apache Hudson Server <hu...@hudson.zones.apache.org> on 2008/02/22 09:14:21 UTC
Build failed in Hudson: Solr-trunk #356
See http://hudson.zones.apache.org/hudson/job/Solr-trunk/356/changes
Changes:
[hossman] SOLR-127: HTTP Caching awareness
[gsingers] fixed typo on FIRST
------------------------------------------
[...truncated 1141 lines...]
AU client/ruby/solr-ruby/lib/solr/request/standard.rb
A client/ruby/solr-ruby/lib/solr/request/delete.rb
AU client/ruby/solr-ruby/lib/solr/request/index_info.rb
A client/ruby/solr-ruby/lib/solr/request/update.rb
A client/ruby/solr-ruby/lib/solr/request/dismax.rb
AU client/ruby/solr-ruby/lib/solr/request/modify_document.rb
A client/ruby/solr-ruby/lib/solr/request/add_document.rb
A client/ruby/solr-ruby/lib/solr/request/commit.rb
A client/ruby/solr-ruby/lib/solr/request/base.rb
AU client/ruby/solr-ruby/lib/solr/request.rb
A client/ruby/solr-ruby/lib/solr/response
A client/ruby/solr-ruby/lib/solr/response/ping.rb
A client/ruby/solr-ruby/lib/solr/response/spellcheck.rb
AU client/ruby/solr-ruby/lib/solr/response/select.rb
AU client/ruby/solr-ruby/lib/solr/response/optimize.rb
A client/ruby/solr-ruby/lib/solr/response/standard.rb
A client/ruby/solr-ruby/lib/solr/response/xml.rb
A client/ruby/solr-ruby/lib/solr/response/ruby.rb
A client/ruby/solr-ruby/lib/solr/response/delete.rb
AU client/ruby/solr-ruby/lib/solr/response/index_info.rb
A client/ruby/solr-ruby/lib/solr/response/dismax.rb
AU client/ruby/solr-ruby/lib/solr/response/modify_document.rb
A client/ruby/solr-ruby/lib/solr/response/add_document.rb
A client/ruby/solr-ruby/lib/solr/response/commit.rb
A client/ruby/solr-ruby/lib/solr/response/base.rb
AU client/ruby/solr-ruby/lib/solr.rb
A client/ruby/solr-ruby/CHANGES.yml
A client/ruby/solr-ruby/README
A client/ruby/solr-ruby/examples
A client/ruby/solr-ruby/examples/marc
AU client/ruby/solr-ruby/examples/marc/marc_importer.rb
A client/ruby/solr-ruby/examples/delicious_library
A client/ruby/solr-ruby/examples/delicious_library/sample_export.txt
AU client/ruby/solr-ruby/examples/delicious_library/dl_importer.rb
A client/ruby/solr-ruby/examples/tang
AU client/ruby/solr-ruby/examples/tang/tang_importer.rb
U
At revision 630114
[trunk] $ /export/home/hudson/tools/ant/latest/bin/ant -Dversion=$BUILD_ID -Dtest.junit.output.format=xml nightly
Buildfile: build.xml
init-forrest-entities:
[mkdir] Created dir: http://hudson.zones.apache.org/hudson/job/Solr-trunk/ws/trunk/build
compile-common:
[mkdir] Created dir: http://hudson.zones.apache.org/hudson/job/Solr-trunk/ws/trunk/build/common
[javac] Compiling 31 source files to http://hudson.zones.apache.org/hudson/job/Solr-trunk/ws/trunk/build/common
[javac] Note: Some input files use unchecked or unsafe operations.
[javac] Note: Recompile with -Xlint:unchecked for details.
compile:
[mkdir] Created dir: http://hudson.zones.apache.org/hudson/job/Solr-trunk/ws/trunk/build/core
[javac] Compiling 279 source files to http://hudson.zones.apache.org/hudson/job/Solr-trunk/ws/trunk/build/core
[javac] Note: Some input files use or override a deprecated API.
[javac] Note: Recompile with -Xlint:deprecation for details.
[javac] Note: Some input files use unchecked or unsafe operations.
[javac] Note: Recompile with -Xlint:unchecked for details.
compile-solrj-core:
[mkdir] Created dir: http://hudson.zones.apache.org/hudson/job/Solr-trunk/ws/trunk/build/client/solrj
[javac] Compiling 22 source files to http://hudson.zones.apache.org/hudson/job/Solr-trunk/ws/trunk/build/client/solrj
[javac] Note: http://hudson.zones.apache.org/hudson/job/Solr-trunk/ws/trunk/client/java/solrj/src/org/apache/solr/client/solrj/impl/CommonsHttpSolrServer.java uses or overrides a deprecated API.
[javac] Note: Recompile with -Xlint:deprecation for details.
compile-solrj:
[javac] Compiling 2 source files to http://hudson.zones.apache.org/hudson/job/Solr-trunk/ws/trunk/build/client/solrj
compileTests:
[mkdir] Created dir: http://hudson.zones.apache.org/hudson/job/Solr-trunk/ws/trunk/build/tests
[javac] Compiling 82 source files to http://hudson.zones.apache.org/hudson/job/Solr-trunk/ws/trunk/build/tests
[javac] Note: Some input files use or override a deprecated API.
[javac] Note: Recompile with -Xlint:deprecation for details.
[javac] Note: Some input files use unchecked or unsafe operations.
[javac] Note: Recompile with -Xlint:unchecked for details.
junit:
[mkdir] Created dir: http://hudson.zones.apache.org/hudson/job/Solr-trunk/ws/trunk/build/test-results
[junit] Running org.apache.solr.BasicFunctionalityTest
[junit] Tests run: 25, Failures: 0, Errors: 0, Time elapsed: 36.626 sec
[junit] Running org.apache.solr.ConvertedLegacyTest
[junit] Tests run: 1, Failures: 0, Errors: 0, Time elapsed: 11.433 sec
[junit] Running org.apache.solr.DisMaxRequestHandlerTest
[junit] Tests run: 3, Failures: 0, Errors: 0, Time elapsed: 7.364 sec
[junit] Running org.apache.solr.EchoParamsTest
[junit] Tests run: 4, Failures: 0, Errors: 0, Time elapsed: 2.782 sec
[junit] Running org.apache.solr.OutputWriterTest
[junit] Tests run: 3, Failures: 0, Errors: 0, Time elapsed: 3.609 sec
[junit] Running org.apache.solr.SampleTest
[junit] Tests run: 2, Failures: 0, Errors: 0, Time elapsed: 2.164 sec
[junit] Running org.apache.solr.analysis.HTMLStripReaderTest
[junit] Tests run: 9, Failures: 0, Errors: 0, Time elapsed: 0.968 sec
[junit] Running org.apache.solr.analysis.TestBufferedTokenStream
[junit] Tests run: 2, Failures: 0, Errors: 0, Time elapsed: 1.034 sec
[junit] Running org.apache.solr.analysis.TestCapitalizationFilter
[junit] Tests run: 1, Failures: 0, Errors: 0, Time elapsed: 0.958 sec
[junit] Running org.apache.solr.analysis.TestHyphenatedWordsFilter
[junit] Tests run: 1, Failures: 0, Errors: 0, Time elapsed: 0.897 sec
[junit] Running org.apache.solr.analysis.TestKeepWordFilter
[junit] Tests run: 1, Failures: 0, Errors: 0, Time elapsed: 0.92 sec
[junit] Running org.apache.solr.analysis.TestPatternReplaceFilter
[junit] Tests run: 5, Failures: 0, Errors: 0, Time elapsed: 1.768 sec
[junit] Running org.apache.solr.analysis.TestPatternTokenizerFactory
[junit] Tests run: 1, Failures: 0, Errors: 0, Time elapsed: 1.265 sec
[junit] Running org.apache.solr.analysis.TestPhoneticFilter
[junit] Tests run: 2, Failures: 0, Errors: 0, Time elapsed: 1.803 sec
[junit] Running org.apache.solr.analysis.TestRemoveDuplicatesTokenFilter
[junit] Tests run: 3, Failures: 0, Errors: 0, Time elapsed: 1.287 sec
[junit] Running org.apache.solr.analysis.TestSynonymFilter
[junit] Tests run: 7, Failures: 0, Errors: 0, Time elapsed: 2.26 sec
[junit] Running org.apache.solr.analysis.TestTrimFilter
[junit] Tests run: 1, Failures: 0, Errors: 0, Time elapsed: 1.03 sec
[junit] Running org.apache.solr.analysis.TestWordDelimiterFilter
[junit] Tests run: 4, Failures: 0, Errors: 0, Time elapsed: 7.493 sec
[junit] Running org.apache.solr.common.SolrDocumentTest
[junit] Tests run: 4, Failures: 0, Errors: 0, Time elapsed: 0.649 sec
[junit] Running org.apache.solr.common.params.SolrParamTest
[junit] Tests run: 1, Failures: 0, Errors: 0, Time elapsed: 0.53 sec
[junit] Running org.apache.solr.common.util.ContentStreamTest
[junit] Tests run: 3, Failures: 0, Errors: 0, Time elapsed: 1.152 sec
[junit] Running org.apache.solr.common.util.IteratorChainTest
[junit] Tests run: 7, Failures: 0, Errors: 0, Time elapsed: 0.463 sec
[junit] Running org.apache.solr.common.util.TestXMLEscaping
[junit] Tests run: 7, Failures: 0, Errors: 0, Time elapsed: 0.481 sec
[junit] Running org.apache.solr.core.RequestHandlersTest
[junit] Tests run: 2, Failures: 0, Errors: 0, Time elapsed: 5.831 sec
[junit] Running org.apache.solr.core.ResourceLoaderTest
[junit] Tests run: 2, Failures: 0, Errors: 0, Time elapsed: 0.616 sec
[junit] Running org.apache.solr.core.SolrCoreTest
[junit] Tests run: 1, Failures: 0, Errors: 0, Time elapsed: 4.603 sec
[junit] Running org.apache.solr.core.TestBadConfig
[junit] Tests run: 1, Failures: 0, Errors: 0, Time elapsed: 0.509 sec
[junit] Running org.apache.solr.core.TestConfig
[junit] Tests run: 1, Failures: 0, Errors: 0, Time elapsed: 3.367 sec
[junit] Running org.apache.solr.core.TestQuerySenderListener
[junit] Tests run: 1, Failures: 0, Errors: 0, Time elapsed: 2.993 sec
[junit] Running org.apache.solr.handler.AnalysisRequestHandlerTest
[junit] Tests run: 1, Failures: 0, Errors: 0, Time elapsed: 2.935 sec
[junit] Running org.apache.solr.handler.MoreLikeThisHandlerTest
[junit] Tests run: 1, Failures: 0, Errors: 0, Time elapsed: 3.747 sec
[junit] Running org.apache.solr.handler.SpellCheckerRequestHandlerTest
[junit] Tests run: 5, Failures: 0, Errors: 0, Time elapsed: 4.619 sec
[junit] Running org.apache.solr.handler.StandardRequestHandlerTest
[junit] Tests run: 1, Failures: 0, Errors: 0, Time elapsed: 2.973 sec
[junit] Running org.apache.solr.handler.TestCSVLoader
[junit] Tests run: 4, Failures: 0, Errors: 0, Time elapsed: 10.675 sec
[junit] Running org.apache.solr.handler.XmlUpdateRequestHandlerTest
[junit] Tests run: 1, Failures: 0, Errors: 0, Time elapsed: 2.374 sec
[junit] Running org.apache.solr.handler.admin.SystemInfoHandlerTest
[junit] Tests run: 1, Failures: 0, Errors: 0, Time elapsed: 0.454 sec
[junit] Running org.apache.solr.handler.component.QueryElevationComponentTest
[junit] Tests run: 3, Failures: 0, Errors: 0, Time elapsed: 6.039 sec
[junit] Running org.apache.solr.handler.component.SearchHandlerTest
[junit] Tests run: 1, Failures: 0, Errors: 0, Time elapsed: 2.812 sec
[junit] Running org.apache.solr.highlight.HighlighterTest
[junit] Tests run: 15, Failures: 0, Errors: 0, Time elapsed: 16.263 sec
[junit] Running org.apache.solr.request.JSONWriterTest
[junit] Tests run: 1, Failures: 0, Errors: 0, Time elapsed: 4.586 sec
[junit] Running org.apache.solr.schema.BadIndexSchemaTest
[junit] Tests run: 1, Failures: 0, Errors: 0, Time elapsed: 1.952 sec
[junit] Running org.apache.solr.schema.IndexSchemaTest
[junit] Tests run: 1, Failures: 0, Errors: 0, Time elapsed: 4.774 sec
[junit] Running org.apache.solr.schema.NotRequiredUniqueKeyTest
[junit] Tests run: 1, Failures: 0, Errors: 0, Time elapsed: 1.855 sec
[junit] Running org.apache.solr.schema.RequiredFieldsTest
[junit] Tests run: 3, Failures: 0, Errors: 0, Time elapsed: 7.227 sec
[junit] Running org.apache.solr.schema.UUIDFieldTest
[junit] Tests run: 1, Failures: 0, Errors: 0, Time elapsed: 0.696 sec
[junit] Running org.apache.solr.search.TestDocSet
[junit] Tests run: 1, Failures: 0, Errors: 0, Time elapsed: 1.037 sec
[junit] Running org.apache.solr.search.TestQueryTypes
[junit] Tests run: 1, Failures: 0, Errors: 0, Time elapsed: 2.691 sec
[junit] Running org.apache.solr.search.TestQueryUtils
[junit] Tests run: 1, Failures: 0, Errors: 0, Time elapsed: 3.538 sec
[junit] Running org.apache.solr.search.function.TestFunctionQuery
[junit] Tests run: 2, Failures: 0, Errors: 0, Time elapsed: 5.689 sec
[junit] Running org.apache.solr.servlet.CacheHeaderTest
[junit] Tests run: 3, Failures: 0, Errors: 1, Time elapsed: 7.537 sec
[junit] 2008-02-22 08:12:48.447::INFO: Shutdown hook executing
[junit] 2008-02-22 08:12:48.448::INFO: Shutdown hook complete
[junit] 2008-02-22 08:12:49.454::INFO: Shutdown hook complete
[junit] 2008-02-22 08:12:50.464::INFO: Shutdown hook complete
[junit] Test org.apache.solr.servlet.CacheHeaderTest FAILED
[junit] Running org.apache.solr.servlet.DirectSolrConnectionTest
[junit] Tests run: 2, Failures: 0, Errors: 0, Time elapsed: 1.744 sec
[junit] Running org.apache.solr.servlet.NoCacheHeaderTest
[junit] Tests run: 3, Failures: 0, Errors: 1, Time elapsed: 6.994 sec
[junit] 2008-02-22 08:13:01.546::INFO: Shutdown hook executing
[junit] 2008-02-22 08:13:01.546::INFO: Shutdown hook complete
[junit] 2008-02-22 08:13:02.553::INFO: Shutdown hook complete
[junit] 2008-02-22 08:13:03.563::INFO: Shutdown hook complete
[junit] Test org.apache.solr.servlet.NoCacheHeaderTest FAILED
[junit] Running org.apache.solr.servlet.SolrRequestParserTest
[junit] Tests run: 4, Failures: 0, Errors: 0, Time elapsed: 5.436 sec
[junit] Running org.apache.solr.update.AutoCommitTest
[junit] Tests run: 3, Failures: 0, Errors: 0, Time elapsed: 6.734 sec
[junit] Running org.apache.solr.update.DirectUpdateHandlerTest
[junit] Tests run: 1, Failures: 0, Errors: 0, Time elapsed: 2.3 sec
[junit] Running org.apache.solr.update.DocumentBuilderTest
[junit] Tests run: 2, Failures: 0, Errors: 0, Time elapsed: 3.02 sec
[junit] Running org.apache.solr.update.processor.UpdateRequestProcessorFactoryTest
[junit] Tests run: 1, Failures: 0, Errors: 0, Time elapsed: 2.262 sec
[junit] Running org.apache.solr.util.DateMathParserTest
[junit] Tests run: 7, Failures: 0, Errors: 0, Time elapsed: 0.471 sec
[junit] Running org.apache.solr.util.SolrPluginUtilsTest
[junit] Tests run: 5, Failures: 0, Errors: 0, Time elapsed: 5.202 sec
[junit] Running org.apache.solr.util.TestCharArrayMap
[junit] Tests run: 2, Failures: 0, Errors: 0, Time elapsed: 0.593 sec
[junit] Running org.apache.solr.util.TestOpenBitSet
[junit] Tests run: 3, Failures: 0, Errors: 0, Time elapsed: 1.305 sec
[junit] Running org.apache.solr.util.TestUtils
[junit] Tests run: 1, Failures: 0, Errors: 0, Time elapsed: 0.393 sec
[junit] Running org.apache.solr.client.solrj.SolrExceptionTest
[junit] Tests run: 1, Failures: 0, Errors: 0, Time elapsed: 0.981 sec
[junit] Running org.apache.solr.client.solrj.SolrQueryTest
[junit] Tests run: 1, Failures: 0, Errors: 0, Time elapsed: 0.47 sec
[junit] Running org.apache.solr.client.solrj.embedded.LargeVolumeEmbeddedTest
[junit] Tests run: 1, Failures: 0, Errors: 0, Time elapsed: 3.037 sec
[junit] Running org.apache.solr.client.solrj.embedded.LargeVolumeJettyTest
[junit] Tests run: 1, Failures: 0, Errors: 0, Time elapsed: 3.589 sec
[junit] 2008-02-22 08:13:48.673::INFO: Shutdown hook executing
[junit] 2008-02-22 08:13:48.674::INFO: Shutdown hook complete
[junit] Running org.apache.solr.client.solrj.embedded.MultiCoreEmbeddedTest
[junit] Tests run: 1, Failures: 0, Errors: 0, Time elapsed: 2.248 sec
[junit] Running org.apache.solr.client.solrj.embedded.MultiCoreExampleJettyTest
[junit] Tests run: 1, Failures: 0, Errors: 0, Time elapsed: 2.954 sec
[junit] 2008-02-22 08:13:56.073::INFO: Shutdown hook executing
[junit] 2008-02-22 08:13:56.075::INFO: Shutdown hook complete
[junit] Running org.apache.solr.client.solrj.embedded.SolrExampleEmbeddedTest
[junit] Tests run: 6, Failures: 0, Errors: 0, Time elapsed: 4.998 sec
[junit] Running org.apache.solr.client.solrj.embedded.SolrExampleJettyTest
[junit] Tests run: 6, Failures: 0, Errors: 0, Time elapsed: 8.268 sec
[junit] 2008-02-22 08:14:11.770::INFO: Shutdown hook executing
[junit] 2008-02-22 08:14:11.770::INFO: Shutdown hook complete
[junit] 2008-02-22 08:14:12.778::INFO: Shutdown hook complete
[junit] 2008-02-22 08:14:13.788::INFO: Shutdown hook complete
[junit] 2008-02-22 08:14:14.798::INFO: Shutdown hook complete
[junit] 2008-02-22 08:14:15.808::INFO: Shutdown hook complete
[junit] 2008-02-22 08:14:16.818::INFO: Shutdown hook complete
[junit] Running org.apache.solr.client.solrj.util.ClientUtilsTest
[junit] Tests run: 1, Failures: 0, Errors: 0, Time elapsed: 0.382 sec
BUILD FAILED
http://hudson.zones.apache.org/hudson/job/Solr-trunk/ws/trunk/build.xml :497: Tests failed!
Total time: 5 minutes 57 seconds
ERROR: No artifacts found that match the file pattern "trunk/dist/*.tgz, trunk/dist/*.zip". Configuration error?
ERROR: 'trunk/dist/*.tgz' doesn't match anything: 'trunk' exists but not 'trunk/dist/*.tgz'
Publishing Javadoc
Recording test results
Hudson build is back to normal: Solr-trunk #358
Posted by Apache Hudson Server <hu...@hudson.zones.apache.org>.
See http://hudson.zones.apache.org/hudson/job/Solr-trunk/358/changes
Build failed in Hudson: Solr-trunk #357
Posted by Apache Hudson Server <hu...@hudson.zones.apache.org>.
See http://hudson.zones.apache.org/hudson/job/Solr-trunk/357/changes
------------------------------------------
[...truncated 1141 lines...]
AU client/ruby/solr-ruby/lib/solr/request/standard.rb
A client/ruby/solr-ruby/lib/solr/request/delete.rb
AU client/ruby/solr-ruby/lib/solr/request/index_info.rb
A client/ruby/solr-ruby/lib/solr/request/update.rb
A client/ruby/solr-ruby/lib/solr/request/dismax.rb
AU client/ruby/solr-ruby/lib/solr/request/modify_document.rb
A client/ruby/solr-ruby/lib/solr/request/add_document.rb
A client/ruby/solr-ruby/lib/solr/request/commit.rb
A client/ruby/solr-ruby/lib/solr/request/base.rb
AU client/ruby/solr-ruby/lib/solr/request.rb
A client/ruby/solr-ruby/lib/solr/response
A client/ruby/solr-ruby/lib/solr/response/ping.rb
A client/ruby/solr-ruby/lib/solr/response/spellcheck.rb
AU client/ruby/solr-ruby/lib/solr/response/select.rb
AU client/ruby/solr-ruby/lib/solr/response/optimize.rb
A client/ruby/solr-ruby/lib/solr/response/standard.rb
A client/ruby/solr-ruby/lib/solr/response/xml.rb
A client/ruby/solr-ruby/lib/solr/response/ruby.rb
A client/ruby/solr-ruby/lib/solr/response/delete.rb
AU client/ruby/solr-ruby/lib/solr/response/index_info.rb
A client/ruby/solr-ruby/lib/solr/response/dismax.rb
AU client/ruby/solr-ruby/lib/solr/response/modify_document.rb
A client/ruby/solr-ruby/lib/solr/response/add_document.rb
A client/ruby/solr-ruby/lib/solr/response/commit.rb
A client/ruby/solr-ruby/lib/solr/response/base.rb
AU client/ruby/solr-ruby/lib/solr.rb
A client/ruby/solr-ruby/CHANGES.yml
A client/ruby/solr-ruby/README
A client/ruby/solr-ruby/examples
A client/ruby/solr-ruby/examples/marc
AU client/ruby/solr-ruby/examples/marc/marc_importer.rb
A client/ruby/solr-ruby/examples/delicious_library
A client/ruby/solr-ruby/examples/delicious_library/sample_export.txt
AU client/ruby/solr-ruby/examples/delicious_library/dl_importer.rb
A client/ruby/solr-ruby/examples/tang
AU client/ruby/solr-ruby/examples/tang/tang_importer.rb
U
At revision 630410
no change for http://svn.apache.org/repos/asf/lucene/solr/trunk since the previous build
[trunk] $ /export/home/hudson/tools/ant/latest/bin/ant -Dversion=$BUILD_ID -Dtest.junit.output.format=xml nightly
Buildfile: build.xml
init-forrest-entities:
[mkdir] Created dir: http://hudson.zones.apache.org/hudson/job/Solr-trunk/ws/trunk/build
compile-common:
[mkdir] Created dir: http://hudson.zones.apache.org/hudson/job/Solr-trunk/ws/trunk/build/common
[javac] Compiling 31 source files to http://hudson.zones.apache.org/hudson/job/Solr-trunk/ws/trunk/build/common
[javac] Note: Some input files use unchecked or unsafe operations.
[javac] Note: Recompile with -Xlint:unchecked for details.
compile:
[mkdir] Created dir: http://hudson.zones.apache.org/hudson/job/Solr-trunk/ws/trunk/build/core
[javac] Compiling 279 source files to http://hudson.zones.apache.org/hudson/job/Solr-trunk/ws/trunk/build/core
[javac] Note: Some input files use or override a deprecated API.
[javac] Note: Recompile with -Xlint:deprecation for details.
[javac] Note: Some input files use unchecked or unsafe operations.
[javac] Note: Recompile with -Xlint:unchecked for details.
compile-solrj-core:
[mkdir] Created dir: http://hudson.zones.apache.org/hudson/job/Solr-trunk/ws/trunk/build/client/solrj
[javac] Compiling 22 source files to http://hudson.zones.apache.org/hudson/job/Solr-trunk/ws/trunk/build/client/solrj
[javac] Note: http://hudson.zones.apache.org/hudson/job/Solr-trunk/ws/trunk/client/java/solrj/src/org/apache/solr/client/solrj/impl/CommonsHttpSolrServer.java uses or overrides a deprecated API.
[javac] Note: Recompile with -Xlint:deprecation for details.
compile-solrj:
[javac] Compiling 2 source files to http://hudson.zones.apache.org/hudson/job/Solr-trunk/ws/trunk/build/client/solrj
compileTests:
[mkdir] Created dir: http://hudson.zones.apache.org/hudson/job/Solr-trunk/ws/trunk/build/tests
[javac] Compiling 82 source files to http://hudson.zones.apache.org/hudson/job/Solr-trunk/ws/trunk/build/tests
[javac] Note: Some input files use or override a deprecated API.
[javac] Note: Recompile with -Xlint:deprecation for details.
[javac] Note: Some input files use unchecked or unsafe operations.
[javac] Note: Recompile with -Xlint:unchecked for details.
junit:
[mkdir] Created dir: http://hudson.zones.apache.org/hudson/job/Solr-trunk/ws/trunk/build/test-results
[junit] Running org.apache.solr.BasicFunctionalityTest
[junit] Tests run: 25, Failures: 0, Errors: 0, Time elapsed: 27.187 sec
[junit] Running org.apache.solr.ConvertedLegacyTest
[junit] Tests run: 1, Failures: 0, Errors: 0, Time elapsed: 13.415 sec
[junit] Running org.apache.solr.DisMaxRequestHandlerTest
[junit] Tests run: 3, Failures: 0, Errors: 0, Time elapsed: 10.316 sec
[junit] Running org.apache.solr.EchoParamsTest
[junit] Tests run: 4, Failures: 0, Errors: 0, Time elapsed: 3.399 sec
[junit] Running org.apache.solr.OutputWriterTest
[junit] Tests run: 3, Failures: 0, Errors: 0, Time elapsed: 2.922 sec
[junit] Running org.apache.solr.SampleTest
[junit] Tests run: 2, Failures: 0, Errors: 0, Time elapsed: 2.654 sec
[junit] Running org.apache.solr.analysis.HTMLStripReaderTest
[junit] Tests run: 9, Failures: 0, Errors: 0, Time elapsed: 1.149 sec
[junit] Running org.apache.solr.analysis.TestBufferedTokenStream
[junit] Tests run: 2, Failures: 0, Errors: 0, Time elapsed: 1.233 sec
[junit] Running org.apache.solr.analysis.TestCapitalizationFilter
[junit] Tests run: 1, Failures: 0, Errors: 0, Time elapsed: 0.953 sec
[junit] Running org.apache.solr.analysis.TestHyphenatedWordsFilter
[junit] Tests run: 1, Failures: 0, Errors: 0, Time elapsed: 1.015 sec
[junit] Running org.apache.solr.analysis.TestKeepWordFilter
[junit] Tests run: 1, Failures: 0, Errors: 0, Time elapsed: 0.881 sec
[junit] Running org.apache.solr.analysis.TestPatternReplaceFilter
[junit] Tests run: 5, Failures: 0, Errors: 0, Time elapsed: 1.559 sec
[junit] Running org.apache.solr.analysis.TestPatternTokenizerFactory
[junit] Tests run: 1, Failures: 0, Errors: 0, Time elapsed: 0.98 sec
[junit] Running org.apache.solr.analysis.TestPhoneticFilter
[junit] Tests run: 2, Failures: 0, Errors: 0, Time elapsed: 1.239 sec
[junit] Running org.apache.solr.analysis.TestRemoveDuplicatesTokenFilter
[junit] Tests run: 3, Failures: 0, Errors: 0, Time elapsed: 1.2 sec
[junit] Running org.apache.solr.analysis.TestSynonymFilter
[junit] Tests run: 7, Failures: 0, Errors: 0, Time elapsed: 1.854 sec
[junit] Running org.apache.solr.analysis.TestTrimFilter
[junit] Tests run: 1, Failures: 0, Errors: 0, Time elapsed: 1.398 sec
[junit] Running org.apache.solr.analysis.TestWordDelimiterFilter
[junit] Tests run: 4, Failures: 0, Errors: 0, Time elapsed: 6.691 sec
[junit] Running org.apache.solr.common.SolrDocumentTest
[junit] Tests run: 4, Failures: 0, Errors: 0, Time elapsed: 0.489 sec
[junit] Running org.apache.solr.common.params.SolrParamTest
[junit] Tests run: 1, Failures: 0, Errors: 0, Time elapsed: 0.479 sec
[junit] Running org.apache.solr.common.util.ContentStreamTest
[junit] Tests run: 3, Failures: 0, Errors: 0, Time elapsed: 0.586 sec
[junit] Running org.apache.solr.common.util.IteratorChainTest
[junit] Tests run: 7, Failures: 0, Errors: 0, Time elapsed: 0.579 sec
[junit] Running org.apache.solr.common.util.TestXMLEscaping
[junit] Tests run: 7, Failures: 0, Errors: 0, Time elapsed: 0.498 sec
[junit] Running org.apache.solr.core.RequestHandlersTest
[junit] Tests run: 2, Failures: 0, Errors: 0, Time elapsed: 4.388 sec
[junit] Running org.apache.solr.core.ResourceLoaderTest
[junit] Tests run: 2, Failures: 0, Errors: 0, Time elapsed: 0.44 sec
[junit] Running org.apache.solr.core.SolrCoreTest
[junit] Tests run: 1, Failures: 0, Errors: 0, Time elapsed: 2.575 sec
[junit] Running org.apache.solr.core.TestBadConfig
[junit] Tests run: 1, Failures: 0, Errors: 0, Time elapsed: 0.618 sec
[junit] Running org.apache.solr.core.TestConfig
[junit] Tests run: 1, Failures: 0, Errors: 0, Time elapsed: 3.024 sec
[junit] Running org.apache.solr.core.TestQuerySenderListener
[junit] Tests run: 1, Failures: 0, Errors: 0, Time elapsed: 2.335 sec
[junit] Running org.apache.solr.handler.AnalysisRequestHandlerTest
[junit] Tests run: 1, Failures: 0, Errors: 0, Time elapsed: 2.44 sec
[junit] Running org.apache.solr.handler.MoreLikeThisHandlerTest
[junit] Tests run: 1, Failures: 0, Errors: 0, Time elapsed: 2.472 sec
[junit] Running org.apache.solr.handler.SpellCheckerRequestHandlerTest
[junit] Tests run: 5, Failures: 0, Errors: 0, Time elapsed: 4.22 sec
[junit] Running org.apache.solr.handler.StandardRequestHandlerTest
[junit] Tests run: 1, Failures: 0, Errors: 0, Time elapsed: 2.853 sec
[junit] Running org.apache.solr.handler.TestCSVLoader
[junit] Tests run: 4, Failures: 0, Errors: 0, Time elapsed: 9.117 sec
[junit] Running org.apache.solr.handler.XmlUpdateRequestHandlerTest
[junit] Tests run: 1, Failures: 0, Errors: 0, Time elapsed: 2.6 sec
[junit] Running org.apache.solr.handler.admin.SystemInfoHandlerTest
[junit] Tests run: 1, Failures: 0, Errors: 0, Time elapsed: 0.438 sec
[junit] Running org.apache.solr.handler.component.QueryElevationComponentTest
[junit] Tests run: 3, Failures: 0, Errors: 0, Time elapsed: 7.788 sec
[junit] Running org.apache.solr.handler.component.SearchHandlerTest
[junit] Tests run: 1, Failures: 0, Errors: 0, Time elapsed: 4.303 sec
[junit] Running org.apache.solr.highlight.HighlighterTest
[junit] Tests run: 15, Failures: 0, Errors: 0, Time elapsed: 18.86 sec
[junit] Running org.apache.solr.request.JSONWriterTest
[junit] Tests run: 1, Failures: 0, Errors: 0, Time elapsed: 2.958 sec
[junit] Running org.apache.solr.schema.BadIndexSchemaTest
[junit] Tests run: 1, Failures: 0, Errors: 0, Time elapsed: 1.971 sec
[junit] Running org.apache.solr.schema.IndexSchemaTest
[junit] Tests run: 1, Failures: 0, Errors: 0, Time elapsed: 2.89 sec
[junit] Running org.apache.solr.schema.NotRequiredUniqueKeyTest
[junit] Tests run: 1, Failures: 0, Errors: 0, Time elapsed: 1.718 sec
[junit] Running org.apache.solr.schema.RequiredFieldsTest
[junit] Tests run: 3, Failures: 0, Errors: 0, Time elapsed: 5.03 sec
[junit] Running org.apache.solr.schema.UUIDFieldTest
[junit] Tests run: 1, Failures: 0, Errors: 0, Time elapsed: 0.766 sec
[junit] Running org.apache.solr.search.TestDocSet
[junit] Tests run: 1, Failures: 0, Errors: 0, Time elapsed: 0.849 sec
[junit] Running org.apache.solr.search.TestQueryTypes
[junit] Tests run: 1, Failures: 0, Errors: 0, Time elapsed: 2.235 sec
[junit] Running org.apache.solr.search.TestQueryUtils
[junit] Tests run: 1, Failures: 0, Errors: 0, Time elapsed: 3.052 sec
[junit] Running org.apache.solr.search.function.TestFunctionQuery
[junit] Tests run: 2, Failures: 0, Errors: 0, Time elapsed: 4.441 sec
[junit] Running org.apache.solr.servlet.CacheHeaderTest
[junit] Tests run: 3, Failures: 0, Errors: 1, Time elapsed: 7.917 sec
[junit] 2008-02-23 08:13:35.513::INFO: Shutdown hook executing
[junit] 2008-02-23 08:13:35.513::INFO: Shutdown hook complete
[junit] 2008-02-23 08:13:36.516::INFO: Shutdown hook complete
[junit] 2008-02-23 08:13:37.526::INFO: Shutdown hook complete
[junit] Test org.apache.solr.servlet.CacheHeaderTest FAILED
[junit] Running org.apache.solr.servlet.DirectSolrConnectionTest
[junit] Tests run: 2, Failures: 0, Errors: 0, Time elapsed: 2.044 sec
[junit] Running org.apache.solr.servlet.NoCacheHeaderTest
[junit] Tests run: 3, Failures: 0, Errors: 0, Time elapsed: 7.425 sec
[junit] 2008-02-23 08:13:49.587::INFO: Shutdown hook executing
[junit] 2008-02-23 08:13:49.587::INFO: Shutdown hook complete
[junit] 2008-02-23 08:13:50.595::INFO: Shutdown hook complete
[junit] 2008-02-23 08:13:51.605::INFO: Shutdown hook complete
[junit] Running org.apache.solr.servlet.SolrRequestParserTest
[junit] Tests run: 4, Failures: 0, Errors: 0, Time elapsed: 5.246 sec
[junit] Running org.apache.solr.update.AutoCommitTest
[junit] Tests run: 3, Failures: 0, Errors: 0, Time elapsed: 7.205 sec
[junit] Running org.apache.solr.update.DirectUpdateHandlerTest
[junit] Tests run: 1, Failures: 0, Errors: 0, Time elapsed: 2.562 sec
[junit] Running org.apache.solr.update.DocumentBuilderTest
[junit] Tests run: 2, Failures: 0, Errors: 0, Time elapsed: 3.279 sec
[junit] Running org.apache.solr.update.processor.UpdateRequestProcessorFactoryTest
[junit] Tests run: 1, Failures: 0, Errors: 0, Time elapsed: 2.328 sec
[junit] Running org.apache.solr.util.DateMathParserTest
[junit] Tests run: 7, Failures: 0, Errors: 0, Time elapsed: 0.516 sec
[junit] Running org.apache.solr.util.SolrPluginUtilsTest
[junit] Tests run: 5, Failures: 0, Errors: 0, Time elapsed: 6.252 sec
[junit] Running org.apache.solr.util.TestCharArrayMap
[junit] Tests run: 2, Failures: 0, Errors: 0, Time elapsed: 0.587 sec
[junit] Running org.apache.solr.util.TestOpenBitSet
[junit] Tests run: 3, Failures: 0, Errors: 0, Time elapsed: 1.248 sec
[junit] Running org.apache.solr.util.TestUtils
[junit] Tests run: 1, Failures: 0, Errors: 0, Time elapsed: 0.422 sec
[junit] Running org.apache.solr.client.solrj.SolrExceptionTest
[junit] Tests run: 1, Failures: 0, Errors: 0, Time elapsed: 1.619 sec
[junit] Running org.apache.solr.client.solrj.SolrQueryTest
[junit] Tests run: 1, Failures: 0, Errors: 0, Time elapsed: 0.449 sec
[junit] Running org.apache.solr.client.solrj.embedded.LargeVolumeEmbeddedTest
[junit] Tests run: 1, Failures: 0, Errors: 0, Time elapsed: 2.746 sec
[junit] Running org.apache.solr.client.solrj.embedded.LargeVolumeJettyTest
[junit] Tests run: 1, Failures: 0, Errors: 0, Time elapsed: 4.24 sec
[junit] 2008-02-23 08:14:39.426::INFO: Shutdown hook executing
[junit] 2008-02-23 08:14:39.427::INFO: Shutdown hook complete
[junit] Running org.apache.solr.client.solrj.embedded.MultiCoreEmbeddedTest
[junit] Tests run: 1, Failures: 0, Errors: 0, Time elapsed: 2.505 sec
[junit] Running org.apache.solr.client.solrj.embedded.MultiCoreExampleJettyTest
[junit] Tests run: 1, Failures: 0, Errors: 0, Time elapsed: 3.224 sec
[junit] 2008-02-23 08:14:47.462::INFO: Shutdown hook executing
[junit] 2008-02-23 08:14:47.463::INFO: Shutdown hook complete
[junit] Running org.apache.solr.client.solrj.embedded.SolrExampleEmbeddedTest
[junit] Tests run: 6, Failures: 0, Errors: 0, Time elapsed: 5.551 sec
[junit] Running org.apache.solr.client.solrj.embedded.SolrExampleJettyTest
[junit] Tests run: 6, Failures: 0, Errors: 0, Time elapsed: 8.707 sec
[junit] 2008-02-23 08:15:04.407::INFO: Shutdown hook executing
[junit] 2008-02-23 08:15:04.407::INFO: Shutdown hook complete
[junit] 2008-02-23 08:15:05.409::INFO: Shutdown hook complete
[junit] 2008-02-23 08:15:06.419::INFO: Shutdown hook complete
[junit] 2008-02-23 08:15:07.419::INFO: Shutdown hook complete
[junit] 2008-02-23 08:15:08.429::INFO: Shutdown hook complete
[junit] 2008-02-23 08:15:09.439::INFO: Shutdown hook complete
[junit] Running org.apache.solr.client.solrj.util.ClientUtilsTest
[junit] Tests run: 1, Failures: 0, Errors: 0, Time elapsed: 0.432 sec
BUILD FAILED
http://hudson.zones.apache.org/hudson/job/Solr-trunk/ws/trunk/build.xml :497: Tests failed!
Total time: 5 minutes 31 seconds
ERROR: No artifacts found that match the file pattern "trunk/dist/*.tgz, trunk/dist/*.zip". Configuration error?
ERROR: 'trunk/dist/*.tgz' doesn't match anything: 'trunk' exists but not 'trunk/dist/*.tgz'
Publishing Javadoc
Recording test results
RE: Build failed in Hudson: Solr-trunk #356
Posted by Chris Hostetter <ho...@fucit.org>.
: @Hossman:
: You should set a higher value for the timeout in
: CacheHeaderTestBase.java (line 72). 5ms might be too short for a busy
: server.
done ... it would be nice if all of these tests that spin up a server had
used a common test utility class for generating the CommonsHttpSolrServer
with timeouts taken from systemproperties with long defaults
(which would assume a lenient test environment) ... but that's a smaller
fish to fry on another day.
-Hoss
RE: Build failed in Hudson: Solr-trunk #356
Posted by "Peuss, Thomas" <Th...@ibxeurope.com>.
Hi!
@Hossman:
You should set a higher value for the timeout in
CacheHeaderTestBase.java (line 72). 5ms might be too short for a busy
server.
CU
Thomas
-----Original Message-----
From: Apache Hudson Server [mailto:hudson@hudson.zones.apache.org]
Sent: Friday, February 22, 2008 9:14 AM
To: solr-dev@lucene.apache.org
Subject: Build failed in Hudson: Solr-trunk #356
See http://hudson.zones.apache.org/hudson/job/Solr-trunk/356/changes
Changes:
[hossman] SOLR-127: HTTP Caching awareness
[gsingers] fixed typo on FIRST
------------------------------------------
[...truncated 1141 lines...]
AU client/ruby/solr-ruby/lib/solr/request/standard.rb
A client/ruby/solr-ruby/lib/solr/request/delete.rb
AU client/ruby/solr-ruby/lib/solr/request/index_info.rb
A client/ruby/solr-ruby/lib/solr/request/update.rb
A client/ruby/solr-ruby/lib/solr/request/dismax.rb
AU client/ruby/solr-ruby/lib/solr/request/modify_document.rb
A client/ruby/solr-ruby/lib/solr/request/add_document.rb
A client/ruby/solr-ruby/lib/solr/request/commit.rb
A client/ruby/solr-ruby/lib/solr/request/base.rb
AU client/ruby/solr-ruby/lib/solr/request.rb
A client/ruby/solr-ruby/lib/solr/response
A client/ruby/solr-ruby/lib/solr/response/ping.rb
A client/ruby/solr-ruby/lib/solr/response/spellcheck.rb
AU client/ruby/solr-ruby/lib/solr/response/select.rb
AU client/ruby/solr-ruby/lib/solr/response/optimize.rb
A client/ruby/solr-ruby/lib/solr/response/standard.rb
A client/ruby/solr-ruby/lib/solr/response/xml.rb
A client/ruby/solr-ruby/lib/solr/response/ruby.rb
A client/ruby/solr-ruby/lib/solr/response/delete.rb
AU client/ruby/solr-ruby/lib/solr/response/index_info.rb
A client/ruby/solr-ruby/lib/solr/response/dismax.rb
AU client/ruby/solr-ruby/lib/solr/response/modify_document.rb
A client/ruby/solr-ruby/lib/solr/response/add_document.rb
A client/ruby/solr-ruby/lib/solr/response/commit.rb
A client/ruby/solr-ruby/lib/solr/response/base.rb
AU client/ruby/solr-ruby/lib/solr.rb
A client/ruby/solr-ruby/CHANGES.yml
A client/ruby/solr-ruby/README
A client/ruby/solr-ruby/examples
A client/ruby/solr-ruby/examples/marc
AU client/ruby/solr-ruby/examples/marc/marc_importer.rb
A client/ruby/solr-ruby/examples/delicious_library
A
client/ruby/solr-ruby/examples/delicious_library/sample_export.txt
AU
client/ruby/solr-ruby/examples/delicious_library/dl_importer.rb
A client/ruby/solr-ruby/examples/tang
AU client/ruby/solr-ruby/examples/tang/tang_importer.rb
U
At revision 630114
[trunk] $ /export/home/hudson/tools/ant/latest/bin/ant
-Dversion=$BUILD_ID -Dtest.junit.output.format=xml nightly
Buildfile: build.xml
init-forrest-entities:
[mkdir] Created dir:
http://hudson.zones.apache.org/hudson/job/Solr-trunk/ws/trunk/build
compile-common:
[mkdir] Created dir:
http://hudson.zones.apache.org/hudson/job/Solr-trunk/ws/trunk/build/comm
on
[javac] Compiling 31 source files to
http://hudson.zones.apache.org/hudson/job/Solr-trunk/ws/trunk/build/comm
on
[javac] Note: Some input files use unchecked or unsafe operations.
[javac] Note: Recompile with -Xlint:unchecked for details.
compile:
[mkdir] Created dir:
http://hudson.zones.apache.org/hudson/job/Solr-trunk/ws/trunk/build/core
[javac] Compiling 279 source files to
http://hudson.zones.apache.org/hudson/job/Solr-trunk/ws/trunk/build/core
[javac] Note: Some input files use or override a deprecated API.
[javac] Note: Recompile with -Xlint:deprecation for details.
[javac] Note: Some input files use unchecked or unsafe operations.
[javac] Note: Recompile with -Xlint:unchecked for details.
compile-solrj-core:
[mkdir] Created dir:
http://hudson.zones.apache.org/hudson/job/Solr-trunk/ws/trunk/build/clie
nt/solrj
[javac] Compiling 22 source files to
http://hudson.zones.apache.org/hudson/job/Solr-trunk/ws/trunk/build/clie
nt/solrj
[javac] Note:
http://hudson.zones.apache.org/hudson/job/Solr-trunk/ws/trunk/client/jav
a/solrj/src/org/apache/solr/client/solrj/impl/CommonsHttpSolrServer.java
uses or overrides a deprecated API.
[javac] Note: Recompile with -Xlint:deprecation for details.
compile-solrj:
[javac] Compiling 2 source files to
http://hudson.zones.apache.org/hudson/job/Solr-trunk/ws/trunk/build/clie
nt/solrj
compileTests:
[mkdir] Created dir:
http://hudson.zones.apache.org/hudson/job/Solr-trunk/ws/trunk/build/test
s
[javac] Compiling 82 source files to
http://hudson.zones.apache.org/hudson/job/Solr-trunk/ws/trunk/build/test
s
[javac] Note: Some input files use or override a deprecated API.
[javac] Note: Recompile with -Xlint:deprecation for details.
[javac] Note: Some input files use unchecked or unsafe operations.
[javac] Note: Recompile with -Xlint:unchecked for details.
junit:
[mkdir] Created dir:
http://hudson.zones.apache.org/hudson/job/Solr-trunk/ws/trunk/build/test
-results
[junit] Running org.apache.solr.BasicFunctionalityTest
[junit] Tests run: 25, Failures: 0, Errors: 0, Time elapsed: 36.626
sec
[junit] Running org.apache.solr.ConvertedLegacyTest
[junit] Tests run: 1, Failures: 0, Errors: 0, Time elapsed: 11.433
sec
[junit] Running org.apache.solr.DisMaxRequestHandlerTest
[junit] Tests run: 3, Failures: 0, Errors: 0, Time elapsed: 7.364
sec
[junit] Running org.apache.solr.EchoParamsTest
[junit] Tests run: 4, Failures: 0, Errors: 0, Time elapsed: 2.782
sec
[junit] Running org.apache.solr.OutputWriterTest
[junit] Tests run: 3, Failures: 0, Errors: 0, Time elapsed: 3.609
sec
[junit] Running org.apache.solr.SampleTest
[junit] Tests run: 2, Failures: 0, Errors: 0, Time elapsed: 2.164
sec
[junit] Running org.apache.solr.analysis.HTMLStripReaderTest
[junit] Tests run: 9, Failures: 0, Errors: 0, Time elapsed: 0.968
sec
[junit] Running org.apache.solr.analysis.TestBufferedTokenStream
[junit] Tests run: 2, Failures: 0, Errors: 0, Time elapsed: 1.034
sec
[junit] Running org.apache.solr.analysis.TestCapitalizationFilter
[junit] Tests run: 1, Failures: 0, Errors: 0, Time elapsed: 0.958
sec
[junit] Running org.apache.solr.analysis.TestHyphenatedWordsFilter
[junit] Tests run: 1, Failures: 0, Errors: 0, Time elapsed: 0.897
sec
[junit] Running org.apache.solr.analysis.TestKeepWordFilter
[junit] Tests run: 1, Failures: 0, Errors: 0, Time elapsed: 0.92 sec
[junit] Running org.apache.solr.analysis.TestPatternReplaceFilter
[junit] Tests run: 5, Failures: 0, Errors: 0, Time elapsed: 1.768
sec
[junit] Running org.apache.solr.analysis.TestPatternTokenizerFactory
[junit] Tests run: 1, Failures: 0, Errors: 0, Time elapsed: 1.265
sec
[junit] Running org.apache.solr.analysis.TestPhoneticFilter
[junit] Tests run: 2, Failures: 0, Errors: 0, Time elapsed: 1.803
sec
[junit] Running
org.apache.solr.analysis.TestRemoveDuplicatesTokenFilter
[junit] Tests run: 3, Failures: 0, Errors: 0, Time elapsed: 1.287
sec
[junit] Running org.apache.solr.analysis.TestSynonymFilter
[junit] Tests run: 7, Failures: 0, Errors: 0, Time elapsed: 2.26 sec
[junit] Running org.apache.solr.analysis.TestTrimFilter
[junit] Tests run: 1, Failures: 0, Errors: 0, Time elapsed: 1.03 sec
[junit] Running org.apache.solr.analysis.TestWordDelimiterFilter
[junit] Tests run: 4, Failures: 0, Errors: 0, Time elapsed: 7.493
sec
[junit] Running org.apache.solr.common.SolrDocumentTest
[junit] Tests run: 4, Failures: 0, Errors: 0, Time elapsed: 0.649
sec
[junit] Running org.apache.solr.common.params.SolrParamTest
[junit] Tests run: 1, Failures: 0, Errors: 0, Time elapsed: 0.53 sec
[junit] Running org.apache.solr.common.util.ContentStreamTest
[junit] Tests run: 3, Failures: 0, Errors: 0, Time elapsed: 1.152
sec
[junit] Running org.apache.solr.common.util.IteratorChainTest
[junit] Tests run: 7, Failures: 0, Errors: 0, Time elapsed: 0.463
sec
[junit] Running org.apache.solr.common.util.TestXMLEscaping
[junit] Tests run: 7, Failures: 0, Errors: 0, Time elapsed: 0.481
sec
[junit] Running org.apache.solr.core.RequestHandlersTest
[junit] Tests run: 2, Failures: 0, Errors: 0, Time elapsed: 5.831
sec
[junit] Running org.apache.solr.core.ResourceLoaderTest
[junit] Tests run: 2, Failures: 0, Errors: 0, Time elapsed: 0.616
sec
[junit] Running org.apache.solr.core.SolrCoreTest
[junit] Tests run: 1, Failures: 0, Errors: 0, Time elapsed: 4.603
sec
[junit] Running org.apache.solr.core.TestBadConfig
[junit] Tests run: 1, Failures: 0, Errors: 0, Time elapsed: 0.509
sec
[junit] Running org.apache.solr.core.TestConfig
[junit] Tests run: 1, Failures: 0, Errors: 0, Time elapsed: 3.367
sec
[junit] Running org.apache.solr.core.TestQuerySenderListener
[junit] Tests run: 1, Failures: 0, Errors: 0, Time elapsed: 2.993
sec
[junit] Running org.apache.solr.handler.AnalysisRequestHandlerTest
[junit] Tests run: 1, Failures: 0, Errors: 0, Time elapsed: 2.935
sec
[junit] Running org.apache.solr.handler.MoreLikeThisHandlerTest
[junit] Tests run: 1, Failures: 0, Errors: 0, Time elapsed: 3.747
sec
[junit] Running
org.apache.solr.handler.SpellCheckerRequestHandlerTest
[junit] Tests run: 5, Failures: 0, Errors: 0, Time elapsed: 4.619
sec
[junit] Running org.apache.solr.handler.StandardRequestHandlerTest
[junit] Tests run: 1, Failures: 0, Errors: 0, Time elapsed: 2.973
sec
[junit] Running org.apache.solr.handler.TestCSVLoader
[junit] Tests run: 4, Failures: 0, Errors: 0, Time elapsed: 10.675
sec
[junit] Running org.apache.solr.handler.XmlUpdateRequestHandlerTest
[junit] Tests run: 1, Failures: 0, Errors: 0, Time elapsed: 2.374
sec
[junit] Running org.apache.solr.handler.admin.SystemInfoHandlerTest
[junit] Tests run: 1, Failures: 0, Errors: 0, Time elapsed: 0.454
sec
[junit] Running
org.apache.solr.handler.component.QueryElevationComponentTest
[junit] Tests run: 3, Failures: 0, Errors: 0, Time elapsed: 6.039
sec
[junit] Running org.apache.solr.handler.component.SearchHandlerTest
[junit] Tests run: 1, Failures: 0, Errors: 0, Time elapsed: 2.812
sec
[junit] Running org.apache.solr.highlight.HighlighterTest
[junit] Tests run: 15, Failures: 0, Errors: 0, Time elapsed: 16.263
sec
[junit] Running org.apache.solr.request.JSONWriterTest
[junit] Tests run: 1, Failures: 0, Errors: 0, Time elapsed: 4.586
sec
[junit] Running org.apache.solr.schema.BadIndexSchemaTest
[junit] Tests run: 1, Failures: 0, Errors: 0, Time elapsed: 1.952
sec
[junit] Running org.apache.solr.schema.IndexSchemaTest
[junit] Tests run: 1, Failures: 0, Errors: 0, Time elapsed: 4.774
sec
[junit] Running org.apache.solr.schema.NotRequiredUniqueKeyTest
[junit] Tests run: 1, Failures: 0, Errors: 0, Time elapsed: 1.855
sec
[junit] Running org.apache.solr.schema.RequiredFieldsTest
[junit] Tests run: 3, Failures: 0, Errors: 0, Time elapsed: 7.227
sec
[junit] Running org.apache.solr.schema.UUIDFieldTest
[junit] Tests run: 1, Failures: 0, Errors: 0, Time elapsed: 0.696
sec
[junit] Running org.apache.solr.search.TestDocSet
[junit] Tests run: 1, Failures: 0, Errors: 0, Time elapsed: 1.037
sec
[junit] Running org.apache.solr.search.TestQueryTypes
[junit] Tests run: 1, Failures: 0, Errors: 0, Time elapsed: 2.691
sec
[junit] Running org.apache.solr.search.TestQueryUtils
[junit] Tests run: 1, Failures: 0, Errors: 0, Time elapsed: 3.538
sec
[junit] Running org.apache.solr.search.function.TestFunctionQuery
[junit] Tests run: 2, Failures: 0, Errors: 0, Time elapsed: 5.689
sec
[junit] Running org.apache.solr.servlet.CacheHeaderTest
[junit] Tests run: 3, Failures: 0, Errors: 1, Time elapsed: 7.537
sec
[junit] 2008-02-22 08:12:48.447::INFO: Shutdown hook executing
[junit] 2008-02-22 08:12:48.448::INFO: Shutdown hook complete
[junit] 2008-02-22 08:12:49.454::INFO: Shutdown hook complete
[junit] 2008-02-22 08:12:50.464::INFO: Shutdown hook complete
[junit] Test org.apache.solr.servlet.CacheHeaderTest FAILED
[junit] Running org.apache.solr.servlet.DirectSolrConnectionTest
[junit] Tests run: 2, Failures: 0, Errors: 0, Time elapsed: 1.744
sec
[junit] Running org.apache.solr.servlet.NoCacheHeaderTest
[junit] Tests run: 3, Failures: 0, Errors: 1, Time elapsed: 6.994
sec
[junit] 2008-02-22 08:13:01.546::INFO: Shutdown hook executing
[junit] 2008-02-22 08:13:01.546::INFO: Shutdown hook complete
[junit] 2008-02-22 08:13:02.553::INFO: Shutdown hook complete
[junit] 2008-02-22 08:13:03.563::INFO: Shutdown hook complete
[junit] Test org.apache.solr.servlet.NoCacheHeaderTest FAILED
[junit] Running org.apache.solr.servlet.SolrRequestParserTest
[junit] Tests run: 4, Failures: 0, Errors: 0, Time elapsed: 5.436
sec
[junit] Running org.apache.solr.update.AutoCommitTest
[junit] Tests run: 3, Failures: 0, Errors: 0, Time elapsed: 6.734
sec
[junit] Running org.apache.solr.update.DirectUpdateHandlerTest
[junit] Tests run: 1, Failures: 0, Errors: 0, Time elapsed: 2.3 sec
[junit] Running org.apache.solr.update.DocumentBuilderTest
[junit] Tests run: 2, Failures: 0, Errors: 0, Time elapsed: 3.02 sec
[junit] Running
org.apache.solr.update.processor.UpdateRequestProcessorFactoryTest
[junit] Tests run: 1, Failures: 0, Errors: 0, Time elapsed: 2.262
sec
[junit] Running org.apache.solr.util.DateMathParserTest
[junit] Tests run: 7, Failures: 0, Errors: 0, Time elapsed: 0.471
sec
[junit] Running org.apache.solr.util.SolrPluginUtilsTest
[junit] Tests run: 5, Failures: 0, Errors: 0, Time elapsed: 5.202
sec
[junit] Running org.apache.solr.util.TestCharArrayMap
[junit] Tests run: 2, Failures: 0, Errors: 0, Time elapsed: 0.593
sec
[junit] Running org.apache.solr.util.TestOpenBitSet
[junit] Tests run: 3, Failures: 0, Errors: 0, Time elapsed: 1.305
sec
[junit] Running org.apache.solr.util.TestUtils
[junit] Tests run: 1, Failures: 0, Errors: 0, Time elapsed: 0.393
sec
[junit] Running org.apache.solr.client.solrj.SolrExceptionTest
[junit] Tests run: 1, Failures: 0, Errors: 0, Time elapsed: 0.981
sec
[junit] Running org.apache.solr.client.solrj.SolrQueryTest
[junit] Tests run: 1, Failures: 0, Errors: 0, Time elapsed: 0.47 sec
[junit] Running
org.apache.solr.client.solrj.embedded.LargeVolumeEmbeddedTest
[junit] Tests run: 1, Failures: 0, Errors: 0, Time elapsed: 3.037
sec
[junit] Running
org.apache.solr.client.solrj.embedded.LargeVolumeJettyTest
[junit] Tests run: 1, Failures: 0, Errors: 0, Time elapsed: 3.589
sec
[junit] 2008-02-22 08:13:48.673::INFO: Shutdown hook executing
[junit] 2008-02-22 08:13:48.674::INFO: Shutdown hook complete
[junit] Running
org.apache.solr.client.solrj.embedded.MultiCoreEmbeddedTest
[junit] Tests run: 1, Failures: 0, Errors: 0, Time elapsed: 2.248
sec
[junit] Running
org.apache.solr.client.solrj.embedded.MultiCoreExampleJettyTest
[junit] Tests run: 1, Failures: 0, Errors: 0, Time elapsed: 2.954
sec
[junit] 2008-02-22 08:13:56.073::INFO: Shutdown hook executing
[junit] 2008-02-22 08:13:56.075::INFO: Shutdown hook complete
[junit] Running
org.apache.solr.client.solrj.embedded.SolrExampleEmbeddedTest
[junit] Tests run: 6, Failures: 0, Errors: 0, Time elapsed: 4.998
sec
[junit] Running
org.apache.solr.client.solrj.embedded.SolrExampleJettyTest
[junit] Tests run: 6, Failures: 0, Errors: 0, Time elapsed: 8.268
sec
[junit] 2008-02-22 08:14:11.770::INFO: Shutdown hook executing
[junit] 2008-02-22 08:14:11.770::INFO: Shutdown hook complete
[junit] 2008-02-22 08:14:12.778::INFO: Shutdown hook complete
[junit] 2008-02-22 08:14:13.788::INFO: Shutdown hook complete
[junit] 2008-02-22 08:14:14.798::INFO: Shutdown hook complete
[junit] 2008-02-22 08:14:15.808::INFO: Shutdown hook complete
[junit] 2008-02-22 08:14:16.818::INFO: Shutdown hook complete
[junit] Running org.apache.solr.client.solrj.util.ClientUtilsTest
[junit] Tests run: 1, Failures: 0, Errors: 0, Time elapsed: 0.382
sec
BUILD FAILED
http://hudson.zones.apache.org/hudson/job/Solr-trunk/ws/trunk/build.xml
:497: Tests failed!
Total time: 5 minutes 57 seconds
ERROR: No artifacts found that match the file pattern "trunk/dist/*.tgz,
trunk/dist/*.zip". Configuration error?
ERROR: 'trunk/dist/*.tgz' doesn't match anything: 'trunk' exists but not
'trunk/dist/*.tgz'
Publishing Javadoc
Recording test results