You are viewing a plain text version of this content. The canonical link for it is here.
Posted to commits@beam.apache.org by Apache Jenkins Server <je...@builds.apache.org> on 2018/04/23 18:18:36 UTC
Build failed in Jenkins: beam_PerformanceTests_MongoDBIO_IT #86
See <https://builds.apache.org/job/beam_PerformanceTests_MongoDBIO_IT/86/display/redirect>
------------------------------------------
[...truncated 122.67 KB...]
at java.lang.Thread.run(Thread.java:745)
Caused by: com.mongodb.MongoTimeoutException: Timed out after 30000 ms while waiting for a server that matches ReadPreferenceServerSelector{readPreference=primary}. Client view of cluster state is {type=UNKNOWN, servers=[{address=104.197.209.208:27017, type=UNKNOWN, state=CONNECTING, exception={com.mongodb.MongoSocketOpenException: Exception opening socket}, caused by {java.net.SocketTimeoutException: connect timed out}}]
at com.mongodb.connection.BaseCluster.createTimeoutException(BaseCluster.java:369)
at com.mongodb.connection.BaseCluster.selectServer(BaseCluster.java:101)
at com.mongodb.binding.ClusterBinding$ClusterBindingConnectionSource.<init>(ClusterBinding.java:75)
at com.mongodb.binding.ClusterBinding$ClusterBindingConnectionSource.<init>(ClusterBinding.java:71)
at com.mongodb.binding.ClusterBinding.getReadConnectionSource(ClusterBinding.java:63)
at com.mongodb.operation.OperationHelper.withConnection(OperationHelper.java:210)
at com.mongodb.operation.FindOperation.execute(FindOperation.java:482)
at com.mongodb.operation.FindOperation.execute(FindOperation.java:79)
at com.mongodb.Mongo.execute(Mongo.java:772)
at com.mongodb.Mongo$2.execute(Mongo.java:759)
at com.mongodb.OperationIterable.iterator(OperationIterable.java:47)
at com.mongodb.FindIterableImpl.iterator(FindIterableImpl.java:143)
at org.apache.beam.sdk.io.mongodb.MongoDbIO$BoundedMongoDbReader.start(MongoDbIO.java:456)
at com.google.cloud.dataflow.worker.WorkerCustomSources$BoundedReaderIterator.start(WorkerCustomSources.java:592)
... 14 more
java.io.IOException: Failed to start reading from source: org.apache.beam.sdk.io.mongodb.MongoDbIO$BoundedMongoDbSource@762f1226
at com.google.cloud.dataflow.worker.WorkerCustomSources$BoundedReaderIterator.start(WorkerCustomSources.java:595)
at com.google.cloud.dataflow.worker.util.common.worker.ReadOperation$SynchronizedReaderIterator.start(ReadOperation.java:360)
at com.google.cloud.dataflow.worker.util.common.worker.ReadOperation.runReadLoop(ReadOperation.java:193)
at com.google.cloud.dataflow.worker.util.common.worker.ReadOperation.start(ReadOperation.java:158)
at com.google.cloud.dataflow.worker.util.common.worker.MapTaskExecutor.execute(MapTaskExecutor.java:75)
at com.google.cloud.dataflow.worker.BatchDataflowWorker.executeWork(BatchDataflowWorker.java:383)
at com.google.cloud.dataflow.worker.BatchDataflowWorker.doWork(BatchDataflowWorker.java:355)
at com.google.cloud.dataflow.worker.BatchDataflowWorker.getAndPerformWork(BatchDataflowWorker.java:286)
at com.google.cloud.dataflow.worker.DataflowBatchWorkerHarness$WorkerThread.doWork(DataflowBatchWorkerHarness.java:134)
at com.google.cloud.dataflow.worker.DataflowBatchWorkerHarness$WorkerThread.call(DataflowBatchWorkerHarness.java:114)
at com.google.cloud.dataflow.worker.DataflowBatchWorkerHarness$WorkerThread.call(DataflowBatchWorkerHarness.java:101)
at java.util.concurrent.FutureTask.run(FutureTask.java:266)
at java.util.concurrent.ThreadPoolExecutor.runWorker(ThreadPoolExecutor.java:1142)
at java.util.concurrent.ThreadPoolExecutor$Worker.run(ThreadPoolExecutor.java:617)
at java.lang.Thread.run(Thread.java:745)
Caused by: com.mongodb.MongoTimeoutException: Timed out after 30000 ms while waiting for a server that matches ReadPreferenceServerSelector{readPreference=primary}. Client view of cluster state is {type=UNKNOWN, servers=[{address=104.197.209.208:27017, type=UNKNOWN, state=CONNECTING, exception={com.mongodb.MongoSocketOpenException: Exception opening socket}, caused by {java.net.SocketTimeoutException: connect timed out}}]
at com.mongodb.connection.BaseCluster.createTimeoutException(BaseCluster.java:369)
at com.mongodb.connection.BaseCluster.selectServer(BaseCluster.java:101)
at com.mongodb.binding.ClusterBinding$ClusterBindingConnectionSource.<init>(ClusterBinding.java:75)
at com.mongodb.binding.ClusterBinding$ClusterBindingConnectionSource.<init>(ClusterBinding.java:71)
at com.mongodb.binding.ClusterBinding.getReadConnectionSource(ClusterBinding.java:63)
at com.mongodb.operation.OperationHelper.withConnection(OperationHelper.java:210)
at com.mongodb.operation.FindOperation.execute(FindOperation.java:482)
at com.mongodb.operation.FindOperation.execute(FindOperation.java:79)
at com.mongodb.Mongo.execute(Mongo.java:772)
at com.mongodb.Mongo$2.execute(Mongo.java:759)
at com.mongodb.OperationIterable.iterator(OperationIterable.java:47)
at com.mongodb.FindIterableImpl.iterator(FindIterableImpl.java:143)
at org.apache.beam.sdk.io.mongodb.MongoDbIO$BoundedMongoDbReader.start(MongoDbIO.java:456)
at com.google.cloud.dataflow.worker.WorkerCustomSources$BoundedReaderIterator.start(WorkerCustomSources.java:592)
... 14 more
Workflow failed. Causes: S03:Read all documents/Read(BoundedMongoDbSource)+Map documents to Strings/Map+Calculate hashcode/WithKeys/AddKeys/Map+Calculate hashcode/Combine.perKey(Hashing)/GroupByKey+Calculate hashcode/Combine.perKey(Hashing)/Combine.GroupedValues/Partial+Calculate hashcode/Combine.perKey(Hashing)/GroupByKey/Reify+Calculate hashcode/Combine.perKey(Hashing)/GroupByKey/Write failed., A work item was attempted 4 times without success. Each time the worker eventually lost contact with the service. The work item was attempted on:
mongodbioit0testwriteandr-04231111-t8y6-harness-z6t8,
mongodbioit0testwriteandr-04231111-t8y6-harness-pmd8,
mongodbioit0testwriteandr-04231111-t8y6-harness-pmd8,
mongodbioit0testwriteandr-04231111-t8y6-harness-pmd8
at org.apache.beam.runners.dataflow.TestDataflowRunner.run(TestDataflowRunner.java:134)
at org.apache.beam.runners.dataflow.TestDataflowRunner.run(TestDataflowRunner.java:90)
at org.apache.beam.runners.dataflow.TestDataflowRunner.run(TestDataflowRunner.java:55)
at org.apache.beam.sdk.Pipeline.run(Pipeline.java:311)
at org.apache.beam.sdk.testing.TestPipeline.run(TestPipeline.java:346)
at org.apache.beam.sdk.testing.TestPipeline.run(TestPipeline.java:328)
at org.apache.beam.sdk.io.mongodb.MongoDBIOIT.testWriteAndRead(MongoDBIOIT.java:131)
at sun.reflect.NativeMethodAccessorImpl.invoke0(Native Method)
at sun.reflect.NativeMethodAccessorImpl.invoke(NativeMethodAccessorImpl.java:62)
at sun.reflect.DelegatingMethodAccessorImpl.invoke(DelegatingMethodAccessorImpl.java:43)
at java.lang.reflect.Method.invoke(Method.java:498)
at org.junit.runners.model.FrameworkMethod$1.runReflectiveCall(FrameworkMethod.java:50)
at org.junit.internal.runners.model.ReflectiveCallable.run(ReflectiveCallable.java:12)
at org.junit.runners.model.FrameworkMethod.invokeExplosively(FrameworkMethod.java:47)
at org.junit.internal.runners.statements.InvokeMethod.evaluate(InvokeMethod.java:17)
at org.junit.internal.runners.statements.RunAfters.evaluate(RunAfters.java:27)
at org.apache.beam.sdk.testing.TestPipeline$1.evaluate(TestPipeline.java:317)
at org.apache.beam.sdk.testing.TestPipeline$1.evaluate(TestPipeline.java:317)
at org.junit.rules.RunRules.evaluate(RunRules.java:20)
at org.junit.runners.ParentRunner.runLeaf(ParentRunner.java:325)
at org.junit.runners.BlockJUnit4ClassRunner.runChild(BlockJUnit4ClassRunner.java:78)
at org.junit.runners.BlockJUnit4ClassRunner.runChild(BlockJUnit4ClassRunner.java:57)
at org.junit.runners.ParentRunner$3.run(ParentRunner.java:290)
at org.apache.maven.surefire.junitcore.pc.Scheduler$1.run(Scheduler.java:410)
at java.util.concurrent.Executors$RunnableAdapter.call(Executors.java:511)
at java.util.concurrent.FutureTask.run(FutureTask.java:266)
at java.util.concurrent.ThreadPoolExecutor.runWorker(ThreadPoolExecutor.java:1149)
at java.util.concurrent.ThreadPoolExecutor$Worker.run(ThreadPoolExecutor.java:624)
at java.lang.Thread.run(Thread.java:748)
[ERROR] testWriteAndRead(org.apache.beam.sdk.io.mongodb.MongoDBIOIT) Time elapsed: 0 s <<< ERROR!
com.mongodb.MongoTimeoutException: Timed out after 30000 ms while waiting for a server that matches WritableServerSelector. Client view of cluster state is {type=UNKNOWN, servers=[{address=104.197.209.208:27017, type=UNKNOWN, state=CONNECTING, exception={com.mongodb.MongoSocketOpenException: Exception opening socket}, caused by {java.net.SocketTimeoutException: connect timed out}}]
at com.mongodb.connection.BaseCluster.createTimeoutException(BaseCluster.java:369)
at com.mongodb.connection.BaseCluster.selectServer(BaseCluster.java:101)
at com.mongodb.binding.ClusterBinding$ClusterBindingConnectionSource.<init>(ClusterBinding.java:75)
at com.mongodb.binding.ClusterBinding$ClusterBindingConnectionSource.<init>(ClusterBinding.java:71)
at com.mongodb.binding.ClusterBinding.getWriteConnectionSource(ClusterBinding.java:68)
at com.mongodb.operation.CommandOperationHelper.executeWrappedCommandProtocol(CommandOperationHelper.java:158)
at com.mongodb.operation.CommandOperationHelper.executeWrappedCommandProtocol(CommandOperationHelper.java:133)
at com.mongodb.operation.CommandOperationHelper.executeWrappedCommandProtocol(CommandOperationHelper.java:128)
at com.mongodb.operation.DropDatabaseOperation.execute(DropDatabaseOperation.java:51)
at com.mongodb.operation.DropDatabaseOperation.execute(DropDatabaseOperation.java:36)
at com.mongodb.Mongo.execute(Mongo.java:781)
at com.mongodb.Mongo$2.execute(Mongo.java:764)
at com.mongodb.MongoDatabaseImpl.drop(MongoDatabaseImpl.java:136)
at org.apache.beam.sdk.io.mongodb.MongoDBIOIT.tearDown(MongoDBIOIT.java:103)
at sun.reflect.NativeMethodAccessorImpl.invoke0(Native Method)
at sun.reflect.NativeMethodAccessorImpl.invoke(NativeMethodAccessorImpl.java:62)
at sun.reflect.DelegatingMethodAccessorImpl.invoke(DelegatingMethodAccessorImpl.java:43)
at java.lang.reflect.Method.invoke(Method.java:498)
at org.junit.runners.model.FrameworkMethod$1.runReflectiveCall(FrameworkMethod.java:50)
at org.junit.internal.runners.model.ReflectiveCallable.run(ReflectiveCallable.java:12)
at org.junit.runners.model.FrameworkMethod.invokeExplosively(FrameworkMethod.java:47)
at org.junit.internal.runners.statements.RunAfters.evaluate(RunAfters.java:33)
at org.apache.beam.sdk.testing.TestPipeline$1.evaluate(TestPipeline.java:317)
at org.apache.beam.sdk.testing.TestPipeline$1.evaluate(TestPipeline.java:317)
at org.junit.rules.RunRules.evaluate(RunRules.java:20)
at org.junit.runners.ParentRunner.runLeaf(ParentRunner.java:325)
at org.junit.runners.BlockJUnit4ClassRunner.runChild(BlockJUnit4ClassRunner.java:78)
at org.junit.runners.BlockJUnit4ClassRunner.runChild(BlockJUnit4ClassRunner.java:57)
at org.junit.runners.ParentRunner$3.run(ParentRunner.java:290)
at org.apache.maven.surefire.junitcore.pc.Scheduler$1.run(Scheduler.java:410)
at java.util.concurrent.Executors$RunnableAdapter.call(Executors.java:511)
at java.util.concurrent.FutureTask.run(FutureTask.java:266)
at java.util.concurrent.ThreadPoolExecutor.runWorker(ThreadPoolExecutor.java:1149)
at java.util.concurrent.ThreadPoolExecutor$Worker.run(ThreadPoolExecutor.java:624)
at java.lang.Thread.run(Thread.java:748)
[INFO]
[INFO] Results:
[INFO]
[ERROR] Errors:
[ERROR] org.apache.beam.sdk.io.mongodb.MongoDBIOIT.testWriteAndRead(org.apache.beam.sdk.io.mongodb.MongoDBIOIT)
[ERROR] Run 1: MongoDBIOIT.testWriteAndRead:131 Runtime java.io.IOException: Failed to adva...
[ERROR] Run 2: MongoDBIOIT.tearDown:103 MongoTimeout Timed out after 30000 ms while waiting...
[INFO]
[INFO]
[ERROR] Tests run: 1, Failures: 0, Errors: 1, Skipped: 0
[INFO]
[INFO]
[INFO] --- maven-dependency-plugin:3.0.2:analyze-only (default) @ beam-sdks-java-io-mongodb ---
[INFO] No dependency problems found
[INFO]
[INFO] --- maven-failsafe-plugin:2.21.0:verify (default) @ beam-sdks-java-io-mongodb ---
[INFO] Failsafe report directory: <https://builds.apache.org/job/beam_PerformanceTests_MongoDBIO_IT/ws/runs/54710381/beam/sdks/java/io/mongodb/target/failsafe-reports>
[INFO] ------------------------------------------------------------------------
[INFO] BUILD FAILURE
[INFO] ------------------------------------------------------------------------
[INFO] Total time: 14:29 min
[INFO] Finished at: 2018-04-23T18:18:33Z
[INFO] Final Memory: 94M/1371M
[INFO] ------------------------------------------------------------------------
[ERROR] Failed to execute goal org.apache.maven.plugins:maven-failsafe-plugin:2.21.0:verify (default) on project beam-sdks-java-io-mongodb: There are test failures.
[ERROR]
[ERROR] Please refer to <https://builds.apache.org/job/beam_PerformanceTests_MongoDBIO_IT/ws/runs/54710381/beam/sdks/java/io/mongodb/target/failsafe-reports> for the individual test results.
[ERROR] Please refer to dump files (if any exist) [date]-jvmRun[N].dump, [date].dumpstream and [date]-jvmRun[N].dumpstream.
[ERROR] -> [Help 1]
org.apache.maven.lifecycle.LifecycleExecutionException: Failed to execute goal org.apache.maven.plugins:maven-failsafe-plugin:2.21.0:verify (default) on project beam-sdks-java-io-mongodb: There are test failures.
Please refer to <https://builds.apache.org/job/beam_PerformanceTests_MongoDBIO_IT/ws/runs/54710381/beam/sdks/java/io/mongodb/target/failsafe-reports> for the individual test results.
Please refer to dump files (if any exist) [date]-jvmRun[N].dump, [date].dumpstream and [date]-jvmRun[N].dumpstream.
at org.apache.maven.lifecycle.internal.MojoExecutor.execute (MojoExecutor.java:213)
at org.apache.maven.lifecycle.internal.MojoExecutor.execute (MojoExecutor.java:154)
at org.apache.maven.lifecycle.internal.MojoExecutor.execute (MojoExecutor.java:146)
at org.apache.maven.lifecycle.internal.LifecycleModuleBuilder.buildProject (LifecycleModuleBuilder.java:117)
at org.apache.maven.lifecycle.internal.LifecycleModuleBuilder.buildProject (LifecycleModuleBuilder.java:81)
at org.apache.maven.lifecycle.internal.builder.singlethreaded.SingleThreadedBuilder.build (SingleThreadedBuilder.java:51)
at org.apache.maven.lifecycle.internal.LifecycleStarter.execute (LifecycleStarter.java:128)
at org.apache.maven.DefaultMaven.doExecute (DefaultMaven.java:309)
at org.apache.maven.DefaultMaven.doExecute (DefaultMaven.java:194)
at org.apache.maven.DefaultMaven.execute (DefaultMaven.java:107)
at org.apache.maven.cli.MavenCli.execute (MavenCli.java:955)
at org.apache.maven.cli.MavenCli.doMain (MavenCli.java:290)
at org.apache.maven.cli.MavenCli.main (MavenCli.java:194)
at sun.reflect.NativeMethodAccessorImpl.invoke0 (Native Method)
at sun.reflect.NativeMethodAccessorImpl.invoke (NativeMethodAccessorImpl.java:62)
at sun.reflect.DelegatingMethodAccessorImpl.invoke (DelegatingMethodAccessorImpl.java:43)
at java.lang.reflect.Method.invoke (Method.java:498)
at org.codehaus.plexus.classworlds.launcher.Launcher.launchEnhanced (Launcher.java:289)
at org.codehaus.plexus.classworlds.launcher.Launcher.launch (Launcher.java:229)
at org.codehaus.plexus.classworlds.launcher.Launcher.mainWithExitCode (Launcher.java:415)
at org.codehaus.plexus.classworlds.launcher.Launcher.main (Launcher.java:356)
Caused by: org.apache.maven.plugin.MojoFailureException: There are test failures.
Please refer to <https://builds.apache.org/job/beam_PerformanceTests_MongoDBIO_IT/ws/runs/54710381/beam/sdks/java/io/mongodb/target/failsafe-reports> for the individual test results.
Please refer to dump files (if any exist) [date]-jvmRun[N].dump, [date].dumpstream and [date]-jvmRun[N].dumpstream.
at org.apache.maven.plugin.surefire.SurefireHelper.throwException (SurefireHelper.java:240)
at org.apache.maven.plugin.surefire.SurefireHelper.reportExecution (SurefireHelper.java:112)
at org.apache.maven.plugin.failsafe.VerifyMojo.execute (VerifyMojo.java:192)
at org.apache.maven.plugin.DefaultBuildPluginManager.executeMojo (DefaultBuildPluginManager.java:134)
at org.apache.maven.lifecycle.internal.MojoExecutor.execute (MojoExecutor.java:208)
at org.apache.maven.lifecycle.internal.MojoExecutor.execute (MojoExecutor.java:154)
at org.apache.maven.lifecycle.internal.MojoExecutor.execute (MojoExecutor.java:146)
at org.apache.maven.lifecycle.internal.LifecycleModuleBuilder.buildProject (LifecycleModuleBuilder.java:117)
at org.apache.maven.lifecycle.internal.LifecycleModuleBuilder.buildProject (LifecycleModuleBuilder.java:81)
at org.apache.maven.lifecycle.internal.builder.singlethreaded.SingleThreadedBuilder.build (SingleThreadedBuilder.java:51)
at org.apache.maven.lifecycle.internal.LifecycleStarter.execute (LifecycleStarter.java:128)
at org.apache.maven.DefaultMaven.doExecute (DefaultMaven.java:309)
at org.apache.maven.DefaultMaven.doExecute (DefaultMaven.java:194)
at org.apache.maven.DefaultMaven.execute (DefaultMaven.java:107)
at org.apache.maven.cli.MavenCli.execute (MavenCli.java:955)
at org.apache.maven.cli.MavenCli.doMain (MavenCli.java:290)
at org.apache.maven.cli.MavenCli.main (MavenCli.java:194)
at sun.reflect.NativeMethodAccessorImpl.invoke0 (Native Method)
at sun.reflect.NativeMethodAccessorImpl.invoke (NativeMethodAccessorImpl.java:62)
at sun.reflect.DelegatingMethodAccessorImpl.invoke (DelegatingMethodAccessorImpl.java:43)
at java.lang.reflect.Method.invoke (Method.java:498)
at org.codehaus.plexus.classworlds.launcher.Launcher.launchEnhanced (Launcher.java:289)
at org.codehaus.plexus.classworlds.launcher.Launcher.launch (Launcher.java:229)
at org.codehaus.plexus.classworlds.launcher.Launcher.mainWithExitCode (Launcher.java:415)
at org.codehaus.plexus.classworlds.launcher.Launcher.main (Launcher.java:356)
[ERROR]
[ERROR] Re-run Maven using the -X switch to enable full debug logging.
[ERROR]
[ERROR] For more information about the errors and possible solutions, please read the following articles:
[ERROR] [Help 1] http://cwiki.apache.org/confluence/display/MAVEN/MojoFailureException
STDERR:
2018-04-23 18:18:34,691 54710381 MainThread beam_integration_benchmark(1/1) ERROR Error during benchmark beam_integration_benchmark
Traceback (most recent call last):
File "<https://builds.apache.org/job/beam_PerformanceTests_MongoDBIO_IT/ws/PerfKitBenchmarker/perfkitbenchmarker/pkb.py",> line 646, in RunBenchmark
DoRunPhase(spec, collector, detailed_timer)
File "<https://builds.apache.org/job/beam_PerformanceTests_MongoDBIO_IT/ws/PerfKitBenchmarker/perfkitbenchmarker/pkb.py",> line 526, in DoRunPhase
samples = spec.BenchmarkRun(spec)
File "<https://builds.apache.org/job/beam_PerformanceTests_MongoDBIO_IT/ws/PerfKitBenchmarker/perfkitbenchmarker/linux_benchmarks/beam_integration_benchmark.py",> line 159, in Run
job_type=job_type)
File "<https://builds.apache.org/job/beam_PerformanceTests_MongoDBIO_IT/ws/PerfKitBenchmarker/perfkitbenchmarker/providers/gcp/gcp_dpb_dataflow.py",> line 90, in SubmitJob
assert retcode == 0, "Integration Test Failed."
AssertionError: Integration Test Failed.
2018-04-23 18:18:34,693 54710381 MainThread beam_integration_benchmark(1/1) INFO Cleaning up benchmark beam_integration_benchmark
2018-04-23 18:18:34,693 54710381 MainThread beam_integration_benchmark(1/1) INFO Running: kubectl --kubeconfig=<https://builds.apache.org/job/beam_PerformanceTests_MongoDBIO_IT/ws/config-mongodbioit-1524495704822> delete -f <https://builds.apache.org/job/beam_PerformanceTests_MongoDBIO_IT/ws/src/.test-infra/kubernetes/mongodb/load-balancer/mongo.yml>
2018-04-23 18:18:35,485 54710381 MainThread beam_integration_benchmark(1/1) ERROR Exception running benchmark
Traceback (most recent call last):
File "<https://builds.apache.org/job/beam_PerformanceTests_MongoDBIO_IT/ws/PerfKitBenchmarker/perfkitbenchmarker/pkb.py",> line 780, in RunBenchmarkTask
RunBenchmark(spec, collector)
File "<https://builds.apache.org/job/beam_PerformanceTests_MongoDBIO_IT/ws/PerfKitBenchmarker/perfkitbenchmarker/pkb.py",> line 646, in RunBenchmark
DoRunPhase(spec, collector, detailed_timer)
File "<https://builds.apache.org/job/beam_PerformanceTests_MongoDBIO_IT/ws/PerfKitBenchmarker/perfkitbenchmarker/pkb.py",> line 526, in DoRunPhase
samples = spec.BenchmarkRun(spec)
File "<https://builds.apache.org/job/beam_PerformanceTests_MongoDBIO_IT/ws/PerfKitBenchmarker/perfkitbenchmarker/linux_benchmarks/beam_integration_benchmark.py",> line 159, in Run
job_type=job_type)
File "<https://builds.apache.org/job/beam_PerformanceTests_MongoDBIO_IT/ws/PerfKitBenchmarker/perfkitbenchmarker/providers/gcp/gcp_dpb_dataflow.py",> line 90, in SubmitJob
assert retcode == 0, "Integration Test Failed."
AssertionError: Integration Test Failed.
2018-04-23 18:18:35,486 54710381 MainThread beam_integration_benchmark(1/1) ERROR Benchmark 1/1 beam_integration_benchmark (UID: beam_integration_benchmark0) failed. Execution will continue.
2018-04-23 18:18:35,541 54710381 MainThread INFO Benchmark run statuses:
---------------------------------------------------------------------------------
Name UID Status Failed Substatus
---------------------------------------------------------------------------------
beam_integration_benchmark beam_integration_benchmark0 FAILED
---------------------------------------------------------------------------------
Success rate: 0.00% (0/1)
2018-04-23 18:18:35,542 54710381 MainThread INFO Complete logs can be found at: <https://builds.apache.org/job/beam_PerformanceTests_MongoDBIO_IT/ws/runs/54710381/pkb.log>
2018-04-23 18:18:35,543 54710381 MainThread INFO Completion statuses can be found at: <https://builds.apache.org/job/beam_PerformanceTests_MongoDBIO_IT/ws/runs/54710381/completion_statuses.json>
Build step 'Execute shell' marked build as failure
Jenkins build is back to normal :
beam_PerformanceTests_MongoDBIO_IT #89
Posted by Apache Jenkins Server <je...@builds.apache.org>.
See <https://builds.apache.org/job/beam_PerformanceTests_MongoDBIO_IT/89/display/redirect?page=changes>
Build failed in Jenkins: beam_PerformanceTests_MongoDBIO_IT #88
Posted by Apache Jenkins Server <je...@builds.apache.org>.
See <https://builds.apache.org/job/beam_PerformanceTests_MongoDBIO_IT/88/display/redirect?page=changes>
Changes:
[apilloud] [SQL] Embed BeamSqlTable in BeamCalciteTable
[owenzhang1990] [BEAM-4129] Run WordCount example on Gearpump runner with Gradle
[sidhom] Fix python lint error
------------------------------------------
[...truncated 99.62 KB...]
at com.mongodb.operation.MixedBulkWriteOperation$Run$2.executeWriteCommandProtocol(MixedBulkWriteOperation.java:455)
at com.mongodb.operation.MixedBulkWriteOperation$Run$RunExecutor.execute(MixedBulkWriteOperation.java:646)
at com.mongodb.operation.MixedBulkWriteOperation$Run.execute(MixedBulkWriteOperation.java:401)
at com.mongodb.operation.MixedBulkWriteOperation$1.call(MixedBulkWriteOperation.java:179)
at com.mongodb.operation.MixedBulkWriteOperation$1.call(MixedBulkWriteOperation.java:168)
at com.mongodb.operation.OperationHelper.withConnectionSource(OperationHelper.java:230)
at com.mongodb.operation.OperationHelper.withConnection(OperationHelper.java:221)
at com.mongodb.operation.MixedBulkWriteOperation.execute(MixedBulkWriteOperation.java:168)
at com.mongodb.operation.MixedBulkWriteOperation.execute(MixedBulkWriteOperation.java:74)
at com.mongodb.Mongo.execute(Mongo.java:781)
at com.mongodb.Mongo$2.execute(Mongo.java:764)
at com.mongodb.MongoCollectionImpl.insertMany(MongoCollectionImpl.java:323)
at com.mongodb.MongoCollectionImpl.insertMany(MongoCollectionImpl.java:311)
at org.apache.beam.sdk.io.mongodb.MongoDbIO$Write$WriteFn.flush(MongoDbIO.java:667)
at org.apache.beam.sdk.io.mongodb.MongoDbIO$Write$WriteFn.processElement(MongoDbIO.java:652)
com.mongodb.MongoTimeoutException: Timed out after 30000 ms while waiting for a server that matches WritableServerSelector. Client view of cluster state is {type=UNKNOWN, servers=[{address=104.197.171.217:27017, type=UNKNOWN, state=CONNECTING, exception={com.mongodb.MongoSocketOpenException: Exception opening socket}, caused by {java.net.SocketTimeoutException: connect timed out}}]
at com.mongodb.connection.BaseCluster.createTimeoutException(BaseCluster.java:369)
at com.mongodb.connection.BaseCluster.selectServer(BaseCluster.java:101)
at com.mongodb.binding.ClusterBinding$ClusterBindingConnectionSource.<init>(ClusterBinding.java:75)
at com.mongodb.binding.ClusterBinding$ClusterBindingConnectionSource.<init>(ClusterBinding.java:71)
at com.mongodb.binding.ClusterBinding.getWriteConnectionSource(ClusterBinding.java:68)
at com.mongodb.operation.OperationHelper.withConnection(OperationHelper.java:219)
at com.mongodb.operation.MixedBulkWriteOperation.execute(MixedBulkWriteOperation.java:168)
at com.mongodb.operation.MixedBulkWriteOperation.execute(MixedBulkWriteOperation.java:74)
at com.mongodb.Mongo.execute(Mongo.java:781)
at com.mongodb.Mongo$2.execute(Mongo.java:764)
at com.mongodb.MongoCollectionImpl.insertMany(MongoCollectionImpl.java:323)
at com.mongodb.MongoCollectionImpl.insertMany(MongoCollectionImpl.java:311)
at org.apache.beam.sdk.io.mongodb.MongoDbIO$Write$WriteFn.flush(MongoDbIO.java:667)
at org.apache.beam.sdk.io.mongodb.MongoDbIO$Write$WriteFn.processElement(MongoDbIO.java:652)
com.mongodb.MongoTimeoutException: Timed out after 30000 ms while waiting for a server that matches WritableServerSelector. Client view of cluster state is {type=UNKNOWN, servers=[{address=104.197.171.217:27017, type=UNKNOWN, state=CONNECTING, exception={com.mongodb.MongoSocketOpenException: Exception opening socket}, caused by {java.net.SocketTimeoutException: connect timed out}}]
at com.mongodb.connection.BaseCluster.createTimeoutException(BaseCluster.java:369)
at com.mongodb.connection.BaseCluster.selectServer(BaseCluster.java:101)
at com.mongodb.binding.ClusterBinding$ClusterBindingConnectionSource.<init>(ClusterBinding.java:75)
at com.mongodb.binding.ClusterBinding$ClusterBindingConnectionSource.<init>(ClusterBinding.java:71)
at com.mongodb.binding.ClusterBinding.getWriteConnectionSource(ClusterBinding.java:68)
at com.mongodb.operation.OperationHelper.withConnection(OperationHelper.java:219)
at com.mongodb.operation.MixedBulkWriteOperation.execute(MixedBulkWriteOperation.java:168)
at com.mongodb.operation.MixedBulkWriteOperation.execute(MixedBulkWriteOperation.java:74)
at com.mongodb.Mongo.execute(Mongo.java:781)
at com.mongodb.Mongo$2.execute(Mongo.java:764)
at com.mongodb.MongoCollectionImpl.insertMany(MongoCollectionImpl.java:323)
at com.mongodb.MongoCollectionImpl.insertMany(MongoCollectionImpl.java:311)
at org.apache.beam.sdk.io.mongodb.MongoDbIO$Write$WriteFn.flush(MongoDbIO.java:667)
at org.apache.beam.sdk.io.mongodb.MongoDbIO$Write$WriteFn.processElement(MongoDbIO.java:652)
com.mongodb.MongoTimeoutException: Timed out after 30000 ms while waiting for a server that matches WritableServerSelector. Client view of cluster state is {type=UNKNOWN, servers=[{address=104.197.171.217:27017, type=UNKNOWN, state=CONNECTING, exception={com.mongodb.MongoSocketOpenException: Exception opening socket}, caused by {java.net.SocketTimeoutException: connect timed out}}]
at com.mongodb.connection.BaseCluster.createTimeoutException(BaseCluster.java:369)
at com.mongodb.connection.BaseCluster.selectServer(BaseCluster.java:101)
at com.mongodb.binding.ClusterBinding$ClusterBindingConnectionSource.<init>(ClusterBinding.java:75)
at com.mongodb.binding.ClusterBinding$ClusterBindingConnectionSource.<init>(ClusterBinding.java:71)
at com.mongodb.binding.ClusterBinding.getWriteConnectionSource(ClusterBinding.java:68)
at com.mongodb.operation.OperationHelper.withConnection(OperationHelper.java:219)
at com.mongodb.operation.MixedBulkWriteOperation.execute(MixedBulkWriteOperation.java:168)
at com.mongodb.operation.MixedBulkWriteOperation.execute(MixedBulkWriteOperation.java:74)
at com.mongodb.Mongo.execute(Mongo.java:781)
at com.mongodb.Mongo$2.execute(Mongo.java:764)
at com.mongodb.MongoCollectionImpl.insertMany(MongoCollectionImpl.java:323)
at com.mongodb.MongoCollectionImpl.insertMany(MongoCollectionImpl.java:311)
at org.apache.beam.sdk.io.mongodb.MongoDbIO$Write$WriteFn.flush(MongoDbIO.java:667)
at org.apache.beam.sdk.io.mongodb.MongoDbIO$Write$WriteFn.processElement(MongoDbIO.java:652)
com.mongodb.MongoTimeoutException: Timed out after 30000 ms while waiting for a server that matches WritableServerSelector. Client view of cluster state is {type=UNKNOWN, servers=[{address=104.197.171.217:27017, type=UNKNOWN, state=CONNECTING, exception={com.mongodb.MongoSocketOpenException: Exception opening socket}, caused by {java.net.SocketTimeoutException: connect timed out}}]
at com.mongodb.connection.BaseCluster.createTimeoutException(BaseCluster.java:369)
at com.mongodb.connection.BaseCluster.selectServer(BaseCluster.java:101)
at com.mongodb.binding.ClusterBinding$ClusterBindingConnectionSource.<init>(ClusterBinding.java:75)
at com.mongodb.binding.ClusterBinding$ClusterBindingConnectionSource.<init>(ClusterBinding.java:71)
at com.mongodb.binding.ClusterBinding.getWriteConnectionSource(ClusterBinding.java:68)
at com.mongodb.operation.OperationHelper.withConnection(OperationHelper.java:219)
at com.mongodb.operation.MixedBulkWriteOperation.execute(MixedBulkWriteOperation.java:168)
at com.mongodb.operation.MixedBulkWriteOperation.execute(MixedBulkWriteOperation.java:74)
at com.mongodb.Mongo.execute(Mongo.java:781)
at com.mongodb.Mongo$2.execute(Mongo.java:764)
at com.mongodb.MongoCollectionImpl.insertMany(MongoCollectionImpl.java:323)
at com.mongodb.MongoCollectionImpl.insertMany(MongoCollectionImpl.java:311)
at org.apache.beam.sdk.io.mongodb.MongoDbIO$Write$WriteFn.flush(MongoDbIO.java:667)
at org.apache.beam.sdk.io.mongodb.MongoDbIO$Write$WriteFn.processElement(MongoDbIO.java:652)
com.mongodb.MongoTimeoutException: Timed out after 30000 ms while waiting for a server that matches WritableServerSelector. Client view of cluster state is {type=UNKNOWN, servers=[{address=104.197.171.217:27017, type=UNKNOWN, state=CONNECTING, exception={com.mongodb.MongoSocketOpenException: Exception opening socket}, caused by {java.net.SocketTimeoutException: connect timed out}}]
at com.mongodb.connection.BaseCluster.createTimeoutException(BaseCluster.java:369)
at com.mongodb.connection.BaseCluster.selectServer(BaseCluster.java:101)
at com.mongodb.binding.ClusterBinding$ClusterBindingConnectionSource.<init>(ClusterBinding.java:75)
at com.mongodb.binding.ClusterBinding$ClusterBindingConnectionSource.<init>(ClusterBinding.java:71)
at com.mongodb.binding.ClusterBinding.getWriteConnectionSource(ClusterBinding.java:68)
at com.mongodb.operation.OperationHelper.withConnection(OperationHelper.java:219)
at com.mongodb.operation.MixedBulkWriteOperation.execute(MixedBulkWriteOperation.java:168)
at com.mongodb.operation.MixedBulkWriteOperation.execute(MixedBulkWriteOperation.java:74)
at com.mongodb.Mongo.execute(Mongo.java:781)
at com.mongodb.Mongo$2.execute(Mongo.java:764)
at com.mongodb.MongoCollectionImpl.insertMany(MongoCollectionImpl.java:323)
at com.mongodb.MongoCollectionImpl.insertMany(MongoCollectionImpl.java:311)
at org.apache.beam.sdk.io.mongodb.MongoDbIO$Write$WriteFn.flush(MongoDbIO.java:667)
at org.apache.beam.sdk.io.mongodb.MongoDbIO$Write$WriteFn.processElement(MongoDbIO.java:652)
Workflow failed. Causes: S01:Generate sequence/Read(BoundedCountingSource)+Produce documents/Map+Write documents to MongoDB/ParDo(Write) failed., A work item was attempted 4 times without success. Each time the worker eventually lost contact with the service. The work item was attempted on:
mongodbioit0testwriteandr-04232303-qwr5-harness-kv46,
mongodbioit0testwriteandr-04232303-qwr5-harness-kv46,
mongodbioit0testwriteandr-04232303-qwr5-harness-kv46,
mongodbioit0testwriteandr-04232303-qwr5-harness-kv46
at org.apache.beam.runners.dataflow.TestDataflowRunner.run(TestDataflowRunner.java:134)
at org.apache.beam.runners.dataflow.TestDataflowRunner.run(TestDataflowRunner.java:90)
at org.apache.beam.runners.dataflow.TestDataflowRunner.run(TestDataflowRunner.java:55)
at org.apache.beam.sdk.Pipeline.run(Pipeline.java:311)
at org.apache.beam.sdk.testing.TestPipeline.run(TestPipeline.java:346)
at org.apache.beam.sdk.testing.TestPipeline.run(TestPipeline.java:328)
at org.apache.beam.sdk.io.mongodb.MongoDBIOIT.testWriteAndRead(MongoDBIOIT.java:118)
at sun.reflect.NativeMethodAccessorImpl.invoke0(Native Method)
at sun.reflect.NativeMethodAccessorImpl.invoke(NativeMethodAccessorImpl.java:62)
at sun.reflect.DelegatingMethodAccessorImpl.invoke(DelegatingMethodAccessorImpl.java:43)
at java.lang.reflect.Method.invoke(Method.java:498)
at org.junit.runners.model.FrameworkMethod$1.runReflectiveCall(FrameworkMethod.java:50)
at org.junit.internal.runners.model.ReflectiveCallable.run(ReflectiveCallable.java:12)
at org.junit.runners.model.FrameworkMethod.invokeExplosively(FrameworkMethod.java:47)
at org.junit.internal.runners.statements.InvokeMethod.evaluate(InvokeMethod.java:17)
at org.junit.internal.runners.statements.RunAfters.evaluate(RunAfters.java:27)
at org.apache.beam.sdk.testing.TestPipeline$1.evaluate(TestPipeline.java:317)
at org.apache.beam.sdk.testing.TestPipeline$1.evaluate(TestPipeline.java:317)
at org.junit.rules.RunRules.evaluate(RunRules.java:20)
at org.junit.runners.ParentRunner.runLeaf(ParentRunner.java:325)
at org.junit.runners.BlockJUnit4ClassRunner.runChild(BlockJUnit4ClassRunner.java:78)
at org.junit.runners.BlockJUnit4ClassRunner.runChild(BlockJUnit4ClassRunner.java:57)
at org.junit.runners.ParentRunner$3.run(ParentRunner.java:290)
at org.apache.maven.surefire.junitcore.pc.Scheduler$1.run(Scheduler.java:410)
at java.util.concurrent.Executors$RunnableAdapter.call(Executors.java:511)
at java.util.concurrent.FutureTask.run(FutureTask.java:266)
at java.util.concurrent.ThreadPoolExecutor.runWorker(ThreadPoolExecutor.java:1149)
at java.util.concurrent.ThreadPoolExecutor$Worker.run(ThreadPoolExecutor.java:624)
at java.lang.Thread.run(Thread.java:748)
[INFO]
[INFO] Results:
[INFO]
[ERROR] Errors:
[ERROR] MongoDBIOIT.testWriteAndRead:118 Runtime com.mongodb.MongoSocketReadExceptio...
[INFO]
[ERROR] Tests run: 1, Failures: 0, Errors: 1, Skipped: 0
[INFO]
[INFO]
[INFO] --- maven-dependency-plugin:3.0.2:analyze-only (default) @ beam-sdks-java-io-mongodb ---
[INFO] No dependency problems found
[INFO]
[INFO] --- maven-failsafe-plugin:2.21.0:verify (default) @ beam-sdks-java-io-mongodb ---
[INFO] Failsafe report directory: <https://builds.apache.org/job/beam_PerformanceTests_MongoDBIO_IT/ws/runs/3c81a6c3/beam/sdks/java/io/mongodb/target/failsafe-reports>
[INFO] ------------------------------------------------------------------------
[INFO] BUILD FAILURE
[INFO] ------------------------------------------------------------------------
[INFO] Total time: 09:20 min
[INFO] Finished at: 2018-04-24T06:12:22Z
[INFO] Final Memory: 96M/1298M
[INFO] ------------------------------------------------------------------------
[ERROR] Failed to execute goal org.apache.maven.plugins:maven-failsafe-plugin:2.21.0:verify (default) on project beam-sdks-java-io-mongodb: There are test failures.
[ERROR]
[ERROR] Please refer to <https://builds.apache.org/job/beam_PerformanceTests_MongoDBIO_IT/ws/runs/3c81a6c3/beam/sdks/java/io/mongodb/target/failsafe-reports> for the individual test results.
[ERROR] Please refer to dump files (if any exist) [date]-jvmRun[N].dump, [date].dumpstream and [date]-jvmRun[N].dumpstream.
[ERROR] -> [Help 1]
org.apache.maven.lifecycle.LifecycleExecutionException: Failed to execute goal org.apache.maven.plugins:maven-failsafe-plugin:2.21.0:verify (default) on project beam-sdks-java-io-mongodb: There are test failures.
Please refer to <https://builds.apache.org/job/beam_PerformanceTests_MongoDBIO_IT/ws/runs/3c81a6c3/beam/sdks/java/io/mongodb/target/failsafe-reports> for the individual test results.
Please refer to dump files (if any exist) [date]-jvmRun[N].dump, [date].dumpstream and [date]-jvmRun[N].dumpstream.
at org.apache.maven.lifecycle.internal.MojoExecutor.execute (MojoExecutor.java:213)
at org.apache.maven.lifecycle.internal.MojoExecutor.execute (MojoExecutor.java:154)
at org.apache.maven.lifecycle.internal.MojoExecutor.execute (MojoExecutor.java:146)
at org.apache.maven.lifecycle.internal.LifecycleModuleBuilder.buildProject (LifecycleModuleBuilder.java:117)
at org.apache.maven.lifecycle.internal.LifecycleModuleBuilder.buildProject (LifecycleModuleBuilder.java:81)
at org.apache.maven.lifecycle.internal.builder.singlethreaded.SingleThreadedBuilder.build (SingleThreadedBuilder.java:51)
at org.apache.maven.lifecycle.internal.LifecycleStarter.execute (LifecycleStarter.java:128)
at org.apache.maven.DefaultMaven.doExecute (DefaultMaven.java:309)
at org.apache.maven.DefaultMaven.doExecute (DefaultMaven.java:194)
at org.apache.maven.DefaultMaven.execute (DefaultMaven.java:107)
at org.apache.maven.cli.MavenCli.execute (MavenCli.java:955)
at org.apache.maven.cli.MavenCli.doMain (MavenCli.java:290)
at org.apache.maven.cli.MavenCli.main (MavenCli.java:194)
at sun.reflect.NativeMethodAccessorImpl.invoke0 (Native Method)
at sun.reflect.NativeMethodAccessorImpl.invoke (NativeMethodAccessorImpl.java:62)
at sun.reflect.DelegatingMethodAccessorImpl.invoke (DelegatingMethodAccessorImpl.java:43)
at java.lang.reflect.Method.invoke (Method.java:498)
at org.codehaus.plexus.classworlds.launcher.Launcher.launchEnhanced (Launcher.java:289)
at org.codehaus.plexus.classworlds.launcher.Launcher.launch (Launcher.java:229)
at org.codehaus.plexus.classworlds.launcher.Launcher.mainWithExitCode (Launcher.java:415)
at org.codehaus.plexus.classworlds.launcher.Launcher.main (Launcher.java:356)
Caused by: org.apache.maven.plugin.MojoFailureException: There are test failures.
Please refer to <https://builds.apache.org/job/beam_PerformanceTests_MongoDBIO_IT/ws/runs/3c81a6c3/beam/sdks/java/io/mongodb/target/failsafe-reports> for the individual test results.
Please refer to dump files (if any exist) [date]-jvmRun[N].dump, [date].dumpstream and [date]-jvmRun[N].dumpstream.
at org.apache.maven.plugin.surefire.SurefireHelper.throwException (SurefireHelper.java:240)
at org.apache.maven.plugin.surefire.SurefireHelper.reportExecution (SurefireHelper.java:112)
at org.apache.maven.plugin.failsafe.VerifyMojo.execute (VerifyMojo.java:192)
at org.apache.maven.plugin.DefaultBuildPluginManager.executeMojo (DefaultBuildPluginManager.java:134)
at org.apache.maven.lifecycle.internal.MojoExecutor.execute (MojoExecutor.java:208)
at org.apache.maven.lifecycle.internal.MojoExecutor.execute (MojoExecutor.java:154)
at org.apache.maven.lifecycle.internal.MojoExecutor.execute (MojoExecutor.java:146)
at org.apache.maven.lifecycle.internal.LifecycleModuleBuilder.buildProject (LifecycleModuleBuilder.java:117)
at org.apache.maven.lifecycle.internal.LifecycleModuleBuilder.buildProject (LifecycleModuleBuilder.java:81)
at org.apache.maven.lifecycle.internal.builder.singlethreaded.SingleThreadedBuilder.build (SingleThreadedBuilder.java:51)
at org.apache.maven.lifecycle.internal.LifecycleStarter.execute (LifecycleStarter.java:128)
at org.apache.maven.DefaultMaven.doExecute (DefaultMaven.java:309)
at org.apache.maven.DefaultMaven.doExecute (DefaultMaven.java:194)
at org.apache.maven.DefaultMaven.execute (DefaultMaven.java:107)
at org.apache.maven.cli.MavenCli.execute (MavenCli.java:955)
at org.apache.maven.cli.MavenCli.doMain (MavenCli.java:290)
at org.apache.maven.cli.MavenCli.main (MavenCli.java:194)
at sun.reflect.NativeMethodAccessorImpl.invoke0 (Native Method)
at sun.reflect.NativeMethodAccessorImpl.invoke (NativeMethodAccessorImpl.java:62)
at sun.reflect.DelegatingMethodAccessorImpl.invoke (DelegatingMethodAccessorImpl.java:43)
at java.lang.reflect.Method.invoke (Method.java:498)
at org.codehaus.plexus.classworlds.launcher.Launcher.launchEnhanced (Launcher.java:289)
at org.codehaus.plexus.classworlds.launcher.Launcher.launch (Launcher.java:229)
at org.codehaus.plexus.classworlds.launcher.Launcher.mainWithExitCode (Launcher.java:415)
at org.codehaus.plexus.classworlds.launcher.Launcher.main (Launcher.java:356)
[ERROR]
[ERROR] Re-run Maven using the -X switch to enable full debug logging.
[ERROR]
[ERROR] For more information about the errors and possible solutions, please read the following articles:
[ERROR] [Help 1] http://cwiki.apache.org/confluence/display/MAVEN/MojoFailureException
STDERR:
2018-04-24 06:12:22,888 3c81a6c3 MainThread beam_integration_benchmark(1/1) ERROR Error during benchmark beam_integration_benchmark
Traceback (most recent call last):
File "<https://builds.apache.org/job/beam_PerformanceTests_MongoDBIO_IT/ws/PerfKitBenchmarker/perfkitbenchmarker/pkb.py",> line 646, in RunBenchmark
DoRunPhase(spec, collector, detailed_timer)
File "<https://builds.apache.org/job/beam_PerformanceTests_MongoDBIO_IT/ws/PerfKitBenchmarker/perfkitbenchmarker/pkb.py",> line 526, in DoRunPhase
samples = spec.BenchmarkRun(spec)
File "<https://builds.apache.org/job/beam_PerformanceTests_MongoDBIO_IT/ws/PerfKitBenchmarker/perfkitbenchmarker/linux_benchmarks/beam_integration_benchmark.py",> line 159, in Run
job_type=job_type)
File "<https://builds.apache.org/job/beam_PerformanceTests_MongoDBIO_IT/ws/PerfKitBenchmarker/perfkitbenchmarker/providers/gcp/gcp_dpb_dataflow.py",> line 90, in SubmitJob
assert retcode == 0, "Integration Test Failed."
AssertionError: Integration Test Failed.
2018-04-24 06:12:22,889 3c81a6c3 MainThread beam_integration_benchmark(1/1) INFO Cleaning up benchmark beam_integration_benchmark
2018-04-24 06:12:22,890 3c81a6c3 MainThread beam_integration_benchmark(1/1) INFO Running: kubectl --kubeconfig=<https://builds.apache.org/job/beam_PerformanceTests_MongoDBIO_IT/ws/config-mongodbioit-1524546099480> delete -f <https://builds.apache.org/job/beam_PerformanceTests_MongoDBIO_IT/ws/src/.test-infra/kubernetes/mongodb/load-balancer/mongo.yml>
2018-04-24 06:12:23,343 3c81a6c3 MainThread beam_integration_benchmark(1/1) ERROR Exception running benchmark
Traceback (most recent call last):
File "<https://builds.apache.org/job/beam_PerformanceTests_MongoDBIO_IT/ws/PerfKitBenchmarker/perfkitbenchmarker/pkb.py",> line 780, in RunBenchmarkTask
RunBenchmark(spec, collector)
File "<https://builds.apache.org/job/beam_PerformanceTests_MongoDBIO_IT/ws/PerfKitBenchmarker/perfkitbenchmarker/pkb.py",> line 646, in RunBenchmark
DoRunPhase(spec, collector, detailed_timer)
File "<https://builds.apache.org/job/beam_PerformanceTests_MongoDBIO_IT/ws/PerfKitBenchmarker/perfkitbenchmarker/pkb.py",> line 526, in DoRunPhase
samples = spec.BenchmarkRun(spec)
File "<https://builds.apache.org/job/beam_PerformanceTests_MongoDBIO_IT/ws/PerfKitBenchmarker/perfkitbenchmarker/linux_benchmarks/beam_integration_benchmark.py",> line 159, in Run
job_type=job_type)
File "<https://builds.apache.org/job/beam_PerformanceTests_MongoDBIO_IT/ws/PerfKitBenchmarker/perfkitbenchmarker/providers/gcp/gcp_dpb_dataflow.py",> line 90, in SubmitJob
assert retcode == 0, "Integration Test Failed."
AssertionError: Integration Test Failed.
2018-04-24 06:12:23,344 3c81a6c3 MainThread beam_integration_benchmark(1/1) ERROR Benchmark 1/1 beam_integration_benchmark (UID: beam_integration_benchmark0) failed. Execution will continue.
2018-04-24 06:12:23,403 3c81a6c3 MainThread INFO Benchmark run statuses:
---------------------------------------------------------------------------------
Name UID Status Failed Substatus
---------------------------------------------------------------------------------
beam_integration_benchmark beam_integration_benchmark0 FAILED
---------------------------------------------------------------------------------
Success rate: 0.00% (0/1)
2018-04-24 06:12:23,404 3c81a6c3 MainThread INFO Complete logs can be found at: <https://builds.apache.org/job/beam_PerformanceTests_MongoDBIO_IT/ws/runs/3c81a6c3/pkb.log>
2018-04-24 06:12:23,404 3c81a6c3 MainThread INFO Completion statuses can be found at: <https://builds.apache.org/job/beam_PerformanceTests_MongoDBIO_IT/ws/runs/3c81a6c3/completion_statuses.json>
Build step 'Execute shell' marked build as failure
Build failed in Jenkins: beam_PerformanceTests_MongoDBIO_IT #87
Posted by Apache Jenkins Server <je...@builds.apache.org>.
See <https://builds.apache.org/job/beam_PerformanceTests_MongoDBIO_IT/87/display/redirect?page=changes>
Changes:
[geet.kumar75] BEAM-4038: Support Kafka Headers in KafkaIO
[geet.kumar75] BEAM-4038: Update license information
[geet.kumar75] Update code formatting
[geet.kumar75] Remove custom implementations of KafkaHeader, KafkaHeaders, etc.
[geet.kumar75] Changes based on review comments
[daniel.o.programmer] [BEAM-3513] Removing PrimitiveCombineGroupedValues override w/ FnAPI.
[echauchot] Introduce MetricsPusher in runner core to regularly push aggregated
[echauchot] Instanciate MetricsPusher in runner-specific code because we need
[echauchot] Improve MetricsPusher: do not aggregate metrics when not needed, improve
[echauchot] Create JsonMetricsSerializer
[echauchot] Stop MetricsPusher thread by observing pipeline state and improve the
[echauchot] Make metrics sink configurable through PipelineOptions, pass
[echauchot] Add MetricsPusher tests specific to Spark (because Spark streaming tests
[echauchot] Add a MetricksPusher test to runner-core (batch and streaming are done
[echauchot] Push metrics at the end of a batch pipeline in flink runner
[echauchot] improve MetricsPusher lifecycle and thread safety
[echauchot] Make MetricsPusher merge a list a MetricsContainerStepMaps because there
[echauchot] Fix thread synchronisation and replace usages of instance variable by
[echauchot] Clear dummyMetricsSink before test
[echauchot] Push metrics at the end of a batch pipeline in spark runner
[echauchot] Improve MetricsPusher teardown to enable multiple pipelines in a single
[echauchot] Manually generate json and remove jackson
[echauchot] Replace use of http client by use of java.net.HttpUrlConnection and deal
[echauchot] Remove DEFAULT_PERIOD constant in favor of already existing
[echauchot] Remove unneeded null check, format
[echauchot] convert MetricsSink to an interface with a single writeMetrics method
[echauchot] Remove MetricsSerializer base class and inline serialization in
[echauchot] Dynamically create the sinks by reflection
[echauchot] Split DummyMetricsSink into NoOpMetricsSink (default sink) and
[echauchot] Reduce overhead when no metricsSink is provided, do not start polling
[echauchot] Make MetricsPusher a regular object instead of a singleton to allow
[echauchot] Explicitely start MetricsPusher from the runners
[echauchot] Separate MetricsHttpSink POC to a new runners-extensions artifact and
[echauchot] Fix cycle bug between teardown() and pushmetrics()
[echauchot] Update MetricsPusher and TestMetricsSink to new serializable
[echauchot] Use regular jackson object mapper to serialize metrics now that they are
[echauchot] Give MetricsPusher a bit of time to push before assert in test
[echauchot] Make MetricsPusher thread a daemon
[echauchot] Fix build and clean: dependencies, rat, checkstyle, findbugs, remove
[geet.kumar75] Support kafka versions 0.10.1.0 and above
[echauchot] Move build to gradle
[echauchot] MetricsSink no more needs to be generic
[echauchot] SparkRunnerDebugger does not need to export metrics as it does not run
[tgroh] Use Existing Matchers in WatermarkManagerTest
[echauchot] Move MetricsHttpSink and related classes to a new sub-module
[kirpichov] Consistently handle EmptyMatchTreatment
[rangadi] Add 10 millis sleep when there are no elements left in a partition.
------------------------------------------
[...truncated 1.03 MB...]
at com.mongodb.MongoCollectionImpl.insertMany(MongoCollectionImpl.java:323)
at com.mongodb.MongoCollectionImpl.insertMany(MongoCollectionImpl.java:311)
at org.apache.beam.sdk.io.mongodb.MongoDbIO$Write$WriteFn.flush(MongoDbIO.java:667)
at org.apache.beam.sdk.io.mongodb.MongoDbIO$Write$WriteFn.processElement(MongoDbIO.java:652)
com.mongodb.MongoTimeoutException: Timed out after 30000 ms while waiting for a server that matches WritableServerSelector. Client view of cluster state is {type=UNKNOWN, servers=[{address=104.197.104.146:27017, type=UNKNOWN, state=CONNECTING, exception={com.mongodb.MongoSocketOpenException: Exception opening socket}, caused by {java.net.SocketTimeoutException: connect timed out}}]
at com.mongodb.connection.BaseCluster.createTimeoutException(BaseCluster.java:369)
at com.mongodb.connection.BaseCluster.selectServer(BaseCluster.java:101)
at com.mongodb.binding.ClusterBinding$ClusterBindingConnectionSource.<init>(ClusterBinding.java:75)
at com.mongodb.binding.ClusterBinding$ClusterBindingConnectionSource.<init>(ClusterBinding.java:71)
at com.mongodb.binding.ClusterBinding.getWriteConnectionSource(ClusterBinding.java:68)
at com.mongodb.operation.OperationHelper.withConnection(OperationHelper.java:219)
at com.mongodb.operation.MixedBulkWriteOperation.execute(MixedBulkWriteOperation.java:168)
at com.mongodb.operation.MixedBulkWriteOperation.execute(MixedBulkWriteOperation.java:74)
at com.mongodb.Mongo.execute(Mongo.java:781)
at com.mongodb.Mongo$2.execute(Mongo.java:764)
at com.mongodb.MongoCollectionImpl.insertMany(MongoCollectionImpl.java:323)
at com.mongodb.MongoCollectionImpl.insertMany(MongoCollectionImpl.java:311)
at org.apache.beam.sdk.io.mongodb.MongoDbIO$Write$WriteFn.flush(MongoDbIO.java:667)
at org.apache.beam.sdk.io.mongodb.MongoDbIO$Write$WriteFn.processElement(MongoDbIO.java:652)
com.mongodb.MongoTimeoutException: Timed out after 30000 ms while waiting for a server that matches WritableServerSelector. Client view of cluster state is {type=UNKNOWN, servers=[{address=104.197.104.146:27017, type=UNKNOWN, state=CONNECTING, exception={com.mongodb.MongoSocketOpenException: Exception opening socket}, caused by {java.net.SocketTimeoutException: connect timed out}}]
at com.mongodb.connection.BaseCluster.createTimeoutException(BaseCluster.java:369)
at com.mongodb.connection.BaseCluster.selectServer(BaseCluster.java:101)
at com.mongodb.binding.ClusterBinding$ClusterBindingConnectionSource.<init>(ClusterBinding.java:75)
at com.mongodb.binding.ClusterBinding$ClusterBindingConnectionSource.<init>(ClusterBinding.java:71)
at com.mongodb.binding.ClusterBinding.getWriteConnectionSource(ClusterBinding.java:68)
at com.mongodb.operation.OperationHelper.withConnection(OperationHelper.java:219)
at com.mongodb.operation.MixedBulkWriteOperation.execute(MixedBulkWriteOperation.java:168)
at com.mongodb.operation.MixedBulkWriteOperation.execute(MixedBulkWriteOperation.java:74)
at com.mongodb.Mongo.execute(Mongo.java:781)
at com.mongodb.Mongo$2.execute(Mongo.java:764)
at com.mongodb.MongoCollectionImpl.insertMany(MongoCollectionImpl.java:323)
at com.mongodb.MongoCollectionImpl.insertMany(MongoCollectionImpl.java:311)
at org.apache.beam.sdk.io.mongodb.MongoDbIO$Write$WriteFn.flush(MongoDbIO.java:667)
at org.apache.beam.sdk.io.mongodb.MongoDbIO$Write$WriteFn.processElement(MongoDbIO.java:652)
com.mongodb.MongoTimeoutException: Timed out after 30000 ms while waiting for a server that matches WritableServerSelector. Client view of cluster state is {type=UNKNOWN, servers=[{address=104.197.104.146:27017, type=UNKNOWN, state=CONNECTING, exception={com.mongodb.MongoSocketOpenException: Exception opening socket}, caused by {java.net.SocketTimeoutException: connect timed out}}]
at com.mongodb.connection.BaseCluster.createTimeoutException(BaseCluster.java:369)
at com.mongodb.connection.BaseCluster.selectServer(BaseCluster.java:101)
at com.mongodb.binding.ClusterBinding$ClusterBindingConnectionSource.<init>(ClusterBinding.java:75)
at com.mongodb.binding.ClusterBinding$ClusterBindingConnectionSource.<init>(ClusterBinding.java:71)
at com.mongodb.binding.ClusterBinding.getWriteConnectionSource(ClusterBinding.java:68)
at com.mongodb.operation.OperationHelper.withConnection(OperationHelper.java:219)
at com.mongodb.operation.MixedBulkWriteOperation.execute(MixedBulkWriteOperation.java:168)
at com.mongodb.operation.MixedBulkWriteOperation.execute(MixedBulkWriteOperation.java:74)
at com.mongodb.Mongo.execute(Mongo.java:781)
at com.mongodb.Mongo$2.execute(Mongo.java:764)
at com.mongodb.MongoCollectionImpl.insertMany(MongoCollectionImpl.java:323)
at com.mongodb.MongoCollectionImpl.insertMany(MongoCollectionImpl.java:311)
at org.apache.beam.sdk.io.mongodb.MongoDbIO$Write$WriteFn.flush(MongoDbIO.java:667)
at org.apache.beam.sdk.io.mongodb.MongoDbIO$Write$WriteFn.processElement(MongoDbIO.java:652)
Workflow failed. Causes: S01:Generate sequence/Read(BoundedCountingSource)+Produce documents/Map+Write documents to MongoDB/ParDo(Write) failed., A work item was attempted 4 times without success. Each time the worker eventually lost contact with the service. The work item was attempted on:
mongodbioit0testwriteandr-04231703-r4ia-harness-h87j,
mongodbioit0testwriteandr-04231703-r4ia-harness-h87j,
mongodbioit0testwriteandr-04231703-r4ia-harness-h87j,
mongodbioit0testwriteandr-04231703-r4ia-harness-h87j
at org.apache.beam.runners.dataflow.TestDataflowRunner.run(TestDataflowRunner.java:134)
at org.apache.beam.runners.dataflow.TestDataflowRunner.run(TestDataflowRunner.java:90)
at org.apache.beam.runners.dataflow.TestDataflowRunner.run(TestDataflowRunner.java:55)
at org.apache.beam.sdk.Pipeline.run(Pipeline.java:311)
at org.apache.beam.sdk.testing.TestPipeline.run(TestPipeline.java:346)
at org.apache.beam.sdk.testing.TestPipeline.run(TestPipeline.java:328)
at org.apache.beam.sdk.io.mongodb.MongoDBIOIT.testWriteAndRead(MongoDBIOIT.java:118)
at sun.reflect.NativeMethodAccessorImpl.invoke0(Native Method)
at sun.reflect.NativeMethodAccessorImpl.invoke(NativeMethodAccessorImpl.java:62)
at sun.reflect.DelegatingMethodAccessorImpl.invoke(DelegatingMethodAccessorImpl.java:43)
at java.lang.reflect.Method.invoke(Method.java:498)
at org.junit.runners.model.FrameworkMethod$1.runReflectiveCall(FrameworkMethod.java:50)
at org.junit.internal.runners.model.ReflectiveCallable.run(ReflectiveCallable.java:12)
at org.junit.runners.model.FrameworkMethod.invokeExplosively(FrameworkMethod.java:47)
at org.junit.internal.runners.statements.InvokeMethod.evaluate(InvokeMethod.java:17)
at org.junit.internal.runners.statements.RunAfters.evaluate(RunAfters.java:27)
at org.apache.beam.sdk.testing.TestPipeline$1.evaluate(TestPipeline.java:317)
at org.apache.beam.sdk.testing.TestPipeline$1.evaluate(TestPipeline.java:317)
at org.junit.rules.RunRules.evaluate(RunRules.java:20)
at org.junit.runners.ParentRunner.runLeaf(ParentRunner.java:325)
at org.junit.runners.BlockJUnit4ClassRunner.runChild(BlockJUnit4ClassRunner.java:78)
at org.junit.runners.BlockJUnit4ClassRunner.runChild(BlockJUnit4ClassRunner.java:57)
at org.junit.runners.ParentRunner$3.run(ParentRunner.java:290)
at org.apache.maven.surefire.junitcore.pc.Scheduler$1.run(Scheduler.java:410)
at java.util.concurrent.Executors$RunnableAdapter.call(Executors.java:511)
at java.util.concurrent.FutureTask.run(FutureTask.java:266)
at java.util.concurrent.ThreadPoolExecutor.runWorker(ThreadPoolExecutor.java:1149)
at java.util.concurrent.ThreadPoolExecutor$Worker.run(ThreadPoolExecutor.java:624)
at java.lang.Thread.run(Thread.java:748)
[ERROR] testWriteAndRead(org.apache.beam.sdk.io.mongodb.MongoDBIOIT) Time elapsed: 0 s <<< ERROR!
com.mongodb.MongoTimeoutException: Timed out after 30000 ms while waiting for a server that matches WritableServerSelector. Client view of cluster state is {type=UNKNOWN, servers=[{address=104.197.104.146:27017, type=UNKNOWN, state=CONNECTING, exception={com.mongodb.MongoSocketOpenException: Exception opening socket}, caused by {java.net.SocketTimeoutException: connect timed out}}]
at com.mongodb.connection.BaseCluster.createTimeoutException(BaseCluster.java:369)
at com.mongodb.connection.BaseCluster.selectServer(BaseCluster.java:101)
at com.mongodb.binding.ClusterBinding$ClusterBindingConnectionSource.<init>(ClusterBinding.java:75)
at com.mongodb.binding.ClusterBinding$ClusterBindingConnectionSource.<init>(ClusterBinding.java:71)
at com.mongodb.binding.ClusterBinding.getWriteConnectionSource(ClusterBinding.java:68)
at com.mongodb.operation.CommandOperationHelper.executeWrappedCommandProtocol(CommandOperationHelper.java:158)
at com.mongodb.operation.CommandOperationHelper.executeWrappedCommandProtocol(CommandOperationHelper.java:133)
at com.mongodb.operation.CommandOperationHelper.executeWrappedCommandProtocol(CommandOperationHelper.java:128)
at com.mongodb.operation.DropDatabaseOperation.execute(DropDatabaseOperation.java:51)
at com.mongodb.operation.DropDatabaseOperation.execute(DropDatabaseOperation.java:36)
at com.mongodb.Mongo.execute(Mongo.java:781)
at com.mongodb.Mongo$2.execute(Mongo.java:764)
at com.mongodb.MongoDatabaseImpl.drop(MongoDatabaseImpl.java:136)
at org.apache.beam.sdk.io.mongodb.MongoDBIOIT.tearDown(MongoDBIOIT.java:103)
at sun.reflect.NativeMethodAccessorImpl.invoke0(Native Method)
at sun.reflect.NativeMethodAccessorImpl.invoke(NativeMethodAccessorImpl.java:62)
at sun.reflect.DelegatingMethodAccessorImpl.invoke(DelegatingMethodAccessorImpl.java:43)
at java.lang.reflect.Method.invoke(Method.java:498)
at org.junit.runners.model.FrameworkMethod$1.runReflectiveCall(FrameworkMethod.java:50)
at org.junit.internal.runners.model.ReflectiveCallable.run(ReflectiveCallable.java:12)
at org.junit.runners.model.FrameworkMethod.invokeExplosively(FrameworkMethod.java:47)
at org.junit.internal.runners.statements.RunAfters.evaluate(RunAfters.java:33)
at org.apache.beam.sdk.testing.TestPipeline$1.evaluate(TestPipeline.java:317)
at org.apache.beam.sdk.testing.TestPipeline$1.evaluate(TestPipeline.java:317)
at org.junit.rules.RunRules.evaluate(RunRules.java:20)
at org.junit.runners.ParentRunner.runLeaf(ParentRunner.java:325)
at org.junit.runners.BlockJUnit4ClassRunner.runChild(BlockJUnit4ClassRunner.java:78)
at org.junit.runners.BlockJUnit4ClassRunner.runChild(BlockJUnit4ClassRunner.java:57)
at org.junit.runners.ParentRunner$3.run(ParentRunner.java:290)
at org.apache.maven.surefire.junitcore.pc.Scheduler$1.run(Scheduler.java:410)
at java.util.concurrent.Executors$RunnableAdapter.call(Executors.java:511)
at java.util.concurrent.FutureTask.run(FutureTask.java:266)
at java.util.concurrent.ThreadPoolExecutor.runWorker(ThreadPoolExecutor.java:1149)
at java.util.concurrent.ThreadPoolExecutor$Worker.run(ThreadPoolExecutor.java:624)
at java.lang.Thread.run(Thread.java:748)
[INFO]
[INFO] Results:
[INFO]
[ERROR] Errors:
[ERROR] org.apache.beam.sdk.io.mongodb.MongoDBIOIT.testWriteAndRead(org.apache.beam.sdk.io.mongodb.MongoDBIOIT)
[ERROR] Run 1: MongoDBIOIT.testWriteAndRead:118 Runtime com.mongodb.MongoSocketReadExceptio...
[ERROR] Run 2: MongoDBIOIT.tearDown:103 MongoTimeout Timed out after 30000 ms while waiting...
[INFO]
[INFO]
[ERROR] Tests run: 1, Failures: 0, Errors: 1, Skipped: 0
[INFO]
[INFO]
[INFO] --- maven-dependency-plugin:3.0.2:analyze-only (default) @ beam-sdks-java-io-mongodb ---
[INFO] No dependency problems found
[INFO]
[INFO] --- maven-failsafe-plugin:2.21.0:verify (default) @ beam-sdks-java-io-mongodb ---
[INFO] Failsafe report directory: <https://builds.apache.org/job/beam_PerformanceTests_MongoDBIO_IT/ws/runs/ea0ebd2a/beam/sdks/java/io/mongodb/target/failsafe-reports>
[INFO] ------------------------------------------------------------------------
[INFO] BUILD FAILURE
[INFO] ------------------------------------------------------------------------
[INFO] Total time: 08:09 min
[INFO] Finished at: 2018-04-24T00:11:09Z
[INFO] Final Memory: 97M/1242M
[INFO] ------------------------------------------------------------------------
[ERROR] Failed to execute goal org.apache.maven.plugins:maven-failsafe-plugin:2.21.0:verify (default) on project beam-sdks-java-io-mongodb: There are test failures.
[ERROR]
[ERROR] Please refer to <https://builds.apache.org/job/beam_PerformanceTests_MongoDBIO_IT/ws/runs/ea0ebd2a/beam/sdks/java/io/mongodb/target/failsafe-reports> for the individual test results.
[ERROR] Please refer to dump files (if any exist) [date]-jvmRun[N].dump, [date].dumpstream and [date]-jvmRun[N].dumpstream.
[ERROR] -> [Help 1]
org.apache.maven.lifecycle.LifecycleExecutionException: Failed to execute goal org.apache.maven.plugins:maven-failsafe-plugin:2.21.0:verify (default) on project beam-sdks-java-io-mongodb: There are test failures.
Please refer to <https://builds.apache.org/job/beam_PerformanceTests_MongoDBIO_IT/ws/runs/ea0ebd2a/beam/sdks/java/io/mongodb/target/failsafe-reports> for the individual test results.
Please refer to dump files (if any exist) [date]-jvmRun[N].dump, [date].dumpstream and [date]-jvmRun[N].dumpstream.
at org.apache.maven.lifecycle.internal.MojoExecutor.execute (MojoExecutor.java:213)
at org.apache.maven.lifecycle.internal.MojoExecutor.execute (MojoExecutor.java:154)
at org.apache.maven.lifecycle.internal.MojoExecutor.execute (MojoExecutor.java:146)
at org.apache.maven.lifecycle.internal.LifecycleModuleBuilder.buildProject (LifecycleModuleBuilder.java:117)
at org.apache.maven.lifecycle.internal.LifecycleModuleBuilder.buildProject (LifecycleModuleBuilder.java:81)
at org.apache.maven.lifecycle.internal.builder.singlethreaded.SingleThreadedBuilder.build (SingleThreadedBuilder.java:51)
at org.apache.maven.lifecycle.internal.LifecycleStarter.execute (LifecycleStarter.java:128)
at org.apache.maven.DefaultMaven.doExecute (DefaultMaven.java:309)
at org.apache.maven.DefaultMaven.doExecute (DefaultMaven.java:194)
at org.apache.maven.DefaultMaven.execute (DefaultMaven.java:107)
at org.apache.maven.cli.MavenCli.execute (MavenCli.java:955)
at org.apache.maven.cli.MavenCli.doMain (MavenCli.java:290)
at org.apache.maven.cli.MavenCli.main (MavenCli.java:194)
at sun.reflect.NativeMethodAccessorImpl.invoke0 (Native Method)
at sun.reflect.NativeMethodAccessorImpl.invoke (NativeMethodAccessorImpl.java:62)
at sun.reflect.DelegatingMethodAccessorImpl.invoke (DelegatingMethodAccessorImpl.java:43)
at java.lang.reflect.Method.invoke (Method.java:498)
at org.codehaus.plexus.classworlds.launcher.Launcher.launchEnhanced (Launcher.java:289)
at org.codehaus.plexus.classworlds.launcher.Launcher.launch (Launcher.java:229)
at org.codehaus.plexus.classworlds.launcher.Launcher.mainWithExitCode (Launcher.java:415)
at org.codehaus.plexus.classworlds.launcher.Launcher.main (Launcher.java:356)
Caused by: org.apache.maven.plugin.MojoFailureException: There are test failures.
Please refer to <https://builds.apache.org/job/beam_PerformanceTests_MongoDBIO_IT/ws/runs/ea0ebd2a/beam/sdks/java/io/mongodb/target/failsafe-reports> for the individual test results.
Please refer to dump files (if any exist) [date]-jvmRun[N].dump, [date].dumpstream and [date]-jvmRun[N].dumpstream.
at org.apache.maven.plugin.surefire.SurefireHelper.throwException (SurefireHelper.java:240)
at org.apache.maven.plugin.surefire.SurefireHelper.reportExecution (SurefireHelper.java:112)
at org.apache.maven.plugin.failsafe.VerifyMojo.execute (VerifyMojo.java:192)
at org.apache.maven.plugin.DefaultBuildPluginManager.executeMojo (DefaultBuildPluginManager.java:134)
at org.apache.maven.lifecycle.internal.MojoExecutor.execute (MojoExecutor.java:208)
at org.apache.maven.lifecycle.internal.MojoExecutor.execute (MojoExecutor.java:154)
at org.apache.maven.lifecycle.internal.MojoExecutor.execute (MojoExecutor.java:146)
at org.apache.maven.lifecycle.internal.LifecycleModuleBuilder.buildProject (LifecycleModuleBuilder.java:117)
at org.apache.maven.lifecycle.internal.LifecycleModuleBuilder.buildProject (LifecycleModuleBuilder.java:81)
at org.apache.maven.lifecycle.internal.builder.singlethreaded.SingleThreadedBuilder.build (SingleThreadedBuilder.java:51)
at org.apache.maven.lifecycle.internal.LifecycleStarter.execute (LifecycleStarter.java:128)
at org.apache.maven.DefaultMaven.doExecute (DefaultMaven.java:309)
at org.apache.maven.DefaultMaven.doExecute (DefaultMaven.java:194)
at org.apache.maven.DefaultMaven.execute (DefaultMaven.java:107)
at org.apache.maven.cli.MavenCli.execute (MavenCli.java:955)
at org.apache.maven.cli.MavenCli.doMain (MavenCli.java:290)
at org.apache.maven.cli.MavenCli.main (MavenCli.java:194)
at sun.reflect.NativeMethodAccessorImpl.invoke0 (Native Method)
at sun.reflect.NativeMethodAccessorImpl.invoke (NativeMethodAccessorImpl.java:62)
at sun.reflect.DelegatingMethodAccessorImpl.invoke (DelegatingMethodAccessorImpl.java:43)
at java.lang.reflect.Method.invoke (Method.java:498)
at org.codehaus.plexus.classworlds.launcher.Launcher.launchEnhanced (Launcher.java:289)
at org.codehaus.plexus.classworlds.launcher.Launcher.launch (Launcher.java:229)
at org.codehaus.plexus.classworlds.launcher.Launcher.mainWithExitCode (Launcher.java:415)
at org.codehaus.plexus.classworlds.launcher.Launcher.main (Launcher.java:356)
[ERROR]
[ERROR] Re-run Maven using the -X switch to enable full debug logging.
[ERROR]
[ERROR] For more information about the errors and possible solutions, please read the following articles:
[ERROR] [Help 1] http://cwiki.apache.org/confluence/display/MAVEN/MojoFailureException
STDERR:
2018-04-24 00:11:10,481 ea0ebd2a MainThread beam_integration_benchmark(1/1) ERROR Error during benchmark beam_integration_benchmark
Traceback (most recent call last):
File "<https://builds.apache.org/job/beam_PerformanceTests_MongoDBIO_IT/ws/PerfKitBenchmarker/perfkitbenchmarker/pkb.py",> line 646, in RunBenchmark
DoRunPhase(spec, collector, detailed_timer)
File "<https://builds.apache.org/job/beam_PerformanceTests_MongoDBIO_IT/ws/PerfKitBenchmarker/perfkitbenchmarker/pkb.py",> line 526, in DoRunPhase
samples = spec.BenchmarkRun(spec)
File "<https://builds.apache.org/job/beam_PerformanceTests_MongoDBIO_IT/ws/PerfKitBenchmarker/perfkitbenchmarker/linux_benchmarks/beam_integration_benchmark.py",> line 159, in Run
job_type=job_type)
File "<https://builds.apache.org/job/beam_PerformanceTests_MongoDBIO_IT/ws/PerfKitBenchmarker/perfkitbenchmarker/providers/gcp/gcp_dpb_dataflow.py",> line 90, in SubmitJob
assert retcode == 0, "Integration Test Failed."
AssertionError: Integration Test Failed.
2018-04-24 00:11:10,482 ea0ebd2a MainThread beam_integration_benchmark(1/1) INFO Cleaning up benchmark beam_integration_benchmark
2018-04-24 00:11:10,483 ea0ebd2a MainThread beam_integration_benchmark(1/1) INFO Running: kubectl --kubeconfig=<https://builds.apache.org/job/beam_PerformanceTests_MongoDBIO_IT/ws/config-mongodbioit-1524513708243> delete -f <https://builds.apache.org/job/beam_PerformanceTests_MongoDBIO_IT/ws/src/.test-infra/kubernetes/mongodb/load-balancer/mongo.yml>
2018-04-24 00:11:10,909 ea0ebd2a MainThread beam_integration_benchmark(1/1) ERROR Exception running benchmark
Traceback (most recent call last):
File "<https://builds.apache.org/job/beam_PerformanceTests_MongoDBIO_IT/ws/PerfKitBenchmarker/perfkitbenchmarker/pkb.py",> line 780, in RunBenchmarkTask
RunBenchmark(spec, collector)
File "<https://builds.apache.org/job/beam_PerformanceTests_MongoDBIO_IT/ws/PerfKitBenchmarker/perfkitbenchmarker/pkb.py",> line 646, in RunBenchmark
DoRunPhase(spec, collector, detailed_timer)
File "<https://builds.apache.org/job/beam_PerformanceTests_MongoDBIO_IT/ws/PerfKitBenchmarker/perfkitbenchmarker/pkb.py",> line 526, in DoRunPhase
samples = spec.BenchmarkRun(spec)
File "<https://builds.apache.org/job/beam_PerformanceTests_MongoDBIO_IT/ws/PerfKitBenchmarker/perfkitbenchmarker/linux_benchmarks/beam_integration_benchmark.py",> line 159, in Run
job_type=job_type)
File "<https://builds.apache.org/job/beam_PerformanceTests_MongoDBIO_IT/ws/PerfKitBenchmarker/perfkitbenchmarker/providers/gcp/gcp_dpb_dataflow.py",> line 90, in SubmitJob
assert retcode == 0, "Integration Test Failed."
AssertionError: Integration Test Failed.
2018-04-24 00:11:10,910 ea0ebd2a MainThread beam_integration_benchmark(1/1) ERROR Benchmark 1/1 beam_integration_benchmark (UID: beam_integration_benchmark0) failed. Execution will continue.
2018-04-24 00:11:10,965 ea0ebd2a MainThread INFO Benchmark run statuses:
---------------------------------------------------------------------------------
Name UID Status Failed Substatus
---------------------------------------------------------------------------------
beam_integration_benchmark beam_integration_benchmark0 FAILED
---------------------------------------------------------------------------------
Success rate: 0.00% (0/1)
2018-04-24 00:11:10,966 ea0ebd2a MainThread INFO Complete logs can be found at: <https://builds.apache.org/job/beam_PerformanceTests_MongoDBIO_IT/ws/runs/ea0ebd2a/pkb.log>
2018-04-24 00:11:10,966 ea0ebd2a MainThread INFO Completion statuses can be found at: <https://builds.apache.org/job/beam_PerformanceTests_MongoDBIO_IT/ws/runs/ea0ebd2a/completion_statuses.json>
Build step 'Execute shell' marked build as failure