You are viewing a plain text version of this content. The canonical link for it is here.
Posted to builds@beam.apache.org by Apache Jenkins Server <je...@builds.apache.org> on 2022/04/14 19:40:34 UTC
Build failed in Jenkins: beam_PostCommit_Go_VR_Flink #6035
See <https://ci-beam.apache.org/job/beam_PostCommit_Go_VR_Flink/6035/display/redirect?page=changes>
Changes:
[Kenneth Knowles] Upgrade to Gradle 7.4
[Kenneth Knowles] Remove Python module dependency on Dataflow worker
[noreply] [BEAM-13925] Dont double assign committers if author or other reviewer
[noreply] [BEAM-13739] Remove deprecated shallow clone funcs (#17362)
[noreply] [BEAM-11104] Pipe Continuation to DataSource level (#17334)
[noreply] [BEAM-11105] Basic Watermark Estimation (Wall Clock Observing) (#17267)
[noreply] Respect output coder for TextIO. (#17367)
------------------------------------------
[...truncated 42.31 KB...]
- Gradle detected a problem with the following location: '<https://ci-beam.apache.org/job/beam_PostCommit_Go_VR_Flink/ws/src/sdks/java/container/build/target'.> Reason: Task ':sdks:java:container:java11:copySdkHarnessLauncher' uses this output of task ':sdks:java:container:pullLicenses' without declaring an explicit or implicit dependency. This can lead to incorrect results being produced, depending on what order the tasks are executed. Please refer to https://docs.gradle.org/7.4/userguide/validation_problems.html#implicit_dependency for more details about this problem.
> Task :sdks:java:container:java8:copySdkHarnessLauncher
Execution optimizations have been disabled for task ':sdks:java:container:java8:copySdkHarnessLauncher' to ensure correctness due to the following reasons:
- Gradle detected a problem with the following location: '<https://ci-beam.apache.org/job/beam_PostCommit_Go_VR_Flink/ws/src/sdks/java/container/build/target'.> Reason: Task ':sdks:java:container:java8:copySdkHarnessLauncher' uses this output of task ':sdks:java:container:downloadCloudProfilerAgent' without declaring an explicit or implicit dependency. This can lead to incorrect results being produced, depending on what order the tasks are executed. Please refer to https://docs.gradle.org/7.4/userguide/validation_problems.html#implicit_dependency for more details about this problem.
- Gradle detected a problem with the following location: '<https://ci-beam.apache.org/job/beam_PostCommit_Go_VR_Flink/ws/src/sdks/java/container/build/target'.> Reason: Task ':sdks:java:container:java8:copySdkHarnessLauncher' uses this output of task ':sdks:java:container:pullLicenses' without declaring an explicit or implicit dependency. This can lead to incorrect results being produced, depending on what order the tasks are executed. Please refer to https://docs.gradle.org/7.4/userguide/validation_problems.html#implicit_dependency for more details about this problem.
> Task :release:go-licenses:go:dockerRun
+ tee /output/licenses/list.csv
+ go-licenses csv github.com/apache/beam/sdks/go/container
+ chmod -R a+w /output/licenses
> Task :release:go-licenses:go:createLicenses
> Task :sdks:go:container:copyGolangLicenses
> Task :sdks:go:container:dockerPrepare
> Task :release:go-licenses:java:dockerRun
+ go-licenses save github.com/apache/beam/sdks/java/container --save_path=/output/licenses
+ go-licenses csv github.com/apache/beam/sdks/java/container
+ tee /output/licenses/list.csv
> Task :sdks:go:container:docker
> Task :release:go-licenses:java:dockerRun
github.com/golang/protobuf,https://github.com/golang/protobuf/blob/master/LICENSE,BSD-3-Clause
google.golang.org/genproto/googleapis/rpc/status,https://github.com/googleapis/go-genproto/blob/master/LICENSE,Apache-2.0
golang.org/x/net,https://go.googlesource.com/net/+/refs/heads/master/LICENSE,BSD-3-Clause
golang.org/x/sys,https://go.googlesource.com/sys/+/refs/heads/master/LICENSE,BSD-3-Clause
google.golang.org/protobuf,https://go.googlesource.com/protobuf/+/refs/heads/master/LICENSE,BSD-3-Clause
golang.org/x/text,https://go.googlesource.com/text/+/refs/heads/master/LICENSE,BSD-3-Clause
github.com/apache/beam/sdks/java/container,https://github.com/apache/beam/blob/master/LICENSE,Apache-2.0
github.com/apache/beam/sdks/go/pkg/beam,https://github.com/apache/beam/blob/master/sdks/go/README.md,Apache-2.0
google.golang.org/grpc,https://github.com/grpc/grpc-go/blob/master/LICENSE,Apache-2.0
+ chmod -R a+w /output/licenses
> Task :release:go-licenses:java:createLicenses
> Task :sdks:java:container:java11:copyGolangLicenses
> Task :sdks:java:container:java8:copyGolangLicenses
> Task :sdks:java:core:compileJava
Note: Some input files use or override a deprecated API.
Note: Recompile with -Xlint:deprecation for details.
Note: Some input files use unchecked or unsafe operations.
Note: Recompile with -Xlint:unchecked for details.
> Task :sdks:java:core:classes
> Task :sdks:java:core:shadowJar
> Task :sdks:java:extensions:protobuf:extractIncludeProto
> Task :sdks:java:extensions:protobuf:generateProto NO-SOURCE
> Task :sdks:java:io:hadoop-common:compileJava
warning: Memory constraints are impeding performance; please increase max heap size.
> Task :sdks:java:fn-execution:compileJava
> Task :runners:local-java:compileJava
> Task :sdks:java:extensions:arrow:compileJava
> Task :sdks:java:extensions:join-library:compileJava
> Task :sdks:java:io:mongodb:compileJava
> Task :sdks:java:io:amazon-web-services2:compileJava
> Task :sdks:java:io:hadoop-common:compileJava FAILED
error: warnings found and -Werror specified
1 error
1 warning
> Task :sdks:java:extensions:protobuf:compileJava
> Task :runners:local-java:classes
> Task :runners:local-java:jar
> Task :sdks:java:extensions:arrow:classes
> Task :sdks:java:extensions:arrow:jar
> Task :sdks:java:extensions:join-library:compileJava
Note: <https://ci-beam.apache.org/job/beam_PostCommit_Go_VR_Flink/ws/src/sdks/java/extensions/join-library/src/main/java/org/apache/beam/sdk/extensions/joinlibrary/Join.java> uses unchecked or unsafe operations.
Note: Recompile with -Xlint:unchecked for details.
> Task :sdks:java:extensions:join-library:classes
> Task :sdks:java:extensions:join-library:jar
> Task :sdks:java:io:mongodb:compileJava
Note: Some input files use or override a deprecated API.
Note: Recompile with -Xlint:deprecation for details.
Note: Some input files use unchecked or unsafe operations.
Note: Recompile with -Xlint:unchecked for details.
> Task :sdks:java:io:mongodb:classes
> Task :sdks:java:io:mongodb:jar
> Task :sdks:java:fn-execution:compileJava
Note: Some input files use or override a deprecated API.
Note: Recompile with -Xlint:deprecation for details.
Note: Some input files use unchecked or unsafe operations.
Note: Recompile with -Xlint:unchecked for details.
> Task :sdks:java:fn-execution:classes
> Task :sdks:java:fn-execution:jar
> Task :runners:core-construction-java:compileJava
> Task :sdks:java:extensions:protobuf:compileJava
Note: Some input files use or override a deprecated API.
Note: Recompile with -Xlint:deprecation for details.
Note: Some input files use unchecked or unsafe operations.
Note: Recompile with -Xlint:unchecked for details.
> Task :sdks:java:extensions:protobuf:classes
> Task :sdks:java:extensions:protobuf:jar
> Task :sdks:java:io:amazon-web-services2:compileJava
Note: Some input files use or override a deprecated API.
Note: Recompile with -Xlint:deprecation for details.
Note: Some input files use unchecked or unsafe operations.
Note: Recompile with -Xlint:unchecked for details.
> Task :sdks:java:io:amazon-web-services2:classes
> Task :sdks:java:io:amazon-web-services2:jar
> Task :runners:core-construction-java:compileJava
Note: Some input files use or override a deprecated API.
Note: Recompile with -Xlint:deprecation for details.
Note: Some input files use unchecked or unsafe operations.
Note: Recompile with -Xlint:unchecked for details.
> Task :runners:core-construction-java:classes
> Task :runners:core-construction-java:jar
> Task :runners:core-java:compileJava
Note: Some input files use or override a deprecated API.
Note: Recompile with -Xlint:deprecation for details.
Note: Some input files use unchecked or unsafe operations.
Note: Recompile with -Xlint:unchecked for details.
> Task :runners:core-java:classes
> Task :runners:core-java:jar
> Task :sdks:java:extensions:google-cloud-platform-core:compileJava
Note: Some input files use or override a deprecated API.
Note: Recompile with -Xlint:deprecation for details.
> Task :sdks:java:extensions:google-cloud-platform-core:classes
> Task :sdks:java:extensions:google-cloud-platform-core:jar
> Task :sdks:java:harness:compileJava
Note: Some input files use or override a deprecated API.
Note: Recompile with -Xlint:deprecation for details.
Note: Some input files use unchecked or unsafe operations.
Note: Recompile with -Xlint:unchecked for details.
> Task :sdks:java:harness:classes
> Task :sdks:java:harness:jar
> Task :runners:java-fn-execution:compileJava
> Task :sdks:java:harness:shadowJar
> Task :runners:java-fn-execution:compileJava
Note: Some input files use or override a deprecated API.
Note: Recompile with -Xlint:deprecation for details.
Note: Some input files use unchecked or unsafe operations.
Note: Recompile with -Xlint:unchecked for details.
> Task :runners:java-fn-execution:classes
> Task :runners:java-fn-execution:jar
> Task :runners:direct-java:compileJava
> Task :sdks:java:expansion-service:compileJava
Note: Some input files use unchecked or unsafe operations.
Note: Recompile with -Xlint:unchecked for details.
> Task :sdks:java:expansion-service:classes
> Task :sdks:java:expansion-service:jar
> Task :runners:java-job-service:compileJava
> Task :sdks:java:io:google-cloud-platform:compileJava
> Task :sdks:java:io:kafka:compileJava
> Task :runners:java-job-service:compileJava
Note: <https://ci-beam.apache.org/job/beam_PostCommit_Go_VR_Flink/ws/src/runners/java-job-service/src/main/java/org/apache/beam/runners/jobsubmission/PortablePipelineJarCreator.java> uses unchecked or unsafe operations.
Note: Recompile with -Xlint:unchecked for details.
> Task :runners:java-job-service:classes
> Task :runners:java-job-service:jar
> Task :runners:flink:1.14:compileJava
> Task :sdks:java:io:kafka:compileJava
Note: Some input files use or override a deprecated API.
Note: Recompile with -Xlint:deprecation for details.
Note: Some input files use unchecked or unsafe operations.
Note: Recompile with -Xlint:unchecked for details.
> Task :sdks:java:io:kafka:classes
> Task :sdks:java:io:kafka:jar
> Task :sdks:java:container:java11:copyDockerfileDependencies
> Task :sdks:java:container:java8:copyDockerfileDependencies
> Task :sdks:java:container:java11:dockerPrepare
> Task :sdks:java:container:java8:dockerPrepare
> Task :runners:direct-java:compileJava
Note: Some input files use or override a deprecated API.
Note: Recompile with -Xlint:deprecation for details.
Note: Some input files use unchecked or unsafe operations.
Note: Recompile with -Xlint:unchecked for details.
> Task :runners:direct-java:classes
> Task :sdks:java:container:java11:docker
> Task :sdks:java:container:java8:docker
> Task :runners:direct-java:shadowJar
> Task :runners:flink:1.14:compileJava
Note: Some input files use or override a deprecated API.
Note: Recompile with -Xlint:deprecation for details.
Note: Some input files use unchecked or unsafe operations.
Note: Recompile with -Xlint:unchecked for details.
> Task :runners:flink:1.14:classes
> Task :runners:flink:1.14:jar
> Task :runners:flink:1.14:job-server:compileJava NO-SOURCE
> Task :runners:flink:1.14:job-server:classes UP-TO-DATE
> Task :sdks:java:io:google-cloud-platform:compileJava
Note: Some input files use or override a deprecated API.
Note: Recompile with -Xlint:deprecation for details.
Note: Some input files use unchecked or unsafe operations.
Note: Recompile with -Xlint:unchecked for details.
> Task :sdks:java:io:google-cloud-platform:classes
> Task :sdks:java:io:google-cloud-platform:jar
FAILURE: Build failed with an exception.
* What went wrong:
Execution failed for task ':sdks:java:io:hadoop-common:compileJava'.
> Compilation failed; see the compiler error output for details.
* Try:
> Run with --stacktrace option to get the stack trace.
> Run with --info or --debug option to get more log output.
> Run with --scan to get full insights.
* Get more help at https://help.gradle.org
Deprecated Gradle features were used in this build, making it incompatible with Gradle 8.0.
You can use '--warning-mode all' to show the individual deprecation warnings and determine if they come from your own scripts or plugins.
See https://docs.gradle.org/7.4/userguide/command_line_interface.html#sec:command_line_warnings
Execution optimizations have been disabled for 2 invalid unit(s) of work during this build to ensure correctness.
Please consult deprecation warnings for more details.
BUILD FAILED in 50m 27s
154 actionable tasks: 136 executed, 12 from cache, 6 up-to-date
Publishing build scan...
https://gradle.com/s/pyf5wq6xle7no
Build step 'Invoke Gradle script' changed build result to FAILURE
Build step 'Invoke Gradle script' marked build as failure
---------------------------------------------------------------------
To unsubscribe, e-mail: builds-unsubscribe@beam.apache.org
For additional commands, e-mail: builds-help@beam.apache.org
Jenkins build is back to normal : beam_PostCommit_Go_VR_Flink #6036
Posted by Apache Jenkins Server <je...@builds.apache.org>.
See <https://ci-beam.apache.org/job/beam_PostCommit_Go_VR_Flink/6036/display/redirect?page=changes>
---------------------------------------------------------------------
To unsubscribe, e-mail: builds-unsubscribe@beam.apache.org
For additional commands, e-mail: builds-help@beam.apache.org