You are viewing a plain text version of this content. The canonical link for it is here.
Posted to builds@solr.apache.org by Apache Jenkins Server <je...@builds.apache.org> on 2021/12/20 14:13:49 UTC
[JENKINS] Solr » Solr-Check-main - Build # 2420 - Still Unstable!
Build: https://ci-builds.apache.org/job/Solr/job/Solr-Check-main/2420/
2 tests failed.
FAILED: org.apache.solr.cloud.OverseerCollectionConfigSetProcessorTest.testNoReplicationLimitedNodesToCreateOnOverseer
Error Message:
java.lang.AssertionError: node name mismatch for coreName=mycollection_shard1_replica_n1 ( actual=localhost:8963/solr versus expected=localhost:8964/solr )
Stack Trace:
java.lang.AssertionError: node name mismatch for coreName=mycollection_shard1_replica_n1 ( actual=localhost:8963/solr versus expected=localhost:8964/solr )
at __randomizedtesting.SeedInfo.seed([DC3CF3CC7841ED32:CADEA5920857C18]:0)
at org.junit.Assert.fail(Assert.java:89)
at org.junit.Assert.assertTrue(Assert.java:42)
at org.apache.solr.cloud.OverseerCollectionConfigSetProcessorTest.verifySubmitCaptures(OverseerCollectionConfigSetProcessorTest.java:702)
at org.apache.solr.cloud.OverseerCollectionConfigSetProcessorTest.testTemplate(OverseerCollectionConfigSetProcessorTest.java:815)
at org.apache.solr.cloud.OverseerCollectionConfigSetProcessorTest.testNoReplicationLimitedNodesToCreateOnInternal(OverseerCollectionConfigSetProcessorTest.java:1001)
at org.apache.solr.cloud.OverseerCollectionConfigSetProcessorTest.testNoReplicationLimitedNodesToCreateOnOverseer(OverseerCollectionConfigSetProcessorTest.java:987)
at java.base/jdk.internal.reflect.NativeMethodAccessorImpl.invoke0(Native Method)
at java.base/jdk.internal.reflect.NativeMethodAccessorImpl.invoke(NativeMethodAccessorImpl.java:62)
at java.base/jdk.internal.reflect.DelegatingMethodAccessorImpl.invoke(DelegatingMethodAccessorImpl.java:43)
at java.base/java.lang.reflect.Method.invoke(Method.java:566)
at com.carrotsearch.randomizedtesting.RandomizedRunner.invoke(RandomizedRunner.java:1754)
at com.carrotsearch.randomizedtesting.RandomizedRunner$8.evaluate(RandomizedRunner.java:942)
at com.carrotsearch.randomizedtesting.RandomizedRunner$9.evaluate(RandomizedRunner.java:978)
at com.carrotsearch.randomizedtesting.RandomizedRunner$10.evaluate(RandomizedRunner.java:992)
at com.carrotsearch.randomizedtesting.rules.SystemPropertiesRestoreRule$1.evaluate(SystemPropertiesRestoreRule.java:57)
at org.junit.rules.RunRules.evaluate(RunRules.java:20)
at org.apache.lucene.util.TestRuleSetupTeardownChained$1.evaluate(TestRuleSetupTeardownChained.java:44)
at org.apache.lucene.util.AbstractBeforeAfterRule$1.evaluate(AbstractBeforeAfterRule.java:43)
at org.apache.lucene.util.TestRuleThreadAndTestName$1.evaluate(TestRuleThreadAndTestName.java:45)
at org.apache.lucene.util.TestRuleIgnoreAfterMaxFailures$1.evaluate(TestRuleIgnoreAfterMaxFailures.java:60)
at org.apache.lucene.util.TestRuleMarkFailure$1.evaluate(TestRuleMarkFailure.java:44)
at org.junit.rules.RunRules.evaluate(RunRules.java:20)
at com.carrotsearch.randomizedtesting.rules.StatementAdapter.evaluate(StatementAdapter.java:36)
at com.carrotsearch.randomizedtesting.ThreadLeakControl$StatementRunner.run(ThreadLeakControl.java:370)
at com.carrotsearch.randomizedtesting.ThreadLeakControl.forkTimeoutingTask(ThreadLeakControl.java:819)
at com.carrotsearch.randomizedtesting.ThreadLeakControl$3.evaluate(ThreadLeakControl.java:470)
at com.carrotsearch.randomizedtesting.RandomizedRunner.runSingleTest(RandomizedRunner.java:951)
at com.carrotsearch.randomizedtesting.RandomizedRunner$5.evaluate(RandomizedRunner.java:836)
at com.carrotsearch.randomizedtesting.RandomizedRunner$6.evaluate(RandomizedRunner.java:887)
at com.carrotsearch.randomizedtesting.RandomizedRunner$7.evaluate(RandomizedRunner.java:898)
at com.carrotsearch.randomizedtesting.rules.StatementAdapter.evaluate(StatementAdapter.java:36)
at org.apache.lucene.util.AbstractBeforeAfterRule$1.evaluate(AbstractBeforeAfterRule.java:43)
at org.apache.lucene.util.AbstractBeforeAfterRule$1.evaluate(AbstractBeforeAfterRule.java:43)
at com.carrotsearch.randomizedtesting.rules.SystemPropertiesRestoreRule$1.evaluate(SystemPropertiesRestoreRule.java:57)
at org.junit.rules.RunRules.evaluate(RunRules.java:20)
at org.apache.lucene.util.AbstractBeforeAfterRule$1.evaluate(AbstractBeforeAfterRule.java:43)
at com.carrotsearch.randomizedtesting.rules.StatementAdapter.evaluate(StatementAdapter.java:36)
at org.apache.lucene.util.TestRuleStoreClassName$1.evaluate(TestRuleStoreClassName.java:38)
at com.carrotsearch.randomizedtesting.rules.NoShadowingOrOverridesOnMethodsRule$1.evaluate(NoShadowingOrOverridesOnMethodsRule.java:40)
at com.carrotsearch.randomizedtesting.rules.NoShadowingOrOverridesOnMethodsRule$1.evaluate(NoShadowingOrOverridesOnMethodsRule.java:40)
at com.carrotsearch.randomizedtesting.rules.StatementAdapter.evaluate(StatementAdapter.java:36)
at com.carrotsearch.randomizedtesting.rules.StatementAdapter.evaluate(StatementAdapter.java:36)
at org.apache.lucene.util.TestRuleAssertionsRequired$1.evaluate(TestRuleAssertionsRequired.java:53)
at org.apache.lucene.util.AbstractBeforeAfterRule$1.evaluate(AbstractBeforeAfterRule.java:43)
at org.apache.lucene.util.TestRuleMarkFailure$1.evaluate(TestRuleMarkFailure.java:44)
at org.apache.lucene.util.TestRuleIgnoreAfterMaxFailures$1.evaluate(TestRuleIgnoreAfterMaxFailures.java:60)
at org.apache.lucene.util.TestRuleIgnoreTestSuites$1.evaluate(TestRuleIgnoreTestSuites.java:47)
at org.junit.rules.RunRules.evaluate(RunRules.java:20)
at com.carrotsearch.randomizedtesting.rules.StatementAdapter.evaluate(StatementAdapter.java:36)
at com.carrotsearch.randomizedtesting.ThreadLeakControl$StatementRunner.run(ThreadLeakControl.java:370)
at com.carrotsearch.randomizedtesting.ThreadLeakControl.lambda$forkTimeoutingTask$0(ThreadLeakControl.java:826)
at java.base/java.lang.Thread.run(Thread.java:834)
FAILED: org.apache.solr.cloud.OverseerCollectionConfigSetProcessorTest.testNoReplicationEqualNumberOfSlicesPerNodeSendCreateNodesEqualToLiveNodesOverseer
Error Message:
java.lang.AssertionError: node name mismatch for coreName=mycollection_shard1_replica_n1 ( actual=localhost:8963/solr versus expected=localhost:8965/solr )
Stack Trace:
java.lang.AssertionError: node name mismatch for coreName=mycollection_shard1_replica_n1 ( actual=localhost:8963/solr versus expected=localhost:8965/solr )
at __randomizedtesting.SeedInfo.seed([DC3CF3CC7841ED32:B456472B9ACAC576]:0)
at org.junit.Assert.fail(Assert.java:89)
at org.junit.Assert.assertTrue(Assert.java:42)
at org.apache.solr.cloud.OverseerCollectionConfigSetProcessorTest.verifySubmitCaptures(OverseerCollectionConfigSetProcessorTest.java:702)
at org.apache.solr.cloud.OverseerCollectionConfigSetProcessorTest.testTemplate(OverseerCollectionConfigSetProcessorTest.java:815)
at org.apache.solr.cloud.OverseerCollectionConfigSetProcessorTest.testNoReplicationEqualNumberOfSlicesPerNodeSendCreateNodesEqualToLiveNodesInternal(OverseerCollectionConfigSetProcessorTest.java:881)
at org.apache.solr.cloud.OverseerCollectionConfigSetProcessorTest.testNoReplicationEqualNumberOfSlicesPerNodeSendCreateNodesEqualToLiveNodesOverseer(OverseerCollectionConfigSetProcessorTest.java:867)
at java.base/jdk.internal.reflect.NativeMethodAccessorImpl.invoke0(Native Method)
at java.base/jdk.internal.reflect.NativeMethodAccessorImpl.invoke(NativeMethodAccessorImpl.java:62)
at java.base/jdk.internal.reflect.DelegatingMethodAccessorImpl.invoke(DelegatingMethodAccessorImpl.java:43)
at java.base/java.lang.reflect.Method.invoke(Method.java:566)
at com.carrotsearch.randomizedtesting.RandomizedRunner.invoke(RandomizedRunner.java:1754)
at com.carrotsearch.randomizedtesting.RandomizedRunner$8.evaluate(RandomizedRunner.java:942)
at com.carrotsearch.randomizedtesting.RandomizedRunner$9.evaluate(RandomizedRunner.java:978)
at com.carrotsearch.randomizedtesting.RandomizedRunner$10.evaluate(RandomizedRunner.java:992)
at com.carrotsearch.randomizedtesting.rules.SystemPropertiesRestoreRule$1.evaluate(SystemPropertiesRestoreRule.java:57)
at org.junit.rules.RunRules.evaluate(RunRules.java:20)
at org.apache.lucene.util.TestRuleSetupTeardownChained$1.evaluate(TestRuleSetupTeardownChained.java:44)
at org.apache.lucene.util.AbstractBeforeAfterRule$1.evaluate(AbstractBeforeAfterRule.java:43)
at org.apache.lucene.util.TestRuleThreadAndTestName$1.evaluate(TestRuleThreadAndTestName.java:45)
at org.apache.lucene.util.TestRuleIgnoreAfterMaxFailures$1.evaluate(TestRuleIgnoreAfterMaxFailures.java:60)
at org.apache.lucene.util.TestRuleMarkFailure$1.evaluate(TestRuleMarkFailure.java:44)
at org.junit.rules.RunRules.evaluate(RunRules.java:20)
at com.carrotsearch.randomizedtesting.rules.StatementAdapter.evaluate(StatementAdapter.java:36)
at com.carrotsearch.randomizedtesting.ThreadLeakControl$StatementRunner.run(ThreadLeakControl.java:370)
at com.carrotsearch.randomizedtesting.ThreadLeakControl.forkTimeoutingTask(ThreadLeakControl.java:819)
at com.carrotsearch.randomizedtesting.ThreadLeakControl$3.evaluate(ThreadLeakControl.java:470)
at com.carrotsearch.randomizedtesting.RandomizedRunner.runSingleTest(RandomizedRunner.java:951)
at com.carrotsearch.randomizedtesting.RandomizedRunner$5.evaluate(RandomizedRunner.java:836)
at com.carrotsearch.randomizedtesting.RandomizedRunner$6.evaluate(RandomizedRunner.java:887)
at com.carrotsearch.randomizedtesting.RandomizedRunner$7.evaluate(RandomizedRunner.java:898)
at com.carrotsearch.randomizedtesting.rules.StatementAdapter.evaluate(StatementAdapter.java:36)
at org.apache.lucene.util.AbstractBeforeAfterRule$1.evaluate(AbstractBeforeAfterRule.java:43)
at org.apache.lucene.util.AbstractBeforeAfterRule$1.evaluate(AbstractBeforeAfterRule.java:43)
at com.carrotsearch.randomizedtesting.rules.SystemPropertiesRestoreRule$1.evaluate(SystemPropertiesRestoreRule.java:57)
at org.junit.rules.RunRules.evaluate(RunRules.java:20)
at org.apache.lucene.util.AbstractBeforeAfterRule$1.evaluate(AbstractBeforeAfterRule.java:43)
at com.carrotsearch.randomizedtesting.rules.StatementAdapter.evaluate(StatementAdapter.java:36)
at org.apache.lucene.util.TestRuleStoreClassName$1.evaluate(TestRuleStoreClassName.java:38)
at com.carrotsearch.randomizedtesting.rules.NoShadowingOrOverridesOnMethodsRule$1.evaluate(NoShadowingOrOverridesOnMethodsRule.java:40)
at com.carrotsearch.randomizedtesting.rules.NoShadowingOrOverridesOnMethodsRule$1.evaluate(NoShadowingOrOverridesOnMethodsRule.java:40)
at com.carrotsearch.randomizedtesting.rules.StatementAdapter.evaluate(StatementAdapter.java:36)
at com.carrotsearch.randomizedtesting.rules.StatementAdapter.evaluate(StatementAdapter.java:36)
at org.apache.lucene.util.TestRuleAssertionsRequired$1.evaluate(TestRuleAssertionsRequired.java:53)
at org.apache.lucene.util.AbstractBeforeAfterRule$1.evaluate(AbstractBeforeAfterRule.java:43)
at org.apache.lucene.util.TestRuleMarkFailure$1.evaluate(TestRuleMarkFailure.java:44)
at org.apache.lucene.util.TestRuleIgnoreAfterMaxFailures$1.evaluate(TestRuleIgnoreAfterMaxFailures.java:60)
at org.apache.lucene.util.TestRuleIgnoreTestSuites$1.evaluate(TestRuleIgnoreTestSuites.java:47)
at org.junit.rules.RunRules.evaluate(RunRules.java:20)
at com.carrotsearch.randomizedtesting.rules.StatementAdapter.evaluate(StatementAdapter.java:36)
at com.carrotsearch.randomizedtesting.ThreadLeakControl$StatementRunner.run(ThreadLeakControl.java:370)
at com.carrotsearch.randomizedtesting.ThreadLeakControl.lambda$forkTimeoutingTask$0(ThreadLeakControl.java:826)
at java.base/java.lang.Thread.run(Thread.java:834)
Build Log:
[...truncated 1852 lines...]
ERROR: The following test(s) have failed:
- org.apache.solr.cloud.OverseerCollectionConfigSetProcessorTest.testNoReplicationLimitedNodesToCreateOnOverseer (:solr:core)
Test output: /home/jenkins/jenkins-slave/workspace/Solr/Solr-Check-main/solr/core/build/test-results/test/outputs/OUTPUT-org.apache.solr.cloud.OverseerCollectionConfigSetProcessorTest.txt
Reproduce with: gradlew :solr:core:test --tests "org.apache.solr.cloud.OverseerCollectionConfigSetProcessorTest.testNoReplicationLimitedNodesToCreateOnOverseer" -Ptests.jvms=4 -Ptests.haltonfailure=false -Ptests.jvmargs=-XX:TieredStopAtLevel=1 -Ptests.seed=DC3CF3CC7841ED32 -Ptests.multiplier=2 -Ptests.badapples=false -Ptests.file.encoding=UTF-8
- org.apache.solr.cloud.OverseerCollectionConfigSetProcessorTest.testNoReplicationEqualNumberOfSlicesPerNodeSendCreateNodesEqualToLiveNodesOverseer (:solr:core)
Test output: /home/jenkins/jenkins-slave/workspace/Solr/Solr-Check-main/solr/core/build/test-results/test/outputs/OUTPUT-org.apache.solr.cloud.OverseerCollectionConfigSetProcessorTest.txt
Reproduce with: gradlew :solr:core:test --tests "org.apache.solr.cloud.OverseerCollectionConfigSetProcessorTest.testNoReplicationEqualNumberOfSlicesPerNodeSendCreateNodesEqualToLiveNodesOverseer" -Ptests.jvms=4 -Ptests.haltonfailure=false -Ptests.jvmargs=-XX:TieredStopAtLevel=1 -Ptests.seed=DC3CF3CC7841ED32 -Ptests.multiplier=2 -Ptests.badapples=false -Ptests.file.encoding=UTF-8
Deprecated Gradle features were used in this build, making it incompatible with Gradle 8.0.
You can use '--warning-mode all' to show the individual deprecation warnings and determine if they come from your own scripts or plugins.
See https://docs.gradle.org/7.2/userguide/command_line_interface.html#sec:command_line_warnings
BUILD SUCCESSFUL in 52m 13s
407 actionable tasks: 407 executed
Build step 'Invoke Gradle script' changed build result to SUCCESS
Archiving artifacts
java.lang.InterruptedException: no matches found within 10000
at hudson.FilePath$ValidateAntFileMask.hasMatch(FilePath.java:3069)
at hudson.FilePath$ValidateAntFileMask.invoke(FilePath.java:2948)
at hudson.FilePath$ValidateAntFileMask.invoke(FilePath.java:2929)
at hudson.FilePath$FileCallableWrapper.call(FilePath.java:3317)
Also: hudson.remoting.Channel$CallSiteStackTrace: Remote call to lucene-solr-1
at hudson.remoting.Channel.attachCallSiteStackTrace(Channel.java:1800)
at hudson.remoting.UserRequest$ExceptionResponse.retrieve(UserRequest.java:356)
at hudson.remoting.Channel.call(Channel.java:1001)
at hudson.FilePath.act(FilePath.java:1159)
at hudson.FilePath.act(FilePath.java:1148)
at hudson.FilePath.validateAntFileMask(FilePath.java:2927)
at hudson.tasks.ArtifactArchiver.perform(ArtifactArchiver.java:270)
at hudson.tasks.BuildStepCompatibilityLayer.perform(BuildStepCompatibilityLayer.java:80)
at hudson.tasks.BuildStepMonitor$1.perform(BuildStepMonitor.java:20)
at hudson.model.AbstractBuild$AbstractBuildExecution.perform(AbstractBuild.java:803)
at hudson.model.AbstractBuild$AbstractBuildExecution.performAllBuildSteps(AbstractBuild.java:752)
at hudson.model.Build$BuildExecution.post2(Build.java:177)
at hudson.model.AbstractBuild$AbstractBuildExecution.post(AbstractBuild.java:697)
at hudson.model.Run.execute(Run.java:1931)
at hudson.model.FreeStyleBuild.run(FreeStyleBuild.java:43)
at hudson.model.ResourceController.execute(ResourceController.java:97)
at hudson.model.Executor.run(Executor.java:429)
Caused: hudson.FilePath$TunneledInterruptedException
at hudson.FilePath$FileCallableWrapper.call(FilePath.java:3319)
at hudson.remoting.UserRequest.perform(UserRequest.java:211)
at hudson.remoting.UserRequest.perform(UserRequest.java:54)
at hudson.remoting.Request$2.run(Request.java:376)
at hudson.remoting.InterceptingExecutorService.lambda$wrap$0(InterceptingExecutorService.java:78)
at java.util.concurrent.FutureTask.run(FutureTask.java:266)
at java.util.concurrent.ThreadPoolExecutor.runWorker(ThreadPoolExecutor.java:1149)
at java.util.concurrent.ThreadPoolExecutor$Worker.run(ThreadPoolExecutor.java:624)
at java.lang.Thread.run(Thread.java:748)
Caused: java.lang.InterruptedException: java.lang.InterruptedException: no matches found within 10000
at hudson.FilePath.act(FilePath.java:1161)
at hudson.FilePath.act(FilePath.java:1148)
at hudson.FilePath.validateAntFileMask(FilePath.java:2927)
at hudson.tasks.ArtifactArchiver.perform(ArtifactArchiver.java:270)
at hudson.tasks.BuildStepCompatibilityLayer.perform(BuildStepCompatibilityLayer.java:80)
at hudson.tasks.BuildStepMonitor$1.perform(BuildStepMonitor.java:20)
at hudson.model.AbstractBuild$AbstractBuildExecution.perform(AbstractBuild.java:803)
at hudson.model.AbstractBuild$AbstractBuildExecution.performAllBuildSteps(AbstractBuild.java:752)
at hudson.model.Build$BuildExecution.post2(Build.java:177)
at hudson.model.AbstractBuild$AbstractBuildExecution.post(AbstractBuild.java:697)
at hudson.model.Run.execute(Run.java:1931)
at hudson.model.FreeStyleBuild.run(FreeStyleBuild.java:43)
at hudson.model.ResourceController.execute(ResourceController.java:97)
at hudson.model.Executor.run(Executor.java:429)
No artifacts found that match the file pattern "**/*.events,heapdumps/**,**/hs_err_pid*". Configuration error?
Recording test results
[Checks API] No suitable checks publisher found.
Build step 'Publish JUnit test result report' changed build result to UNSTABLE
Email was triggered for: Unstable (Test Failures)
Sending email for trigger: Unstable (Test Failures)
[JENKINS] Solr » Solr-Check-main - Build # 2422 - Still Unstable!
Posted by Apache Jenkins Server <je...@builds.apache.org>.
Build: https://ci-builds.apache.org/job/Solr/job/Solr-Check-main/2422/
4 tests failed.
FAILED: org.apache.solr.cloud.OverseerCollectionConfigSetProcessorTest.testReplicationEqualNumberOfSlicesPerNodeSendCreateNodesEqualToLiveNodesDistributedUpdates
Error Message:
java.lang.AssertionError: node name mismatch for coreName=mycollection_shard2_replica_n3 ( actual=localhost:8965/solr versus expected=localhost:8966/solr )
Stack Trace:
java.lang.AssertionError: node name mismatch for coreName=mycollection_shard2_replica_n3 ( actual=localhost:8965/solr versus expected=localhost:8966/solr )
at __randomizedtesting.SeedInfo.seed([358D531AAE7FC187:B79DB8BFA641AF56]:0)
at org.junit.Assert.fail(Assert.java:89)
at org.junit.Assert.assertTrue(Assert.java:42)
at org.apache.solr.cloud.OverseerCollectionConfigSetProcessorTest.verifySubmitCaptures(OverseerCollectionConfigSetProcessorTest.java:702)
at org.apache.solr.cloud.OverseerCollectionConfigSetProcessorTest.testTemplate(OverseerCollectionConfigSetProcessorTest.java:815)
at org.apache.solr.cloud.OverseerCollectionConfigSetProcessorTest.testReplicationEqualNumberOfSlicesPerNodeSendCreateNodesEqualToLiveNodesInternal(OverseerCollectionConfigSetProcessorTest.java:901)
at org.apache.solr.cloud.OverseerCollectionConfigSetProcessorTest.testReplicationEqualNumberOfSlicesPerNodeSendCreateNodesEqualToLiveNodesDistributedUpdates(OverseerCollectionConfigSetProcessorTest.java:892)
at java.base/jdk.internal.reflect.NativeMethodAccessorImpl.invoke0(Native Method)
at java.base/jdk.internal.reflect.NativeMethodAccessorImpl.invoke(NativeMethodAccessorImpl.java:62)
at java.base/jdk.internal.reflect.DelegatingMethodAccessorImpl.invoke(DelegatingMethodAccessorImpl.java:43)
at java.base/java.lang.reflect.Method.invoke(Method.java:566)
at com.carrotsearch.randomizedtesting.RandomizedRunner.invoke(RandomizedRunner.java:1754)
at com.carrotsearch.randomizedtesting.RandomizedRunner$8.evaluate(RandomizedRunner.java:942)
at com.carrotsearch.randomizedtesting.RandomizedRunner$9.evaluate(RandomizedRunner.java:978)
at com.carrotsearch.randomizedtesting.RandomizedRunner$10.evaluate(RandomizedRunner.java:992)
at com.carrotsearch.randomizedtesting.rules.SystemPropertiesRestoreRule$1.evaluate(SystemPropertiesRestoreRule.java:57)
at org.junit.rules.RunRules.evaluate(RunRules.java:20)
at org.apache.lucene.util.TestRuleSetupTeardownChained$1.evaluate(TestRuleSetupTeardownChained.java:44)
at org.apache.lucene.util.AbstractBeforeAfterRule$1.evaluate(AbstractBeforeAfterRule.java:43)
at org.apache.lucene.util.TestRuleThreadAndTestName$1.evaluate(TestRuleThreadAndTestName.java:45)
at org.apache.lucene.util.TestRuleIgnoreAfterMaxFailures$1.evaluate(TestRuleIgnoreAfterMaxFailures.java:60)
at org.apache.lucene.util.TestRuleMarkFailure$1.evaluate(TestRuleMarkFailure.java:44)
at org.junit.rules.RunRules.evaluate(RunRules.java:20)
at com.carrotsearch.randomizedtesting.rules.StatementAdapter.evaluate(StatementAdapter.java:36)
at com.carrotsearch.randomizedtesting.ThreadLeakControl$StatementRunner.run(ThreadLeakControl.java:370)
at com.carrotsearch.randomizedtesting.ThreadLeakControl.forkTimeoutingTask(ThreadLeakControl.java:819)
at com.carrotsearch.randomizedtesting.ThreadLeakControl$3.evaluate(ThreadLeakControl.java:470)
at com.carrotsearch.randomizedtesting.RandomizedRunner.runSingleTest(RandomizedRunner.java:951)
at com.carrotsearch.randomizedtesting.RandomizedRunner$5.evaluate(RandomizedRunner.java:836)
at com.carrotsearch.randomizedtesting.RandomizedRunner$6.evaluate(RandomizedRunner.java:887)
at com.carrotsearch.randomizedtesting.RandomizedRunner$7.evaluate(RandomizedRunner.java:898)
at com.carrotsearch.randomizedtesting.rules.StatementAdapter.evaluate(StatementAdapter.java:36)
at org.apache.lucene.util.AbstractBeforeAfterRule$1.evaluate(AbstractBeforeAfterRule.java:43)
at org.apache.lucene.util.AbstractBeforeAfterRule$1.evaluate(AbstractBeforeAfterRule.java:43)
at com.carrotsearch.randomizedtesting.rules.SystemPropertiesRestoreRule$1.evaluate(SystemPropertiesRestoreRule.java:57)
at org.junit.rules.RunRules.evaluate(RunRules.java:20)
at org.apache.lucene.util.AbstractBeforeAfterRule$1.evaluate(AbstractBeforeAfterRule.java:43)
at com.carrotsearch.randomizedtesting.rules.StatementAdapter.evaluate(StatementAdapter.java:36)
at org.apache.lucene.util.TestRuleStoreClassName$1.evaluate(TestRuleStoreClassName.java:38)
at com.carrotsearch.randomizedtesting.rules.NoShadowingOrOverridesOnMethodsRule$1.evaluate(NoShadowingOrOverridesOnMethodsRule.java:40)
at com.carrotsearch.randomizedtesting.rules.NoShadowingOrOverridesOnMethodsRule$1.evaluate(NoShadowingOrOverridesOnMethodsRule.java:40)
at com.carrotsearch.randomizedtesting.rules.StatementAdapter.evaluate(StatementAdapter.java:36)
at com.carrotsearch.randomizedtesting.rules.StatementAdapter.evaluate(StatementAdapter.java:36)
at org.apache.lucene.util.TestRuleAssertionsRequired$1.evaluate(TestRuleAssertionsRequired.java:53)
at org.apache.lucene.util.AbstractBeforeAfterRule$1.evaluate(AbstractBeforeAfterRule.java:43)
at org.apache.lucene.util.TestRuleMarkFailure$1.evaluate(TestRuleMarkFailure.java:44)
at org.apache.lucene.util.TestRuleIgnoreAfterMaxFailures$1.evaluate(TestRuleIgnoreAfterMaxFailures.java:60)
at org.apache.lucene.util.TestRuleIgnoreTestSuites$1.evaluate(TestRuleIgnoreTestSuites.java:47)
at org.junit.rules.RunRules.evaluate(RunRules.java:20)
at com.carrotsearch.randomizedtesting.rules.StatementAdapter.evaluate(StatementAdapter.java:36)
at com.carrotsearch.randomizedtesting.ThreadLeakControl$StatementRunner.run(ThreadLeakControl.java:370)
at com.carrotsearch.randomizedtesting.ThreadLeakControl.lambda$forkTimeoutingTask$0(ThreadLeakControl.java:826)
at java.base/java.lang.Thread.run(Thread.java:834)
FAILED: org.apache.solr.cloud.OverseerCollectionConfigSetProcessorTest.testNoReplicationEqualNumberOfSlicesPerNodeSendCreateNodesEqualToLiveNodesDistributedUpdates
Error Message:
java.lang.AssertionError: node name mismatch for coreName=mycollection_shard1_replica_n1 ( actual=localhost:8963/solr versus expected=localhost:8965/solr )
Stack Trace:
java.lang.AssertionError: node name mismatch for coreName=mycollection_shard1_replica_n1 ( actual=localhost:8963/solr versus expected=localhost:8965/solr )
at __randomizedtesting.SeedInfo.seed([358D531AAE7FC187:B8999D831AAA3A9F]:0)
at org.junit.Assert.fail(Assert.java:89)
at org.junit.Assert.assertTrue(Assert.java:42)
at org.apache.solr.cloud.OverseerCollectionConfigSetProcessorTest.verifySubmitCaptures(OverseerCollectionConfigSetProcessorTest.java:702)
at org.apache.solr.cloud.OverseerCollectionConfigSetProcessorTest.testTemplate(OverseerCollectionConfigSetProcessorTest.java:815)
at org.apache.solr.cloud.OverseerCollectionConfigSetProcessorTest.testNoReplicationEqualNumberOfSlicesPerNodeSendCreateNodesEqualToLiveNodesInternal(OverseerCollectionConfigSetProcessorTest.java:881)
at org.apache.solr.cloud.OverseerCollectionConfigSetProcessorTest.testNoReplicationEqualNumberOfSlicesPerNodeSendCreateNodesEqualToLiveNodesDistributedUpdates(OverseerCollectionConfigSetProcessorTest.java:872)
at java.base/jdk.internal.reflect.NativeMethodAccessorImpl.invoke0(Native Method)
at java.base/jdk.internal.reflect.NativeMethodAccessorImpl.invoke(NativeMethodAccessorImpl.java:62)
at java.base/jdk.internal.reflect.DelegatingMethodAccessorImpl.invoke(DelegatingMethodAccessorImpl.java:43)
at java.base/java.lang.reflect.Method.invoke(Method.java:566)
at com.carrotsearch.randomizedtesting.RandomizedRunner.invoke(RandomizedRunner.java:1754)
at com.carrotsearch.randomizedtesting.RandomizedRunner$8.evaluate(RandomizedRunner.java:942)
at com.carrotsearch.randomizedtesting.RandomizedRunner$9.evaluate(RandomizedRunner.java:978)
at com.carrotsearch.randomizedtesting.RandomizedRunner$10.evaluate(RandomizedRunner.java:992)
at com.carrotsearch.randomizedtesting.rules.SystemPropertiesRestoreRule$1.evaluate(SystemPropertiesRestoreRule.java:57)
at org.junit.rules.RunRules.evaluate(RunRules.java:20)
at org.apache.lucene.util.TestRuleSetupTeardownChained$1.evaluate(TestRuleSetupTeardownChained.java:44)
at org.apache.lucene.util.AbstractBeforeAfterRule$1.evaluate(AbstractBeforeAfterRule.java:43)
at org.apache.lucene.util.TestRuleThreadAndTestName$1.evaluate(TestRuleThreadAndTestName.java:45)
at org.apache.lucene.util.TestRuleIgnoreAfterMaxFailures$1.evaluate(TestRuleIgnoreAfterMaxFailures.java:60)
at org.apache.lucene.util.TestRuleMarkFailure$1.evaluate(TestRuleMarkFailure.java:44)
at org.junit.rules.RunRules.evaluate(RunRules.java:20)
at com.carrotsearch.randomizedtesting.rules.StatementAdapter.evaluate(StatementAdapter.java:36)
at com.carrotsearch.randomizedtesting.ThreadLeakControl$StatementRunner.run(ThreadLeakControl.java:370)
at com.carrotsearch.randomizedtesting.ThreadLeakControl.forkTimeoutingTask(ThreadLeakControl.java:819)
at com.carrotsearch.randomizedtesting.ThreadLeakControl$3.evaluate(ThreadLeakControl.java:470)
at com.carrotsearch.randomizedtesting.RandomizedRunner.runSingleTest(RandomizedRunner.java:951)
at com.carrotsearch.randomizedtesting.RandomizedRunner$5.evaluate(RandomizedRunner.java:836)
at com.carrotsearch.randomizedtesting.RandomizedRunner$6.evaluate(RandomizedRunner.java:887)
at com.carrotsearch.randomizedtesting.RandomizedRunner$7.evaluate(RandomizedRunner.java:898)
at com.carrotsearch.randomizedtesting.rules.StatementAdapter.evaluate(StatementAdapter.java:36)
at org.apache.lucene.util.AbstractBeforeAfterRule$1.evaluate(AbstractBeforeAfterRule.java:43)
at org.apache.lucene.util.AbstractBeforeAfterRule$1.evaluate(AbstractBeforeAfterRule.java:43)
at com.carrotsearch.randomizedtesting.rules.SystemPropertiesRestoreRule$1.evaluate(SystemPropertiesRestoreRule.java:57)
at org.junit.rules.RunRules.evaluate(RunRules.java:20)
at org.apache.lucene.util.AbstractBeforeAfterRule$1.evaluate(AbstractBeforeAfterRule.java:43)
at com.carrotsearch.randomizedtesting.rules.StatementAdapter.evaluate(StatementAdapter.java:36)
at org.apache.lucene.util.TestRuleStoreClassName$1.evaluate(TestRuleStoreClassName.java:38)
at com.carrotsearch.randomizedtesting.rules.NoShadowingOrOverridesOnMethodsRule$1.evaluate(NoShadowingOrOverridesOnMethodsRule.java:40)
at com.carrotsearch.randomizedtesting.rules.NoShadowingOrOverridesOnMethodsRule$1.evaluate(NoShadowingOrOverridesOnMethodsRule.java:40)
at com.carrotsearch.randomizedtesting.rules.StatementAdapter.evaluate(StatementAdapter.java:36)
at com.carrotsearch.randomizedtesting.rules.StatementAdapter.evaluate(StatementAdapter.java:36)
at org.apache.lucene.util.TestRuleAssertionsRequired$1.evaluate(TestRuleAssertionsRequired.java:53)
at org.apache.lucene.util.AbstractBeforeAfterRule$1.evaluate(AbstractBeforeAfterRule.java:43)
at org.apache.lucene.util.TestRuleMarkFailure$1.evaluate(TestRuleMarkFailure.java:44)
at org.apache.lucene.util.TestRuleIgnoreAfterMaxFailures$1.evaluate(TestRuleIgnoreAfterMaxFailures.java:60)
at org.apache.lucene.util.TestRuleIgnoreTestSuites$1.evaluate(TestRuleIgnoreTestSuites.java:47)
at org.junit.rules.RunRules.evaluate(RunRules.java:20)
at com.carrotsearch.randomizedtesting.rules.StatementAdapter.evaluate(StatementAdapter.java:36)
at com.carrotsearch.randomizedtesting.ThreadLeakControl$StatementRunner.run(ThreadLeakControl.java:370)
at com.carrotsearch.randomizedtesting.ThreadLeakControl.lambda$forkTimeoutingTask$0(ThreadLeakControl.java:826)
at java.base/java.lang.Thread.run(Thread.java:834)
FAILED: org.apache.solr.cloud.OverseerCollectionConfigSetProcessorTest.testReplicationLimitedNodesToCreateOnDistributedUpdates
Error Message:
java.lang.AssertionError: node name mismatch for coreName=mycollection_shard1_replica_n1 ( actual=localhost:8963/solr versus expected=localhost:8964/solr )
Stack Trace:
java.lang.AssertionError: node name mismatch for coreName=mycollection_shard1_replica_n1 ( actual=localhost:8963/solr versus expected=localhost:8964/solr )
at __randomizedtesting.SeedInfo.seed([358D531AAE7FC187:7106A2A59BA12031]:0)
at org.junit.Assert.fail(Assert.java:89)
at org.junit.Assert.assertTrue(Assert.java:42)
at org.apache.solr.cloud.OverseerCollectionConfigSetProcessorTest.verifySubmitCaptures(OverseerCollectionConfigSetProcessorTest.java:702)
at org.apache.solr.cloud.OverseerCollectionConfigSetProcessorTest.testTemplate(OverseerCollectionConfigSetProcessorTest.java:815)
at org.apache.solr.cloud.OverseerCollectionConfigSetProcessorTest.testReplicationLimitedNodesToCreateOnInternal(OverseerCollectionConfigSetProcessorTest.java:1021)
at org.apache.solr.cloud.OverseerCollectionConfigSetProcessorTest.testReplicationLimitedNodesToCreateOnDistributedUpdates(OverseerCollectionConfigSetProcessorTest.java:1012)
at java.base/jdk.internal.reflect.NativeMethodAccessorImpl.invoke0(Native Method)
at java.base/jdk.internal.reflect.NativeMethodAccessorImpl.invoke(NativeMethodAccessorImpl.java:62)
at java.base/jdk.internal.reflect.DelegatingMethodAccessorImpl.invoke(DelegatingMethodAccessorImpl.java:43)
at java.base/java.lang.reflect.Method.invoke(Method.java:566)
at com.carrotsearch.randomizedtesting.RandomizedRunner.invoke(RandomizedRunner.java:1754)
at com.carrotsearch.randomizedtesting.RandomizedRunner$8.evaluate(RandomizedRunner.java:942)
at com.carrotsearch.randomizedtesting.RandomizedRunner$9.evaluate(RandomizedRunner.java:978)
at com.carrotsearch.randomizedtesting.RandomizedRunner$10.evaluate(RandomizedRunner.java:992)
at com.carrotsearch.randomizedtesting.rules.SystemPropertiesRestoreRule$1.evaluate(SystemPropertiesRestoreRule.java:57)
at org.junit.rules.RunRules.evaluate(RunRules.java:20)
at org.apache.lucene.util.TestRuleSetupTeardownChained$1.evaluate(TestRuleSetupTeardownChained.java:44)
at org.apache.lucene.util.AbstractBeforeAfterRule$1.evaluate(AbstractBeforeAfterRule.java:43)
at org.apache.lucene.util.TestRuleThreadAndTestName$1.evaluate(TestRuleThreadAndTestName.java:45)
at org.apache.lucene.util.TestRuleIgnoreAfterMaxFailures$1.evaluate(TestRuleIgnoreAfterMaxFailures.java:60)
at org.apache.lucene.util.TestRuleMarkFailure$1.evaluate(TestRuleMarkFailure.java:44)
at org.junit.rules.RunRules.evaluate(RunRules.java:20)
at com.carrotsearch.randomizedtesting.rules.StatementAdapter.evaluate(StatementAdapter.java:36)
at com.carrotsearch.randomizedtesting.ThreadLeakControl$StatementRunner.run(ThreadLeakControl.java:370)
at com.carrotsearch.randomizedtesting.ThreadLeakControl.forkTimeoutingTask(ThreadLeakControl.java:819)
at com.carrotsearch.randomizedtesting.ThreadLeakControl$3.evaluate(ThreadLeakControl.java:470)
at com.carrotsearch.randomizedtesting.RandomizedRunner.runSingleTest(RandomizedRunner.java:951)
at com.carrotsearch.randomizedtesting.RandomizedRunner$5.evaluate(RandomizedRunner.java:836)
at com.carrotsearch.randomizedtesting.RandomizedRunner$6.evaluate(RandomizedRunner.java:887)
at com.carrotsearch.randomizedtesting.RandomizedRunner$7.evaluate(RandomizedRunner.java:898)
at com.carrotsearch.randomizedtesting.rules.StatementAdapter.evaluate(StatementAdapter.java:36)
at org.apache.lucene.util.AbstractBeforeAfterRule$1.evaluate(AbstractBeforeAfterRule.java:43)
at org.apache.lucene.util.AbstractBeforeAfterRule$1.evaluate(AbstractBeforeAfterRule.java:43)
at com.carrotsearch.randomizedtesting.rules.SystemPropertiesRestoreRule$1.evaluate(SystemPropertiesRestoreRule.java:57)
at org.junit.rules.RunRules.evaluate(RunRules.java:20)
at org.apache.lucene.util.AbstractBeforeAfterRule$1.evaluate(AbstractBeforeAfterRule.java:43)
at com.carrotsearch.randomizedtesting.rules.StatementAdapter.evaluate(StatementAdapter.java:36)
at org.apache.lucene.util.TestRuleStoreClassName$1.evaluate(TestRuleStoreClassName.java:38)
at com.carrotsearch.randomizedtesting.rules.NoShadowingOrOverridesOnMethodsRule$1.evaluate(NoShadowingOrOverridesOnMethodsRule.java:40)
at com.carrotsearch.randomizedtesting.rules.NoShadowingOrOverridesOnMethodsRule$1.evaluate(NoShadowingOrOverridesOnMethodsRule.java:40)
at com.carrotsearch.randomizedtesting.rules.StatementAdapter.evaluate(StatementAdapter.java:36)
at com.carrotsearch.randomizedtesting.rules.StatementAdapter.evaluate(StatementAdapter.java:36)
at org.apache.lucene.util.TestRuleAssertionsRequired$1.evaluate(TestRuleAssertionsRequired.java:53)
at org.apache.lucene.util.AbstractBeforeAfterRule$1.evaluate(AbstractBeforeAfterRule.java:43)
at org.apache.lucene.util.TestRuleMarkFailure$1.evaluate(TestRuleMarkFailure.java:44)
at org.apache.lucene.util.TestRuleIgnoreAfterMaxFailures$1.evaluate(TestRuleIgnoreAfterMaxFailures.java:60)
at org.apache.lucene.util.TestRuleIgnoreTestSuites$1.evaluate(TestRuleIgnoreTestSuites.java:47)
at org.junit.rules.RunRules.evaluate(RunRules.java:20)
at com.carrotsearch.randomizedtesting.rules.StatementAdapter.evaluate(StatementAdapter.java:36)
at com.carrotsearch.randomizedtesting.ThreadLeakControl$StatementRunner.run(ThreadLeakControl.java:370)
at com.carrotsearch.randomizedtesting.ThreadLeakControl.lambda$forkTimeoutingTask$0(ThreadLeakControl.java:826)
at java.base/java.lang.Thread.run(Thread.java:834)
FAILED: org.apache.solr.cloud.api.collections.TestCollectionAPI.test
Error Message:
org.apache.solr.client.solrj.SolrServerException: IOException occurred when talking to server at: http://127.0.0.1:33301
Stack Trace:
org.apache.solr.client.solrj.SolrServerException: IOException occurred when talking to server at: http://127.0.0.1:33301
at __randomizedtesting.SeedInfo.seed([358D531AAE7FC187:BDD96CC00083AC7F]:0)
at app//org.apache.solr.client.solrj.impl.HttpSolrClient.executeMethod(HttpSolrClient.java:682)
at app//org.apache.solr.client.solrj.impl.HttpSolrClient.request(HttpSolrClient.java:239)
at app//org.apache.solr.client.solrj.impl.HttpSolrClient.request(HttpSolrClient.java:222)
at app//org.apache.solr.client.solrj.impl.LBSolrClient.doRequest(LBSolrClient.java:389)
at app//org.apache.solr.client.solrj.impl.LBSolrClient.request(LBSolrClient.java:359)
at app//org.apache.solr.client.solrj.impl.BaseCloudSolrClient.sendRequest(BaseCloudSolrClient.java:1132)
at app//org.apache.solr.client.solrj.impl.BaseCloudSolrClient.requestWithRetryOnStaleState(BaseCloudSolrClient.java:898)
at app//org.apache.solr.client.solrj.impl.BaseCloudSolrClient.request(BaseCloudSolrClient.java:832)
at app//org.apache.solr.client.solrj.SolrRequest.process(SolrRequest.java:226)
at app//org.apache.solr.client.solrj.SolrRequest.process(SolrRequest.java:243)
at app//org.apache.solr.cloud.api.collections.TestCollectionAPI.clusterStatusWithCollectionHealthState(TestCollectionAPI.java:381)
at app//org.apache.solr.cloud.api.collections.TestCollectionAPI.test(TestCollectionAPI.java:96)
at java.base@11.0.11/jdk.internal.reflect.NativeMethodAccessorImpl.invoke0(Native Method)
at java.base@11.0.11/jdk.internal.reflect.NativeMethodAccessorImpl.invoke(NativeMethodAccessorImpl.java:62)
at java.base@11.0.11/jdk.internal.reflect.DelegatingMethodAccessorImpl.invoke(DelegatingMethodAccessorImpl.java:43)
at java.base@11.0.11/java.lang.reflect.Method.invoke(Method.java:566)
at app//com.carrotsearch.randomizedtesting.RandomizedRunner.invoke(RandomizedRunner.java:1754)
at app//com.carrotsearch.randomizedtesting.RandomizedRunner$8.evaluate(RandomizedRunner.java:942)
at app//com.carrotsearch.randomizedtesting.RandomizedRunner$9.evaluate(RandomizedRunner.java:978)
at app//com.carrotsearch.randomizedtesting.RandomizedRunner$10.evaluate(RandomizedRunner.java:992)
at app//org.apache.solr.BaseDistributedSearchTestCase$ShardsRepeatRule$ShardsFixedStatement.callStatement(BaseDistributedSearchTestCase.java:1081)
at app//org.apache.solr.BaseDistributedSearchTestCase$ShardsRepeatRule$ShardsStatement.evaluate(BaseDistributedSearchTestCase.java:1052)
at app//com.carrotsearch.randomizedtesting.rules.SystemPropertiesRestoreRule$1.evaluate(SystemPropertiesRestoreRule.java:57)
at app//org.junit.rules.RunRules.evaluate(RunRules.java:20)
at app//org.apache.lucene.util.TestRuleSetupTeardownChained$1.evaluate(TestRuleSetupTeardownChained.java:44)
at app//org.apache.lucene.util.AbstractBeforeAfterRule$1.evaluate(AbstractBeforeAfterRule.java:43)
at app//org.apache.lucene.util.TestRuleThreadAndTestName$1.evaluate(TestRuleThreadAndTestName.java:45)
at app//org.apache.lucene.util.TestRuleIgnoreAfterMaxFailures$1.evaluate(TestRuleIgnoreAfterMaxFailures.java:60)
at app//org.apache.lucene.util.TestRuleMarkFailure$1.evaluate(TestRuleMarkFailure.java:44)
at app//org.junit.rules.RunRules.evaluate(RunRules.java:20)
at app//com.carrotsearch.randomizedtesting.rules.StatementAdapter.evaluate(StatementAdapter.java:36)
at app//com.carrotsearch.randomizedtesting.ThreadLeakControl$StatementRunner.run(ThreadLeakControl.java:370)
at app//com.carrotsearch.randomizedtesting.ThreadLeakControl.forkTimeoutingTask(ThreadLeakControl.java:819)
at app//com.carrotsearch.randomizedtesting.ThreadLeakControl$3.evaluate(ThreadLeakControl.java:470)
at app//com.carrotsearch.randomizedtesting.RandomizedRunner.runSingleTest(RandomizedRunner.java:951)
at app//com.carrotsearch.randomizedtesting.RandomizedRunner$5.evaluate(RandomizedRunner.java:836)
at app//com.carrotsearch.randomizedtesting.RandomizedRunner$6.evaluate(RandomizedRunner.java:887)
at app//com.carrotsearch.randomizedtesting.RandomizedRunner$7.evaluate(RandomizedRunner.java:898)
at app//com.carrotsearch.randomizedtesting.rules.StatementAdapter.evaluate(StatementAdapter.java:36)
at app//org.apache.lucene.util.AbstractBeforeAfterRule$1.evaluate(AbstractBeforeAfterRule.java:43)
at app//org.apache.lucene.util.AbstractBeforeAfterRule$1.evaluate(AbstractBeforeAfterRule.java:43)
at app//com.carrotsearch.randomizedtesting.rules.SystemPropertiesRestoreRule$1.evaluate(SystemPropertiesRestoreRule.java:57)
at app//org.junit.rules.RunRules.evaluate(RunRules.java:20)
at app//org.apache.lucene.util.AbstractBeforeAfterRule$1.evaluate(AbstractBeforeAfterRule.java:43)
at app//com.carrotsearch.randomizedtesting.rules.StatementAdapter.evaluate(StatementAdapter.java:36)
at app//org.apache.lucene.util.TestRuleStoreClassName$1.evaluate(TestRuleStoreClassName.java:38)
at app//com.carrotsearch.randomizedtesting.rules.NoShadowingOrOverridesOnMethodsRule$1.evaluate(NoShadowingOrOverridesOnMethodsRule.java:40)
at app//com.carrotsearch.randomizedtesting.rules.NoShadowingOrOverridesOnMethodsRule$1.evaluate(NoShadowingOrOverridesOnMethodsRule.java:40)
at app//com.carrotsearch.randomizedtesting.rules.StatementAdapter.evaluate(StatementAdapter.java:36)
at app//com.carrotsearch.randomizedtesting.rules.StatementAdapter.evaluate(StatementAdapter.java:36)
at app//org.apache.lucene.util.TestRuleAssertionsRequired$1.evaluate(TestRuleAssertionsRequired.java:53)
at app//org.apache.lucene.util.AbstractBeforeAfterRule$1.evaluate(AbstractBeforeAfterRule.java:43)
at app//org.apache.lucene.util.TestRuleMarkFailure$1.evaluate(TestRuleMarkFailure.java:44)
at app//org.apache.lucene.util.TestRuleIgnoreAfterMaxFailures$1.evaluate(TestRuleIgnoreAfterMaxFailures.java:60)
at app//org.apache.lucene.util.TestRuleIgnoreTestSuites$1.evaluate(TestRuleIgnoreTestSuites.java:47)
at app//org.junit.rules.RunRules.evaluate(RunRules.java:20)
at app//com.carrotsearch.randomizedtesting.rules.StatementAdapter.evaluate(StatementAdapter.java:36)
at app//com.carrotsearch.randomizedtesting.ThreadLeakControl$StatementRunner.run(ThreadLeakControl.java:370)
at app//com.carrotsearch.randomizedtesting.ThreadLeakControl.lambda$forkTimeoutingTask$0(ThreadLeakControl.java:826)
at java.base@11.0.11/java.lang.Thread.run(Thread.java:834)
Caused by: org.apache.http.NoHttpResponseException: 127.0.0.1:33301 failed to respond
at app//org.apache.http.impl.conn.DefaultHttpResponseParser.parseHead(DefaultHttpResponseParser.java:141)
at app//org.apache.http.impl.conn.DefaultHttpResponseParser.parseHead(DefaultHttpResponseParser.java:56)
at app//org.apache.http.impl.io.AbstractMessageParser.parse(AbstractMessageParser.java:259)
at app//org.apache.http.impl.DefaultBHttpClientConnection.receiveResponseHeader(DefaultBHttpClientConnection.java:163)
at app//org.apache.http.impl.conn.CPoolProxy.receiveResponseHeader(CPoolProxy.java:157)
at app//org.apache.http.protocol.HttpRequestExecutor.doReceiveResponse(HttpRequestExecutor.java:273)
at app//org.apache.http.protocol.HttpRequestExecutor.execute(HttpRequestExecutor.java:125)
at app//org.apache.http.impl.execchain.MainClientExec.execute(MainClientExec.java:272)
at app//org.apache.http.impl.execchain.ProtocolExec.execute(ProtocolExec.java:186)
at app//org.apache.http.impl.execchain.RetryExec.execute(RetryExec.java:89)
at app//org.apache.http.impl.execchain.RedirectExec.execute(RedirectExec.java:110)
at app//org.apache.http.impl.client.InternalHttpClient.doExecute(InternalHttpClient.java:185)
at app//org.apache.http.impl.client.CloseableHttpClient.execute(CloseableHttpClient.java:83)
at app//org.apache.http.impl.client.CloseableHttpClient.execute(CloseableHttpClient.java:56)
at app//org.apache.solr.client.solrj.impl.HttpSolrClient.executeMethod(HttpSolrClient.java:551)
... 59 more
Build Log:
[...truncated 4113 lines...]
ERROR: The following test(s) have failed:
- org.apache.solr.cloud.OverseerCollectionConfigSetProcessorTest.testReplicationEqualNumberOfSlicesPerNodeSendCreateNodesEqualToLiveNodesDistributedUpdates (:solr:core)
Test output: /home/jenkins/jenkins-slave/workspace/Solr/Solr-Check-main/solr/core/build/test-results/test/outputs/OUTPUT-org.apache.solr.cloud.OverseerCollectionConfigSetProcessorTest.txt
Reproduce with: gradlew :solr:core:test --tests "org.apache.solr.cloud.OverseerCollectionConfigSetProcessorTest.testReplicationEqualNumberOfSlicesPerNodeSendCreateNodesEqualToLiveNodesDistributedUpdates" -Ptests.jvms=4 -Ptests.haltonfailure=false -Ptests.jvmargs=-XX:TieredStopAtLevel=1 -Ptests.seed=358D531AAE7FC187 -Ptests.multiplier=2 -Ptests.badapples=false -Ptests.file.encoding=US-ASCII
- org.apache.solr.cloud.OverseerCollectionConfigSetProcessorTest.testNoReplicationEqualNumberOfSlicesPerNodeSendCreateNodesEqualToLiveNodesDistributedUpdates (:solr:core)
Test output: /home/jenkins/jenkins-slave/workspace/Solr/Solr-Check-main/solr/core/build/test-results/test/outputs/OUTPUT-org.apache.solr.cloud.OverseerCollectionConfigSetProcessorTest.txt
Reproduce with: gradlew :solr:core:test --tests "org.apache.solr.cloud.OverseerCollectionConfigSetProcessorTest.testNoReplicationEqualNumberOfSlicesPerNodeSendCreateNodesEqualToLiveNodesDistributedUpdates" -Ptests.jvms=4 -Ptests.haltonfailure=false -Ptests.jvmargs=-XX:TieredStopAtLevel=1 -Ptests.seed=358D531AAE7FC187 -Ptests.multiplier=2 -Ptests.badapples=false -Ptests.file.encoding=US-ASCII
- org.apache.solr.cloud.OverseerCollectionConfigSetProcessorTest.testReplicationLimitedNodesToCreateOnDistributedUpdates (:solr:core)
Test output: /home/jenkins/jenkins-slave/workspace/Solr/Solr-Check-main/solr/core/build/test-results/test/outputs/OUTPUT-org.apache.solr.cloud.OverseerCollectionConfigSetProcessorTest.txt
Reproduce with: gradlew :solr:core:test --tests "org.apache.solr.cloud.OverseerCollectionConfigSetProcessorTest.testReplicationLimitedNodesToCreateOnDistributedUpdates" -Ptests.jvms=4 -Ptests.haltonfailure=false -Ptests.jvmargs=-XX:TieredStopAtLevel=1 -Ptests.seed=358D531AAE7FC187 -Ptests.multiplier=2 -Ptests.badapples=false -Ptests.file.encoding=US-ASCII
- org.apache.solr.cloud.api.collections.TestCollectionAPI.test (:solr:core)
Test output: /home/jenkins/jenkins-slave/workspace/Solr/Solr-Check-main/solr/core/build/test-results/test/outputs/OUTPUT-org.apache.solr.cloud.api.collections.TestCollectionAPI.txt
Reproduce with: gradlew :solr:core:test --tests "org.apache.solr.cloud.api.collections.TestCollectionAPI.test" -Ptests.jvms=4 -Ptests.haltonfailure=false -Ptests.jvmargs=-XX:TieredStopAtLevel=1 -Ptests.seed=358D531AAE7FC187 -Ptests.multiplier=2 -Ptests.badapples=false -Ptests.file.encoding=US-ASCII
Deprecated Gradle features were used in this build, making it incompatible with Gradle 8.0.
You can use '--warning-mode all' to show the individual deprecation warnings and determine if they come from your own scripts or plugins.
See https://docs.gradle.org/7.2/userguide/command_line_interface.html#sec:command_line_warnings
BUILD SUCCESSFUL in 51m 22s
407 actionable tasks: 407 executed
Build step 'Invoke Gradle script' changed build result to SUCCESS
Archiving artifacts
java.lang.InterruptedException: no matches found within 10000
at hudson.FilePath$ValidateAntFileMask.hasMatch(FilePath.java:3069)
at hudson.FilePath$ValidateAntFileMask.invoke(FilePath.java:2948)
at hudson.FilePath$ValidateAntFileMask.invoke(FilePath.java:2929)
at hudson.FilePath$FileCallableWrapper.call(FilePath.java:3317)
Also: hudson.remoting.Channel$CallSiteStackTrace: Remote call to lucene-solr-2
at hudson.remoting.Channel.attachCallSiteStackTrace(Channel.java:1800)
at hudson.remoting.UserRequest$ExceptionResponse.retrieve(UserRequest.java:356)
at hudson.remoting.Channel.call(Channel.java:1001)
at hudson.FilePath.act(FilePath.java:1159)
at hudson.FilePath.act(FilePath.java:1148)
at hudson.FilePath.validateAntFileMask(FilePath.java:2927)
at hudson.tasks.ArtifactArchiver.perform(ArtifactArchiver.java:270)
at hudson.tasks.BuildStepCompatibilityLayer.perform(BuildStepCompatibilityLayer.java:80)
at hudson.tasks.BuildStepMonitor$1.perform(BuildStepMonitor.java:20)
at hudson.model.AbstractBuild$AbstractBuildExecution.perform(AbstractBuild.java:803)
at hudson.model.AbstractBuild$AbstractBuildExecution.performAllBuildSteps(AbstractBuild.java:752)
at hudson.model.Build$BuildExecution.post2(Build.java:177)
at hudson.model.AbstractBuild$AbstractBuildExecution.post(AbstractBuild.java:697)
at hudson.model.Run.execute(Run.java:1931)
at hudson.model.FreeStyleBuild.run(FreeStyleBuild.java:43)
at hudson.model.ResourceController.execute(ResourceController.java:97)
at hudson.model.Executor.run(Executor.java:429)
Caused: hudson.FilePath$TunneledInterruptedException
at hudson.FilePath$FileCallableWrapper.call(FilePath.java:3319)
at hudson.remoting.UserRequest.perform(UserRequest.java:211)
at hudson.remoting.UserRequest.perform(UserRequest.java:54)
at hudson.remoting.Request$2.run(Request.java:376)
at hudson.remoting.InterceptingExecutorService.lambda$wrap$0(InterceptingExecutorService.java:78)
at java.util.concurrent.FutureTask.run(FutureTask.java:266)
at java.util.concurrent.ThreadPoolExecutor.runWorker(ThreadPoolExecutor.java:1149)
at java.util.concurrent.ThreadPoolExecutor$Worker.run(ThreadPoolExecutor.java:624)
at java.lang.Thread.run(Thread.java:748)
Caused: java.lang.InterruptedException: java.lang.InterruptedException: no matches found within 10000
at hudson.FilePath.act(FilePath.java:1161)
at hudson.FilePath.act(FilePath.java:1148)
at hudson.FilePath.validateAntFileMask(FilePath.java:2927)
at hudson.tasks.ArtifactArchiver.perform(ArtifactArchiver.java:270)
at hudson.tasks.BuildStepCompatibilityLayer.perform(BuildStepCompatibilityLayer.java:80)
at hudson.tasks.BuildStepMonitor$1.perform(BuildStepMonitor.java:20)
at hudson.model.AbstractBuild$AbstractBuildExecution.perform(AbstractBuild.java:803)
at hudson.model.AbstractBuild$AbstractBuildExecution.performAllBuildSteps(AbstractBuild.java:752)
at hudson.model.Build$BuildExecution.post2(Build.java:177)
at hudson.model.AbstractBuild$AbstractBuildExecution.post(AbstractBuild.java:697)
at hudson.model.Run.execute(Run.java:1931)
at hudson.model.FreeStyleBuild.run(FreeStyleBuild.java:43)
at hudson.model.ResourceController.execute(ResourceController.java:97)
at hudson.model.Executor.run(Executor.java:429)
No artifacts found that match the file pattern "**/*.events,heapdumps/**,**/hs_err_pid*". Configuration error?
Recording test results
[Checks API] No suitable checks publisher found.
Build step 'Publish JUnit test result report' changed build result to UNSTABLE
Email was triggered for: Unstable (Test Failures)
Sending email for trigger: Unstable (Test Failures)
[JENKINS] Solr » Solr-Check-main - Build # 2421 - Still Unstable!
Posted by Apache Jenkins Server <je...@builds.apache.org>.
Build: https://ci-builds.apache.org/job/Solr/job/Solr-Check-main/2421/
3 tests failed.
FAILED: org.apache.solr.cloud.OverseerCollectionConfigSetProcessorTest.testNoReplicationLimitedNodesToCreateOnDistributedUpdates
Error Message:
java.lang.AssertionError: node name mismatch for coreName=mycollection_shard1_replica_n1 ( actual=localhost:8963/solr versus expected=localhost:8964/solr )
Stack Trace:
java.lang.AssertionError: node name mismatch for coreName=mycollection_shard1_replica_n1 ( actual=localhost:8963/solr versus expected=localhost:8964/solr )
at __randomizedtesting.SeedInfo.seed([D98AF29C7B970645:BB35CCAF1E42A87B]:0)
at org.junit.Assert.fail(Assert.java:89)
at org.junit.Assert.assertTrue(Assert.java:42)
at org.apache.solr.cloud.OverseerCollectionConfigSetProcessorTest.verifySubmitCaptures(OverseerCollectionConfigSetProcessorTest.java:702)
at org.apache.solr.cloud.OverseerCollectionConfigSetProcessorTest.testTemplate(OverseerCollectionConfigSetProcessorTest.java:815)
at org.apache.solr.cloud.OverseerCollectionConfigSetProcessorTest.testNoReplicationLimitedNodesToCreateOnInternal(OverseerCollectionConfigSetProcessorTest.java:1001)
at org.apache.solr.cloud.OverseerCollectionConfigSetProcessorTest.testNoReplicationLimitedNodesToCreateOnDistributedUpdates(OverseerCollectionConfigSetProcessorTest.java:992)
at java.base/jdk.internal.reflect.NativeMethodAccessorImpl.invoke0(Native Method)
at java.base/jdk.internal.reflect.NativeMethodAccessorImpl.invoke(NativeMethodAccessorImpl.java:62)
at java.base/jdk.internal.reflect.DelegatingMethodAccessorImpl.invoke(DelegatingMethodAccessorImpl.java:43)
at java.base/java.lang.reflect.Method.invoke(Method.java:566)
at com.carrotsearch.randomizedtesting.RandomizedRunner.invoke(RandomizedRunner.java:1754)
at com.carrotsearch.randomizedtesting.RandomizedRunner$8.evaluate(RandomizedRunner.java:942)
at com.carrotsearch.randomizedtesting.RandomizedRunner$9.evaluate(RandomizedRunner.java:978)
at com.carrotsearch.randomizedtesting.RandomizedRunner$10.evaluate(RandomizedRunner.java:992)
at com.carrotsearch.randomizedtesting.rules.SystemPropertiesRestoreRule$1.evaluate(SystemPropertiesRestoreRule.java:57)
at org.junit.rules.RunRules.evaluate(RunRules.java:20)
at org.apache.lucene.util.TestRuleSetupTeardownChained$1.evaluate(TestRuleSetupTeardownChained.java:44)
at org.apache.lucene.util.AbstractBeforeAfterRule$1.evaluate(AbstractBeforeAfterRule.java:43)
at org.apache.lucene.util.TestRuleThreadAndTestName$1.evaluate(TestRuleThreadAndTestName.java:45)
at org.apache.lucene.util.TestRuleIgnoreAfterMaxFailures$1.evaluate(TestRuleIgnoreAfterMaxFailures.java:60)
at org.apache.lucene.util.TestRuleMarkFailure$1.evaluate(TestRuleMarkFailure.java:44)
at org.junit.rules.RunRules.evaluate(RunRules.java:20)
at com.carrotsearch.randomizedtesting.rules.StatementAdapter.evaluate(StatementAdapter.java:36)
at com.carrotsearch.randomizedtesting.ThreadLeakControl$StatementRunner.run(ThreadLeakControl.java:370)
at com.carrotsearch.randomizedtesting.ThreadLeakControl.forkTimeoutingTask(ThreadLeakControl.java:819)
at com.carrotsearch.randomizedtesting.ThreadLeakControl$3.evaluate(ThreadLeakControl.java:470)
at com.carrotsearch.randomizedtesting.RandomizedRunner.runSingleTest(RandomizedRunner.java:951)
at com.carrotsearch.randomizedtesting.RandomizedRunner$5.evaluate(RandomizedRunner.java:836)
at com.carrotsearch.randomizedtesting.RandomizedRunner$6.evaluate(RandomizedRunner.java:887)
at com.carrotsearch.randomizedtesting.RandomizedRunner$7.evaluate(RandomizedRunner.java:898)
at com.carrotsearch.randomizedtesting.rules.StatementAdapter.evaluate(StatementAdapter.java:36)
at org.apache.lucene.util.AbstractBeforeAfterRule$1.evaluate(AbstractBeforeAfterRule.java:43)
at org.apache.lucene.util.AbstractBeforeAfterRule$1.evaluate(AbstractBeforeAfterRule.java:43)
at com.carrotsearch.randomizedtesting.rules.SystemPropertiesRestoreRule$1.evaluate(SystemPropertiesRestoreRule.java:57)
at org.junit.rules.RunRules.evaluate(RunRules.java:20)
at org.apache.lucene.util.AbstractBeforeAfterRule$1.evaluate(AbstractBeforeAfterRule.java:43)
at com.carrotsearch.randomizedtesting.rules.StatementAdapter.evaluate(StatementAdapter.java:36)
at org.apache.lucene.util.TestRuleStoreClassName$1.evaluate(TestRuleStoreClassName.java:38)
at com.carrotsearch.randomizedtesting.rules.NoShadowingOrOverridesOnMethodsRule$1.evaluate(NoShadowingOrOverridesOnMethodsRule.java:40)
at com.carrotsearch.randomizedtesting.rules.NoShadowingOrOverridesOnMethodsRule$1.evaluate(NoShadowingOrOverridesOnMethodsRule.java:40)
at com.carrotsearch.randomizedtesting.rules.StatementAdapter.evaluate(StatementAdapter.java:36)
at com.carrotsearch.randomizedtesting.rules.StatementAdapter.evaluate(StatementAdapter.java:36)
at org.apache.lucene.util.TestRuleAssertionsRequired$1.evaluate(TestRuleAssertionsRequired.java:53)
at org.apache.lucene.util.AbstractBeforeAfterRule$1.evaluate(AbstractBeforeAfterRule.java:43)
at org.apache.lucene.util.TestRuleMarkFailure$1.evaluate(TestRuleMarkFailure.java:44)
at org.apache.lucene.util.TestRuleIgnoreAfterMaxFailures$1.evaluate(TestRuleIgnoreAfterMaxFailures.java:60)
at org.apache.lucene.util.TestRuleIgnoreTestSuites$1.evaluate(TestRuleIgnoreTestSuites.java:47)
at org.junit.rules.RunRules.evaluate(RunRules.java:20)
at com.carrotsearch.randomizedtesting.rules.StatementAdapter.evaluate(StatementAdapter.java:36)
at com.carrotsearch.randomizedtesting.ThreadLeakControl$StatementRunner.run(ThreadLeakControl.java:370)
at com.carrotsearch.randomizedtesting.ThreadLeakControl.lambda$forkTimeoutingTask$0(ThreadLeakControl.java:826)
at java.base/java.lang.Thread.run(Thread.java:834)
FAILED: org.apache.solr.handler.TestReplicationHandler.doTestIndexFetchOnLeaderRestart
Error Message:
java.lang.AssertionError: expected:<495> but was:<0>
Stack Trace:
java.lang.AssertionError: expected:<495> but was:<0>
at __randomizedtesting.SeedInfo.seed([D98AF29C7B970645:F9049406CBF69B9C]:0)
at org.junit.Assert.fail(Assert.java:89)
at org.junit.Assert.failNotEquals(Assert.java:835)
at org.junit.Assert.assertEquals(Assert.java:647)
at org.junit.Assert.assertEquals(Assert.java:633)
at org.apache.solr.handler.TestReplicationHandler.doTestIndexFetchOnLeaderRestart(TestReplicationHandler.java:679)
at java.base/jdk.internal.reflect.NativeMethodAccessorImpl.invoke0(Native Method)
at java.base/jdk.internal.reflect.NativeMethodAccessorImpl.invoke(NativeMethodAccessorImpl.java:62)
at java.base/jdk.internal.reflect.DelegatingMethodAccessorImpl.invoke(DelegatingMethodAccessorImpl.java:43)
at java.base/java.lang.reflect.Method.invoke(Method.java:566)
at com.carrotsearch.randomizedtesting.RandomizedRunner.invoke(RandomizedRunner.java:1754)
at com.carrotsearch.randomizedtesting.RandomizedRunner$8.evaluate(RandomizedRunner.java:942)
at com.carrotsearch.randomizedtesting.RandomizedRunner$9.evaluate(RandomizedRunner.java:978)
at com.carrotsearch.randomizedtesting.RandomizedRunner$10.evaluate(RandomizedRunner.java:992)
at com.carrotsearch.randomizedtesting.rules.SystemPropertiesRestoreRule$1.evaluate(SystemPropertiesRestoreRule.java:57)
at org.junit.rules.RunRules.evaluate(RunRules.java:20)
at org.apache.lucene.util.TestRuleSetupTeardownChained$1.evaluate(TestRuleSetupTeardownChained.java:44)
at org.apache.lucene.util.AbstractBeforeAfterRule$1.evaluate(AbstractBeforeAfterRule.java:43)
at org.apache.lucene.util.TestRuleThreadAndTestName$1.evaluate(TestRuleThreadAndTestName.java:45)
at org.apache.lucene.util.TestRuleIgnoreAfterMaxFailures$1.evaluate(TestRuleIgnoreAfterMaxFailures.java:60)
at org.apache.lucene.util.TestRuleMarkFailure$1.evaluate(TestRuleMarkFailure.java:44)
at org.junit.rules.RunRules.evaluate(RunRules.java:20)
at com.carrotsearch.randomizedtesting.rules.StatementAdapter.evaluate(StatementAdapter.java:36)
at com.carrotsearch.randomizedtesting.ThreadLeakControl$StatementRunner.run(ThreadLeakControl.java:370)
at com.carrotsearch.randomizedtesting.ThreadLeakControl.forkTimeoutingTask(ThreadLeakControl.java:819)
at com.carrotsearch.randomizedtesting.ThreadLeakControl$3.evaluate(ThreadLeakControl.java:470)
at com.carrotsearch.randomizedtesting.RandomizedRunner.runSingleTest(RandomizedRunner.java:951)
at com.carrotsearch.randomizedtesting.RandomizedRunner$5.evaluate(RandomizedRunner.java:836)
at com.carrotsearch.randomizedtesting.RandomizedRunner$6.evaluate(RandomizedRunner.java:887)
at com.carrotsearch.randomizedtesting.RandomizedRunner$7.evaluate(RandomizedRunner.java:898)
at com.carrotsearch.randomizedtesting.rules.StatementAdapter.evaluate(StatementAdapter.java:36)
at org.apache.lucene.util.AbstractBeforeAfterRule$1.evaluate(AbstractBeforeAfterRule.java:43)
at org.apache.lucene.util.AbstractBeforeAfterRule$1.evaluate(AbstractBeforeAfterRule.java:43)
at com.carrotsearch.randomizedtesting.rules.SystemPropertiesRestoreRule$1.evaluate(SystemPropertiesRestoreRule.java:57)
at org.junit.rules.RunRules.evaluate(RunRules.java:20)
at org.apache.lucene.util.AbstractBeforeAfterRule$1.evaluate(AbstractBeforeAfterRule.java:43)
at com.carrotsearch.randomizedtesting.rules.StatementAdapter.evaluate(StatementAdapter.java:36)
at org.apache.lucene.util.TestRuleStoreClassName$1.evaluate(TestRuleStoreClassName.java:38)
at com.carrotsearch.randomizedtesting.rules.NoShadowingOrOverridesOnMethodsRule$1.evaluate(NoShadowingOrOverridesOnMethodsRule.java:40)
at com.carrotsearch.randomizedtesting.rules.NoShadowingOrOverridesOnMethodsRule$1.evaluate(NoShadowingOrOverridesOnMethodsRule.java:40)
at com.carrotsearch.randomizedtesting.rules.StatementAdapter.evaluate(StatementAdapter.java:36)
at com.carrotsearch.randomizedtesting.rules.StatementAdapter.evaluate(StatementAdapter.java:36)
at org.apache.lucene.util.TestRuleAssertionsRequired$1.evaluate(TestRuleAssertionsRequired.java:53)
at org.apache.lucene.util.AbstractBeforeAfterRule$1.evaluate(AbstractBeforeAfterRule.java:43)
at org.apache.lucene.util.TestRuleMarkFailure$1.evaluate(TestRuleMarkFailure.java:44)
at org.apache.lucene.util.TestRuleIgnoreAfterMaxFailures$1.evaluate(TestRuleIgnoreAfterMaxFailures.java:60)
at org.apache.lucene.util.TestRuleIgnoreTestSuites$1.evaluate(TestRuleIgnoreTestSuites.java:47)
at org.junit.rules.RunRules.evaluate(RunRules.java:20)
at com.carrotsearch.randomizedtesting.rules.StatementAdapter.evaluate(StatementAdapter.java:36)
at com.carrotsearch.randomizedtesting.ThreadLeakControl$StatementRunner.run(ThreadLeakControl.java:370)
at com.carrotsearch.randomizedtesting.ThreadLeakControl.lambda$forkTimeoutingTask$0(ThreadLeakControl.java:826)
at java.base/java.lang.Thread.run(Thread.java:834)
FAILED: org.apache.solr.handler.designer.TestSchemaDesignerSettingsDAO.classMethod
Error Message:
com.carrotsearch.randomizedtesting.ThreadLeakError: 1 thread leaked from SUITE scope at org.apache.solr.handler.designer.TestSchemaDesignerSettingsDAO:
1) Thread[id=3000, name=ZKEventListenerThread, state=TIMED_WAITING, group=TGRP-TestSchemaDesignerSettingsDAO]
at java.base@11.0.11/java.lang.Thread.sleep(Native Method)
at app//org.apache.solr.common.cloud.ZkCmdExecutor.retryDelay(ZkCmdExecutor.java:156)
at app//org.apache.solr.common.cloud.ZkCmdExecutor.retryOperation(ZkCmdExecutor.java:89)
at app//org.apache.solr.common.cloud.SolrZkClient.getData(SolrZkClient.java:343)
at app//org.apache.solr.cloud.ZkSolrResourceLoader.openResource(ZkSolrResourceLoader.java:82)
at app//org.apache.lucene.analysis.AbstractAnalysisFactory.getLines(AbstractAnalysisFactory.java:302)
at app//org.apache.lucene.analysis.AbstractAnalysisFactory.getWordSet(AbstractAnalysisFactory.java:293)
at app//org.apache.lucene.analysis.util.ElisionFilterFactory.inform(ElisionFilterFactory.java:73)
at app//org.apache.solr.core.SolrResourceLoader.informAware(SolrResourceLoader.java:722)
at app//org.apache.solr.schema.ManagedIndexSchema.informResourceLoaderAwareObjectsInChain(ManagedIndexSchema.java:1353)
at app//org.apache.solr.schema.ManagedIndexSchema.informResourceLoaderAwareObjectsForFieldType(ManagedIndexSchema.java:1206)
at app//org.apache.solr.schema.ManagedIndexSchema.postReadInform(ManagedIndexSchema.java:1191)
at app//org.apache.solr.schema.IndexSchema.readSchema(IndexSchema.java:615)
at app//org.apache.solr.schema.IndexSchema.<init>(IndexSchema.java:177)
at app//org.apache.solr.schema.ManagedIndexSchema.<init>(ManagedIndexSchema.java:108)
at app//org.apache.solr.schema.ManagedIndexSchemaFactory.create(ManagedIndexSchemaFactory.java:244)
at app//org.apache.solr.schema.ManagedIndexSchemaFactory.create(ManagedIndexSchemaFactory.java:51)
at app//org.apache.solr.core.ConfigSetService.createIndexSchema(ConfigSetService.java:316)
at app//org.apache.solr.core.ConfigSetService.lambda$loadConfigSet$0(ConfigSetService.java:247)
at app//org.apache.solr.core.ConfigSetService$$Lambda$343/0x00000001005ef440.get(Unknown Source)
at app//org.apache.solr.core.ConfigSet.<init>(ConfigSet.java:46)
at app//org.apache.solr.core.ConfigSetService.loadConfigSet(ConfigSetService.java:247)
at app//org.apache.solr.core.CoreContainer.reload(CoreContainer.java:1708)
at app//org.apache.solr.core.SolrCore.lambda$getConfListener$21(SolrCore.java:3140)
at app//org.apache.solr.core.SolrCore$$Lambda$1020/0x0000000100aee840.run(Unknown Source)
at app//org.apache.solr.cloud.ZkController.lambda$fireEventListeners$17(ZkController.java:2473)
at app//org.apache.solr.cloud.ZkController$$Lambda$1989/0x0000000101089c40.run(Unknown Source)
at java.base@11.0.11/java.lang.Thread.run(Thread.java:834)
Stack Trace:
com.carrotsearch.randomizedtesting.ThreadLeakError: 1 thread leaked from SUITE scope at org.apache.solr.handler.designer.TestSchemaDesignerSettingsDAO:
1) Thread[id=3000, name=ZKEventListenerThread, state=TIMED_WAITING, group=TGRP-TestSchemaDesignerSettingsDAO]
at java.base@11.0.11/java.lang.Thread.sleep(Native Method)
at app//org.apache.solr.common.cloud.ZkCmdExecutor.retryDelay(ZkCmdExecutor.java:156)
at app//org.apache.solr.common.cloud.ZkCmdExecutor.retryOperation(ZkCmdExecutor.java:89)
at app//org.apache.solr.common.cloud.SolrZkClient.getData(SolrZkClient.java:343)
at app//org.apache.solr.cloud.ZkSolrResourceLoader.openResource(ZkSolrResourceLoader.java:82)
at app//org.apache.lucene.analysis.AbstractAnalysisFactory.getLines(AbstractAnalysisFactory.java:302)
at app//org.apache.lucene.analysis.AbstractAnalysisFactory.getWordSet(AbstractAnalysisFactory.java:293)
at app//org.apache.lucene.analysis.util.ElisionFilterFactory.inform(ElisionFilterFactory.java:73)
at app//org.apache.solr.core.SolrResourceLoader.informAware(SolrResourceLoader.java:722)
at app//org.apache.solr.schema.ManagedIndexSchema.informResourceLoaderAwareObjectsInChain(ManagedIndexSchema.java:1353)
at app//org.apache.solr.schema.ManagedIndexSchema.informResourceLoaderAwareObjectsForFieldType(ManagedIndexSchema.java:1206)
at app//org.apache.solr.schema.ManagedIndexSchema.postReadInform(ManagedIndexSchema.java:1191)
at app//org.apache.solr.schema.IndexSchema.readSchema(IndexSchema.java:615)
at app//org.apache.solr.schema.IndexSchema.<init>(IndexSchema.java:177)
at app//org.apache.solr.schema.ManagedIndexSchema.<init>(ManagedIndexSchema.java:108)
at app//org.apache.solr.schema.ManagedIndexSchemaFactory.create(ManagedIndexSchemaFactory.java:244)
at app//org.apache.solr.schema.ManagedIndexSchemaFactory.create(ManagedIndexSchemaFactory.java:51)
at app//org.apache.solr.core.ConfigSetService.createIndexSchema(ConfigSetService.java:316)
at app//org.apache.solr.core.ConfigSetService.lambda$loadConfigSet$0(ConfigSetService.java:247)
at app//org.apache.solr.core.ConfigSetService$$Lambda$343/0x00000001005ef440.get(Unknown Source)
at app//org.apache.solr.core.ConfigSet.<init>(ConfigSet.java:46)
at app//org.apache.solr.core.ConfigSetService.loadConfigSet(ConfigSetService.java:247)
at app//org.apache.solr.core.CoreContainer.reload(CoreContainer.java:1708)
at app//org.apache.solr.core.SolrCore.lambda$getConfListener$21(SolrCore.java:3140)
at app//org.apache.solr.core.SolrCore$$Lambda$1020/0x0000000100aee840.run(Unknown Source)
at app//org.apache.solr.cloud.ZkController.lambda$fireEventListeners$17(ZkController.java:2473)
at app//org.apache.solr.cloud.ZkController$$Lambda$1989/0x0000000101089c40.run(Unknown Source)
at java.base@11.0.11/java.lang.Thread.run(Thread.java:834)
at __randomizedtesting.SeedInfo.seed([D98AF29C7B970645]:0)
Build Log:
[...truncated 14444 lines...]
ERROR: The following test(s) have failed:
- org.apache.solr.handler.designer.TestSchemaDesignerSettingsDAO.classMethod (:solr:core)
Test output: /home/jenkins/jenkins-slave/workspace/Solr/Solr-Check-main/solr/core/build/test-results/test/outputs/OUTPUT-org.apache.solr.handler.designer.TestSchemaDesignerSettingsDAO.txt
Reproduce with: gradlew :solr:core:test --tests "org.apache.solr.handler.designer.TestSchemaDesignerSettingsDAO.classMethod" -Ptests.jvms=4 -Ptests.haltonfailure=false -Ptests.jvmargs=-XX:TieredStopAtLevel=1 -Ptests.seed=D98AF29C7B970645 -Ptests.multiplier=2 -Ptests.badapples=false -Ptests.file.encoding=UTF-8
- org.apache.solr.handler.TestReplicationHandler.doTestIndexFetchOnLeaderRestart (:solr:core)
Test output: /home/jenkins/jenkins-slave/workspace/Solr/Solr-Check-main/solr/core/build/test-results/test/outputs/OUTPUT-org.apache.solr.handler.TestReplicationHandler.txt
Reproduce with: gradlew :solr:core:test --tests "org.apache.solr.handler.TestReplicationHandler.doTestIndexFetchOnLeaderRestart" -Ptests.jvms=4 -Ptests.haltonfailure=false -Ptests.jvmargs=-XX:TieredStopAtLevel=1 -Ptests.seed=D98AF29C7B970645 -Ptests.multiplier=2 -Ptests.badapples=false -Ptests.file.encoding=UTF-8
- org.apache.solr.cloud.OverseerCollectionConfigSetProcessorTest.testNoReplicationLimitedNodesToCreateOnDistributedUpdates (:solr:core)
Test output: /home/jenkins/jenkins-slave/workspace/Solr/Solr-Check-main/solr/core/build/test-results/test/outputs/OUTPUT-org.apache.solr.cloud.OverseerCollectionConfigSetProcessorTest.txt
Reproduce with: gradlew :solr:core:test --tests "org.apache.solr.cloud.OverseerCollectionConfigSetProcessorTest.testNoReplicationLimitedNodesToCreateOnDistributedUpdates" -Ptests.jvms=4 -Ptests.haltonfailure=false -Ptests.jvmargs=-XX:TieredStopAtLevel=1 -Ptests.seed=D98AF29C7B970645 -Ptests.multiplier=2 -Ptests.badapples=false -Ptests.file.encoding=UTF-8
Deprecated Gradle features were used in this build, making it incompatible with Gradle 8.0.
You can use '--warning-mode all' to show the individual deprecation warnings and determine if they come from your own scripts or plugins.
See https://docs.gradle.org/7.2/userguide/command_line_interface.html#sec:command_line_warnings
BUILD SUCCESSFUL in 51m 50s
407 actionable tasks: 407 executed
Build step 'Invoke Gradle script' changed build result to SUCCESS
Archiving artifacts
java.lang.InterruptedException: no matches found within 10000
at hudson.FilePath$ValidateAntFileMask.hasMatch(FilePath.java:3069)
at hudson.FilePath$ValidateAntFileMask.invoke(FilePath.java:2948)
at hudson.FilePath$ValidateAntFileMask.invoke(FilePath.java:2929)
at hudson.FilePath$FileCallableWrapper.call(FilePath.java:3317)
Also: hudson.remoting.Channel$CallSiteStackTrace: Remote call to lucene-solr-2
at hudson.remoting.Channel.attachCallSiteStackTrace(Channel.java:1800)
at hudson.remoting.UserRequest$ExceptionResponse.retrieve(UserRequest.java:356)
at hudson.remoting.Channel.call(Channel.java:1001)
at hudson.FilePath.act(FilePath.java:1159)
at hudson.FilePath.act(FilePath.java:1148)
at hudson.FilePath.validateAntFileMask(FilePath.java:2927)
at hudson.tasks.ArtifactArchiver.perform(ArtifactArchiver.java:270)
at hudson.tasks.BuildStepCompatibilityLayer.perform(BuildStepCompatibilityLayer.java:80)
at hudson.tasks.BuildStepMonitor$1.perform(BuildStepMonitor.java:20)
at hudson.model.AbstractBuild$AbstractBuildExecution.perform(AbstractBuild.java:803)
at hudson.model.AbstractBuild$AbstractBuildExecution.performAllBuildSteps(AbstractBuild.java:752)
at hudson.model.Build$BuildExecution.post2(Build.java:177)
at hudson.model.AbstractBuild$AbstractBuildExecution.post(AbstractBuild.java:697)
at hudson.model.Run.execute(Run.java:1931)
at hudson.model.FreeStyleBuild.run(FreeStyleBuild.java:43)
at hudson.model.ResourceController.execute(ResourceController.java:97)
at hudson.model.Executor.run(Executor.java:429)
Caused: hudson.FilePath$TunneledInterruptedException
at hudson.FilePath$FileCallableWrapper.call(FilePath.java:3319)
at hudson.remoting.UserRequest.perform(UserRequest.java:211)
at hudson.remoting.UserRequest.perform(UserRequest.java:54)
at hudson.remoting.Request$2.run(Request.java:376)
at hudson.remoting.InterceptingExecutorService.lambda$wrap$0(InterceptingExecutorService.java:78)
at java.util.concurrent.FutureTask.run(FutureTask.java:266)
at java.util.concurrent.ThreadPoolExecutor.runWorker(ThreadPoolExecutor.java:1149)
at java.util.concurrent.ThreadPoolExecutor$Worker.run(ThreadPoolExecutor.java:624)
at java.lang.Thread.run(Thread.java:748)
Caused: java.lang.InterruptedException: java.lang.InterruptedException: no matches found within 10000
at hudson.FilePath.act(FilePath.java:1161)
at hudson.FilePath.act(FilePath.java:1148)
at hudson.FilePath.validateAntFileMask(FilePath.java:2927)
at hudson.tasks.ArtifactArchiver.perform(ArtifactArchiver.java:270)
at hudson.tasks.BuildStepCompatibilityLayer.perform(BuildStepCompatibilityLayer.java:80)
at hudson.tasks.BuildStepMonitor$1.perform(BuildStepMonitor.java:20)
at hudson.model.AbstractBuild$AbstractBuildExecution.perform(AbstractBuild.java:803)
at hudson.model.AbstractBuild$AbstractBuildExecution.performAllBuildSteps(AbstractBuild.java:752)
at hudson.model.Build$BuildExecution.post2(Build.java:177)
at hudson.model.AbstractBuild$AbstractBuildExecution.post(AbstractBuild.java:697)
at hudson.model.Run.execute(Run.java:1931)
at hudson.model.FreeStyleBuild.run(FreeStyleBuild.java:43)
at hudson.model.ResourceController.execute(ResourceController.java:97)
at hudson.model.Executor.run(Executor.java:429)
No artifacts found that match the file pattern "**/*.events,heapdumps/**,**/hs_err_pid*". Configuration error?
Recording test results
[Checks API] No suitable checks publisher found.
Build step 'Publish JUnit test result report' changed build result to UNSTABLE
Email was triggered for: Unstable (Test Failures)
Sending email for trigger: Unstable (Test Failures)