You are viewing a plain text version of this content. The canonical link for it is here.
Posted to commits@beam.apache.org by Apache Jenkins Server <je...@builds.apache.org> on 2018/06/26 06:16:44 UTC

Build failed in Jenkins: beam_PerformanceTests_JDBC #770

See <https://builds.apache.org/job/beam_PerformanceTests_JDBC/770/display/redirect?page=changes>

Changes:

[jiangkai] [BEAM-4602][BEAM-4598] Date type comparison

[github] Cythonizing a few hot calls (#5733)

------------------------------------------
[...truncated 140.74 KB...]
    	at org.postgresql.jdbc.PgConnection.<init>(PgConnection.java:195)
    	at org.postgresql.Driver.makeConnection(Driver.java:452)
    	at org.postgresql.Driver.connect(Driver.java:254)
    	at java.sql.DriverManager.getConnection(DriverManager.java:664)
    	at java.sql.DriverManager.getConnection(DriverManager.java:247)
    	at org.postgresql.ds.common.BaseDataSource.getConnection(BaseDataSource.java:94)
    	at org.postgresql.ds.common.BaseDataSource.getConnection(BaseDataSource.java:79)
    	at org.apache.beam.sdk.io.common.DatabaseTestHelper.createTable(DatabaseTestHelper.java:46)
    	at org.apache.beam.sdk.io.jdbc.JdbcIOIT.createTable(JdbcIOIT.java:89)
    	at org.apache.beam.sdk.io.common.IOITHelper.executeWithRetry(IOITHelper.java:86)
    	at org.apache.beam.sdk.io.common.IOITHelper.executeWithRetry(IOITHelper.java:66)
    	at org.apache.beam.sdk.io.jdbc.JdbcIOIT.setup(JdbcIOIT.java:85)
    	at sun.reflect.NativeMethodAccessorImpl.invoke0(Native Method)
    	at sun.reflect.NativeMethodAccessorImpl.invoke(NativeMethodAccessorImpl.java:62)
    	at sun.reflect.DelegatingMethodAccessorImpl.invoke(DelegatingMethodAccessorImpl.java:43)
    	at java.lang.reflect.Method.invoke(Method.java:498)
    	at org.junit.runners.model.FrameworkMethod$1.runReflectiveCall(FrameworkMethod.java:50)
    	at org.junit.internal.runners.model.ReflectiveCallable.run(ReflectiveCallable.java:12)
    	at org.junit.runners.model.FrameworkMethod.invokeExplosively(FrameworkMethod.java:47)
    	at org.junit.internal.runners.statements.RunBefores.evaluate(RunBefores.java:24)
    	at org.junit.internal.runners.statements.RunAfters.evaluate(RunAfters.java:27)
    	at org.junit.runners.ParentRunner.run(ParentRunner.java:363)
    	at org.gradle.api.internal.tasks.testing.junit.JUnitTestClassExecutor.runTestClass(JUnitTestClassExecutor.java:106)
    	at org.gradle.api.internal.tasks.testing.junit.JUnitTestClassExecutor.execute(JUnitTestClassExecutor.java:58)
    	at org.gradle.api.internal.tasks.testing.junit.JUnitTestClassExecutor.execute(JUnitTestClassExecutor.java:38)
    	at org.gradle.api.internal.tasks.testing.junit.AbstractJUnitTestClassProcessor.processTestClass(AbstractJUnitTestClassProcessor.java:66)
    	at org.gradle.api.internal.tasks.testing.SuiteTestClassProcessor.processTestClass(SuiteTestClassProcessor.java:51)
    	at sun.reflect.NativeMethodAccessorImpl.invoke0(Native Method)
    	at sun.reflect.NativeMethodAccessorImpl.invoke(NativeMethodAccessorImpl.java:62)
    	at sun.reflect.DelegatingMethodAccessorImpl.invoke(DelegatingMethodAccessorImpl.java:43)
    	at java.lang.reflect.Method.invoke(Method.java:498)
    	at org.gradle.internal.dispatch.ReflectionDispatch.dispatch(ReflectionDispatch.java:35)
    	at org.gradle.internal.dispatch.ReflectionDispatch.dispatch(ReflectionDispatch.java:24)
    	at org.gradle.internal.dispatch.ContextClassLoaderDispatch.dispatch(ContextClassLoaderDispatch.java:32)
    	at org.gradle.internal.dispatch.ProxyDispatchAdapter$DispatchingInvocationHandler.invoke(ProxyDispatchAdapter.java:93)
    	at com.sun.proxy.$Proxy2.processTestClass(Unknown Source)
    	at org.gradle.api.internal.tasks.testing.worker.TestWorker.processTestClass(TestWorker.java:109)
    	at sun.reflect.NativeMethodAccessorImpl.invoke0(Native Method)
    	at sun.reflect.NativeMethodAccessorImpl.invoke(NativeMethodAccessorImpl.java:62)
    	at sun.reflect.DelegatingMethodAccessorImpl.invoke(DelegatingMethodAccessorImpl.java:43)
    	at java.lang.reflect.Method.invoke(Method.java:498)
    	at org.gradle.internal.dispatch.ReflectionDispatch.dispatch(ReflectionDispatch.java:35)
    	at org.gradle.internal.dispatch.ReflectionDispatch.dispatch(ReflectionDispatch.java:24)
    	at org.gradle.internal.remote.internal.hub.MessageHubBackedObjectConnection$DispatchWrapper.dispatch(MessageHubBackedObjectConnection.java:155)
    	at org.gradle.internal.remote.internal.hub.MessageHubBackedObjectConnection$DispatchWrapper.dispatch(MessageHubBackedObjectConnection.java:137)
    	at org.gradle.internal.remote.internal.hub.MessageHub$Handler.run(MessageHub.java:404)
    	at org.gradle.internal.concurrent.ExecutorPolicy$CatchAndRecordFailures.onExecute(ExecutorPolicy.java:63)
    	at org.gradle.internal.concurrent.ManagedExecutorImpl$1.run(ManagedExecutorImpl.java:46)
    	at java.util.concurrent.ThreadPoolExecutor.runWorker(ThreadPoolExecutor.java:1149)
    	at java.util.concurrent.ThreadPoolExecutor$Worker.run(ThreadPoolExecutor.java:624)
    	at org.gradle.internal.concurrent.ThreadFactoryImpl$ManagedThreadRunnable.run(ThreadFactoryImpl.java:55)
    	at java.lang.Thread.run(Thread.java:748)
    Caused by: java.net.SocketTimeoutException: connect timed out
    	at java.net.PlainSocketImpl.socketConnect(Native Method)
    	at java.net.AbstractPlainSocketImpl.doConnect(AbstractPlainSocketImpl.java:350)
    	at java.net.AbstractPlainSocketImpl.connectToAddress(AbstractPlainSocketImpl.java:206)
    	at java.net.AbstractPlainSocketImpl.connect(AbstractPlainSocketImpl.java:188)
    	at java.net.SocksSocketImpl.connect(SocksSocketImpl.java:392)
    	at java.net.Socket.connect(Socket.java:589)
    	at org.postgresql.core.PGStream.<init>(PGStream.java:69)
    	at org.postgresql.core.v3.ConnectionFactoryImpl.openConnectionImpl(ConnectionFactoryImpl.java:156)
    	... 53 more

    Jun 26, 2018 6:16:32 AM org.postgresql.ds.common.BaseDataSource getConnection
    SEVERE: Failed to create a Non-Pooling DataSource from PostgreSQL JDBC Driver 42.2.2 for postgres at jdbc:postgresql://35.232.138.33:5432/postgres?ssl=false: org.postgresql.util.PSQLException: The connection attempt failed.
    Jun 26, 2018 6:16:32 AM org.apache.beam.sdk.io.common.IOITHelper executeWithRetry
    WARNING: Attempt #3 of 3 failed: The connection attempt failed..
    Jun 26, 2018 6:16:35 AM org.apache.beam.sdk.io.common.IOITHelper executeWithRetry
    WARNING: Attempt #1 of 3 failed: ERROR: table "beamtest_it_2018_06_26_06_15_56_696" does not exist.
    Jun 26, 2018 6:16:35 AM org.apache.beam.sdk.io.common.IOITHelper executeWithRetry
    WARNING: Retrying in 2000 ms.
    Jun 26, 2018 6:16:37 AM org.apache.beam.sdk.io.common.IOITHelper executeWithRetry
    WARNING: Attempt #2 of 3 failed: ERROR: table "beamtest_it_2018_06_26_06_15_56_696" does not exist.
    Jun 26, 2018 6:16:37 AM org.apache.beam.sdk.io.common.IOITHelper executeWithRetry
    WARNING: Retrying in 4000 ms.
    Jun 26, 2018 6:16:41 AM org.apache.beam.sdk.io.common.IOITHelper executeWithRetry
    WARNING: Attempt #3 of 3 failed: ERROR: table "beamtest_it_2018_06_26_06_15_56_696" does not exist.

Gradle Test Executor 1 finished executing tests.

> Task :beam-sdks-java-io-jdbc:integrationTest FAILED

org.apache.beam.sdk.io.jdbc.JdbcIOIT > classMethod FAILED
    org.postgresql.util.PSQLException: The connection attempt failed.
        at org.postgresql.core.v3.ConnectionFactoryImpl.openConnectionImpl(ConnectionFactoryImpl.java:257)
        at org.postgresql.core.ConnectionFactory.openConnection(ConnectionFactory.java:49)
        at org.postgresql.jdbc.PgConnection.<init>(PgConnection.java:195)
        at org.postgresql.Driver.makeConnection(Driver.java:452)
        at org.postgresql.Driver.connect(Driver.java:254)
        at java.sql.DriverManager.getConnection(DriverManager.java:664)
        at java.sql.DriverManager.getConnection(DriverManager.java:247)
        at org.postgresql.ds.common.BaseDataSource.getConnection(BaseDataSource.java:94)
        at org.postgresql.ds.common.BaseDataSource.getConnection(BaseDataSource.java:79)
        at org.apache.beam.sdk.io.common.DatabaseTestHelper.createTable(DatabaseTestHelper.java:46)
        at org.apache.beam.sdk.io.jdbc.JdbcIOIT.createTable(JdbcIOIT.java:89)
        at org.apache.beam.sdk.io.common.IOITHelper.executeWithRetry(IOITHelper.java:86)
        at org.apache.beam.sdk.io.common.IOITHelper.executeWithRetry(IOITHelper.java:66)
        at org.apache.beam.sdk.io.jdbc.JdbcIOIT.setup(JdbcIOIT.java:85)

        Caused by:
        java.net.SocketTimeoutException: connect timed out
            at java.net.PlainSocketImpl.socketConnect(Native Method)
            at java.net.AbstractPlainSocketImpl.doConnect(AbstractPlainSocketImpl.java:350)
            at java.net.AbstractPlainSocketImpl.connectToAddress(AbstractPlainSocketImpl.java:206)
            at java.net.AbstractPlainSocketImpl.connect(AbstractPlainSocketImpl.java:188)
            at java.net.SocksSocketImpl.connect(SocksSocketImpl.java:392)
            at java.net.Socket.connect(Socket.java:589)
            at org.postgresql.core.PGStream.<init>(PGStream.java:69)
            at org.postgresql.core.v3.ConnectionFactoryImpl.openConnectionImpl(ConnectionFactoryImpl.java:156)
            ... 13 more

org.apache.beam.sdk.io.jdbc.JdbcIOIT > classMethod FAILED
    org.postgresql.util.PSQLException: ERROR: table "beamtest_it_2018_06_26_06_15_56_696" does not exist
        at org.postgresql.core.v3.QueryExecutorImpl.receiveErrorResponse(QueryExecutorImpl.java:2433)
        at org.postgresql.core.v3.QueryExecutorImpl.processResults(QueryExecutorImpl.java:2178)
        at org.postgresql.core.v3.QueryExecutorImpl.execute(QueryExecutorImpl.java:306)
        at org.postgresql.jdbc.PgStatement.executeInternal(PgStatement.java:441)
        at org.postgresql.jdbc.PgStatement.execute(PgStatement.java:365)
        at org.postgresql.jdbc.PgStatement.executeWithFlags(PgStatement.java:307)
        at org.postgresql.jdbc.PgStatement.executeCachedSql(PgStatement.java:293)
        at org.postgresql.jdbc.PgStatement.executeWithFlags(PgStatement.java:270)
        at org.postgresql.jdbc.PgStatement.executeUpdate(PgStatement.java:244)
        at org.apache.beam.sdk.io.common.DatabaseTestHelper.deleteTable(DatabaseTestHelper.java:59)
        at org.apache.beam.sdk.io.jdbc.JdbcIOIT.deleteTable(JdbcIOIT.java:98)
        at org.apache.beam.sdk.io.common.IOITHelper.executeWithRetry(IOITHelper.java:86)
        at org.apache.beam.sdk.io.common.IOITHelper.executeWithRetry(IOITHelper.java:66)
        at org.apache.beam.sdk.io.jdbc.JdbcIOIT.tearDown(JdbcIOIT.java:94)
Finished generating test XML results (0.016 secs) into: <https://builds.apache.org/job/beam_PerformanceTests_JDBC/ws/src/sdks/java/io/jdbc/build/test-results/integrationTest>
Generating HTML test report...
Finished generating test html results (0.3 secs) into: <https://builds.apache.org/job/beam_PerformanceTests_JDBC/ws/src/sdks/java/io/jdbc/build/reports/tests/integrationTest>
:beam-sdks-java-io-jdbc:integrationTest (Thread[Task worker for ':' Thread 9,5,main]) completed. Took 47.83 secs.

Deprecated Gradle features were used in this build, making it incompatible with Gradle 5.0.
See https://docs.gradle.org/4.8/userguide/command_line_interface.html#sec:command_line_warnings
62 actionable tasks: 1 executed, 61 up-to-date

Publishing build scan...
https://gradle.com/s/k3n4rphnw7f44


STDERR: 
2 tests completed, 2 failed

FAILURE: Build failed with an exception.

* What went wrong:
Execution failed for task ':beam-sdks-java-io-jdbc:integrationTest'.
> There were failing tests. See the report at: file://<https://builds.apache.org/job/beam_PerformanceTests_JDBC/ws/src/sdks/java/io/jdbc/build/reports/tests/integrationTest/index.html>

* Try:
Run with --debug option to get more log output. Run with --scan to get full insights.

* Exception is:
org.gradle.api.tasks.TaskExecutionException: Execution failed for task ':beam-sdks-java-io-jdbc:integrationTest'.
	at org.gradle.api.internal.tasks.execution.ExecuteActionsTaskExecuter.executeActions(ExecuteActionsTaskExecuter.java:110)
	at org.gradle.api.internal.tasks.execution.ExecuteActionsTaskExecuter.execute(ExecuteActionsTaskExecuter.java:77)
	at org.gradle.api.internal.tasks.execution.OutputDirectoryCreatingTaskExecuter.execute(OutputDirectoryCreatingTaskExecuter.java:51)
	at org.gradle.api.internal.tasks.execution.SkipCachedTaskExecuter.execute(SkipCachedTaskExecuter.java:105)
	at org.gradle.api.internal.tasks.execution.SkipUpToDateTaskExecuter.execute(SkipUpToDateTaskExecuter.java:59)
	at org.gradle.api.internal.tasks.execution.ResolveTaskOutputCachingStateExecuter.execute(ResolveTaskOutputCachingStateExecuter.java:54)
	at org.gradle.api.internal.tasks.execution.ResolveBuildCacheKeyExecuter.execute(ResolveBuildCacheKeyExecuter.java:66)
	at org.gradle.api.internal.tasks.execution.ValidatingTaskExecuter.execute(ValidatingTaskExecuter.java:59)
	at org.gradle.api.internal.tasks.execution.SkipEmptySourceFilesTaskExecuter.execute(SkipEmptySourceFilesTaskExecuter.java:101)
	at org.gradle.api.internal.tasks.execution.FinalizeInputFilePropertiesTaskExecuter.execute(FinalizeInputFilePropertiesTaskExecuter.java:44)
	at org.gradle.api.internal.tasks.execution.CleanupStaleOutputsExecuter.execute(CleanupStaleOutputsExecuter.java:91)
	at org.gradle.api.internal.tasks.execution.ResolveTaskArtifactStateTaskExecuter.execute(ResolveTaskArtifactStateTaskExecuter.java:62)
	at org.gradle.api.internal.tasks.execution.SkipTaskWithNoActionsExecuter.execute(SkipTaskWithNoActionsExecuter.java:59)
	at org.gradle.api.internal.tasks.execution.SkipOnlyIfTaskExecuter.execute(SkipOnlyIfTaskExecuter.java:54)
	at org.gradle.api.internal.tasks.execution.ExecuteAtMostOnceTaskExecuter.execute(ExecuteAtMostOnceTaskExecuter.java:43)
	at org.gradle.api.internal.tasks.execution.CatchExceptionTaskExecuter.execute(CatchExceptionTaskExecuter.java:34)
	at org.gradle.api.internal.tasks.execution.EventFiringTaskExecuter$1.run(EventFiringTaskExecuter.java:51)
	at org.gradle.internal.operations.DefaultBuildOperationExecutor$RunnableBuildOperationWorker.execute(DefaultBuildOperationExecutor.java:317)
	at org.gradle.internal.operations.DefaultBuildOperationExecutor$RunnableBuildOperationWorker.execute(DefaultBuildOperationExecutor.java:309)
	at org.gradle.internal.operations.DefaultBuildOperationExecutor.execute(DefaultBuildOperationExecutor.java:185)
	at org.gradle.internal.operations.DefaultBuildOperationExecutor.run(DefaultBuildOperationExecutor.java:97)
	at org.gradle.internal.operations.DelegatingBuildOperationExecutor.run(DelegatingBuildOperationExecutor.java:31)
	at org.gradle.api.internal.tasks.execution.EventFiringTaskExecuter.execute(EventFiringTaskExecuter.java:46)
	at org.gradle.execution.taskgraph.DefaultTaskExecutionGraph$ExecuteTaskAction.execute(DefaultTaskExecutionGraph.java:262)
	at org.gradle.execution.taskgraph.DefaultTaskExecutionGraph$ExecuteTaskAction.execute(DefaultTaskExecutionGraph.java:246)
	at org.gradle.execution.taskgraph.DefaultTaskPlanExecutor$TaskExecutorWorker$1.execute(DefaultTaskPlanExecutor.java:136)
	at org.gradle.execution.taskgraph.DefaultTaskPlanExecutor$TaskExecutorWorker$1.execute(DefaultTaskPlanExecutor.java:130)
	at org.gradle.execution.taskgraph.DefaultTaskPlanExecutor$TaskExecutorWorker.execute(DefaultTaskPlanExecutor.java:201)
	at org.gradle.execution.taskgraph.DefaultTaskPlanExecutor$TaskExecutorWorker.executeWithTask(DefaultTaskPlanExecutor.java:192)
	at org.gradle.execution.taskgraph.DefaultTaskPlanExecutor$TaskExecutorWorker.run(DefaultTaskPlanExecutor.java:130)
	at org.gradle.internal.concurrent.ExecutorPolicy$CatchAndRecordFailures.onExecute(ExecutorPolicy.java:63)
	at org.gradle.internal.concurrent.ManagedExecutorImpl$1.run(ManagedExecutorImpl.java:46)
	at org.gradle.internal.concurrent.ThreadFactoryImpl$ManagedThreadRunnable.run(ThreadFactoryImpl.java:55)
Caused by: org.gradle.api.GradleException: There were failing tests. See the report at: file://<https://builds.apache.org/job/beam_PerformanceTests_JDBC/ws/src/sdks/java/io/jdbc/build/reports/tests/integrationTest/index.html>
	at org.gradle.api.tasks.testing.AbstractTestTask.handleTestFailures(AbstractTestTask.java:612)
	at org.gradle.api.tasks.testing.AbstractTestTask.executeTests(AbstractTestTask.java:484)
	at org.gradle.api.tasks.testing.Test.executeTests(Test.java:603)
	at org.gradle.internal.reflect.JavaMethod.invoke(JavaMethod.java:73)
	at org.gradle.api.internal.project.taskfactory.StandardTaskAction.doExecute(StandardTaskAction.java:46)
	at org.gradle.api.internal.project.taskfactory.StandardTaskAction.execute(StandardTaskAction.java:39)
	at org.gradle.api.internal.project.taskfactory.StandardTaskAction.execute(StandardTaskAction.java:26)
	at org.gradle.api.internal.AbstractTask$TaskActionWrapper.execute(AbstractTask.java:794)
	at org.gradle.api.internal.AbstractTask$TaskActionWrapper.execute(AbstractTask.java:761)
	at org.gradle.api.internal.tasks.execution.ExecuteActionsTaskExecuter$1.run(ExecuteActionsTaskExecuter.java:131)
	at org.gradle.internal.operations.DefaultBuildOperationExecutor$RunnableBuildOperationWorker.execute(DefaultBuildOperationExecutor.java:317)
	at org.gradle.internal.operations.DefaultBuildOperationExecutor$RunnableBuildOperationWorker.execute(DefaultBuildOperationExecutor.java:309)
	at org.gradle.internal.operations.DefaultBuildOperationExecutor.execute(DefaultBuildOperationExecutor.java:185)
	at org.gradle.internal.operations.DefaultBuildOperationExecutor.run(DefaultBuildOperationExecutor.java:97)
	at org.gradle.internal.operations.DelegatingBuildOperationExecutor.run(DelegatingBuildOperationExecutor.java:31)
	at org.gradle.api.internal.tasks.execution.ExecuteActionsTaskExecuter.executeAction(ExecuteActionsTaskExecuter.java:120)
	at org.gradle.api.internal.tasks.execution.ExecuteActionsTaskExecuter.executeActions(ExecuteActionsTaskExecuter.java:99)
	... 32 more


* Get more help at https://help.gradle.org

BUILD FAILED in 58s

2018-06-26 06:16:43,305 e2e8dee7 MainThread beam_integration_benchmark(1/1) ERROR    Error during benchmark beam_integration_benchmark
Traceback (most recent call last):
  File "<https://builds.apache.org/job/beam_PerformanceTests_JDBC/ws/PerfKitBenchmarker/perfkitbenchmarker/pkb.py",> line 667, in RunBenchmark
    DoRunPhase(spec, collector, detailed_timer)
  File "<https://builds.apache.org/job/beam_PerformanceTests_JDBC/ws/PerfKitBenchmarker/perfkitbenchmarker/pkb.py",> line 547, in DoRunPhase
    samples = spec.BenchmarkRun(spec)
  File "<https://builds.apache.org/job/beam_PerformanceTests_JDBC/ws/PerfKitBenchmarker/perfkitbenchmarker/linux_benchmarks/beam_integration_benchmark.py",> line 159, in Run
    job_type=job_type)
  File "<https://builds.apache.org/job/beam_PerformanceTests_JDBC/ws/PerfKitBenchmarker/perfkitbenchmarker/providers/gcp/gcp_dpb_dataflow.py",> line 90, in SubmitJob
    assert retcode == 0, "Integration Test Failed."
AssertionError: Integration Test Failed.
2018-06-26 06:16:43,306 e2e8dee7 MainThread beam_integration_benchmark(1/1) INFO     Cleaning up benchmark beam_integration_benchmark
2018-06-26 06:16:43,307 e2e8dee7 MainThread beam_integration_benchmark(1/1) INFO     Running: kubectl --kubeconfig=<https://builds.apache.org/job/beam_PerformanceTests_JDBC/ws/config-beam-performancetests-jdbc-770> delete -f <https://builds.apache.org/job/beam_PerformanceTests_JDBC/ws/src/.test-infra/kubernetes/postgres/postgres-service-for-local-dev.yml> --ignore-not-found
2018-06-26 06:16:43,915 e2e8dee7 MainThread beam_integration_benchmark(1/1) ERROR    Exception running benchmark
Traceback (most recent call last):
  File "<https://builds.apache.org/job/beam_PerformanceTests_JDBC/ws/PerfKitBenchmarker/perfkitbenchmarker/pkb.py",> line 801, in RunBenchmarkTask
    RunBenchmark(spec, collector)
  File "<https://builds.apache.org/job/beam_PerformanceTests_JDBC/ws/PerfKitBenchmarker/perfkitbenchmarker/pkb.py",> line 667, in RunBenchmark
    DoRunPhase(spec, collector, detailed_timer)
  File "<https://builds.apache.org/job/beam_PerformanceTests_JDBC/ws/PerfKitBenchmarker/perfkitbenchmarker/pkb.py",> line 547, in DoRunPhase
    samples = spec.BenchmarkRun(spec)
  File "<https://builds.apache.org/job/beam_PerformanceTests_JDBC/ws/PerfKitBenchmarker/perfkitbenchmarker/linux_benchmarks/beam_integration_benchmark.py",> line 159, in Run
    job_type=job_type)
  File "<https://builds.apache.org/job/beam_PerformanceTests_JDBC/ws/PerfKitBenchmarker/perfkitbenchmarker/providers/gcp/gcp_dpb_dataflow.py",> line 90, in SubmitJob
    assert retcode == 0, "Integration Test Failed."
AssertionError: Integration Test Failed.
2018-06-26 06:16:43,915 e2e8dee7 MainThread beam_integration_benchmark(1/1) ERROR    Benchmark 1/1 beam_integration_benchmark (UID: beam_integration_benchmark0) failed. Execution will continue.
2018-06-26 06:16:43,959 e2e8dee7 MainThread INFO     Benchmark run statuses:
---------------------------------------------------------------------------------
Name                        UID                          Status  Failed Substatus
---------------------------------------------------------------------------------
beam_integration_benchmark  beam_integration_benchmark0  FAILED                  
---------------------------------------------------------------------------------
Success rate: 0.00% (0/1)
2018-06-26 06:16:43,960 e2e8dee7 MainThread INFO     Complete logs can be found at: <https://builds.apache.org/job/beam_PerformanceTests_JDBC/ws/runs/e2e8dee7/pkb.log>
2018-06-26 06:16:43,960 e2e8dee7 MainThread INFO     Completion statuses can be found at: <https://builds.apache.org/job/beam_PerformanceTests_JDBC/ws/runs/e2e8dee7/completion_statuses.json>
Build step 'Execute shell' marked build as failure

Jenkins build is back to normal : beam_PerformanceTests_JDBC #773

Posted by Apache Jenkins Server <je...@builds.apache.org>.
See <https://builds.apache.org/job/beam_PerformanceTests_JDBC/773/display/redirect?page=changes>


Build failed in Jenkins: beam_PerformanceTests_JDBC #772

Posted by Apache Jenkins Server <je...@builds.apache.org>.
See <https://builds.apache.org/job/beam_PerformanceTests_JDBC/772/display/redirect?page=changes>

Changes:

[daniel.o.programmer] [BEAM-2937] Comment Combine Grouped Values URN.

[daniel.o.programmer] [BEAM-2973] Moving CombineValues URN to different enum.

[apilloud] [SQL] Don't wait on Unbounded PCollections

[daniel.o.programmer] [BEAM-3708] Adding Combine component implementations to Java SDK

[daniel.o.programmer] Quick fix, removing commented out code.

------------------------------------------
[...truncated 195.03 KB...]
:beam-runners-core-construction-java:compileJava (Thread[Task worker for ':' Thread 10,5,main]) completed. Took 0.079 secs.
:beam-runners-core-construction-java:classes (Thread[Task worker for ':' Thread 10,5,main]) started.

> Task :beam-runners-core-construction-java:classes UP-TO-DATE
Skipping task ':beam-runners-core-construction-java:classes' as it has no actions.
:beam-runners-core-construction-java:classes (Thread[Task worker for ':' Thread 10,5,main]) completed. Took 0.0 secs.
:beam-runners-core-construction-java:shadowJar (Thread[Task worker for ':' Thread 10,5,main]) started.

> Task :beam-sdks-java-fn-execution:shadowJar UP-TO-DATE
Build cache key for task ':beam-sdks-java-fn-execution:shadowJar' is 8cc7cd4fc2088e8d6e560b61249982ff
Caching disabled for task ':beam-sdks-java-fn-execution:shadowJar': Caching has not been enabled for the task
Skipping task ':beam-sdks-java-fn-execution:shadowJar' as it is up-to-date.
:beam-sdks-java-fn-execution:shadowJar (Thread[Task worker for ':' Thread 6,5,main]) completed. Took 0.009 secs.

> Task :beam-runners-core-construction-java:shadowJar UP-TO-DATE
Build cache key for task ':beam-runners-core-construction-java:shadowJar' is 383c3d575be4b1579ce2ca3eafddc2a7
Caching disabled for task ':beam-runners-core-construction-java:shadowJar': Caching has not been enabled for the task
Skipping task ':beam-runners-core-construction-java:shadowJar' as it is up-to-date.
:beam-runners-core-construction-java:shadowJar (Thread[Task worker for ':' Thread 10,5,main]) completed. Took 0.016 secs.
:beam-runners-core-java:compileJava (Thread[Task worker for ':' Thread 10,5,main]) started.

> Task :beam-runners-core-java:compileJava UP-TO-DATE
Build cache key for task ':beam-runners-core-java:compileJava' is 28bb24d62271634b18996d466a670e7d
Skipping task ':beam-runners-core-java:compileJava' as it is up-to-date.
:beam-runners-core-java:compileJava (Thread[Task worker for ':' Thread 10,5,main]) completed. Took 0.062 secs.
:beam-runners-core-java:classes (Thread[Task worker for ':' Thread 10,5,main]) started.

> Task :beam-runners-core-java:classes UP-TO-DATE
Skipping task ':beam-runners-core-java:classes' as it has no actions.
:beam-runners-core-java:classes (Thread[Task worker for ':' Thread 10,5,main]) completed. Took 0.0 secs.
:beam-runners-core-java:shadowJar (Thread[Task worker for ':' Thread 10,5,main]) started.

> Task :beam-sdks-java-io-google-cloud-platform:compileJava UP-TO-DATE
Build cache key for task ':beam-sdks-java-io-google-cloud-platform:compileJava' is 9d88ddb2eb6ca4cedbe0c18929deea16
Skipping task ':beam-sdks-java-io-google-cloud-platform:compileJava' as it is up-to-date.
:beam-sdks-java-io-google-cloud-platform:compileJava (Thread[Task worker for ':',5,main]) completed. Took 0.095 secs.

> Task :beam-runners-core-java:shadowJar UP-TO-DATE
Build cache key for task ':beam-runners-core-java:shadowJar' is ff1af4acc28b08c04c174bc85acbbd79
Caching disabled for task ':beam-runners-core-java:shadowJar': Caching has not been enabled for the task
Skipping task ':beam-runners-core-java:shadowJar' as it is up-to-date.
:beam-runners-core-java:shadowJar (Thread[Task worker for ':' Thread 10,5,main]) completed. Took 0.011 secs.
:beam-sdks-java-io-google-cloud-platform:classes (Thread[Task worker for ':',5,main]) started.

> Task :beam-sdks-java-io-google-cloud-platform:classes UP-TO-DATE
Skipping task ':beam-sdks-java-io-google-cloud-platform:classes' as it has no actions.
:beam-sdks-java-io-google-cloud-platform:classes (Thread[Task worker for ':',5,main]) completed. Took 0.0 secs.
:beam-sdks-java-harness:compileJava (Thread[Task worker for ':',5,main]) started.
:beam-sdks-java-io-google-cloud-platform:shadowJar (Thread[Task worker for ':' Thread 10,5,main]) started.

> Task :beam-sdks-java-io-google-cloud-platform:shadowJar UP-TO-DATE
Build cache key for task ':beam-sdks-java-io-google-cloud-platform:shadowJar' is 639300518964c1b5f1537c883cab07ab
Caching disabled for task ':beam-sdks-java-io-google-cloud-platform:shadowJar': Caching has not been enabled for the task
Skipping task ':beam-sdks-java-io-google-cloud-platform:shadowJar' as it is up-to-date.
:beam-sdks-java-io-google-cloud-platform:shadowJar (Thread[Task worker for ':' Thread 10,5,main]) completed. Took 0.022 secs.
:beam-runners-google-cloud-dataflow-java:compileJava (Thread[Task worker for ':' Thread 10,5,main]) started.

> Task :beam-runners-google-cloud-dataflow-java:compileJava UP-TO-DATE
Build cache key for task ':beam-runners-google-cloud-dataflow-java:compileJava' is 8bdb059ddefa201522d88246db794fe4
Skipping task ':beam-runners-google-cloud-dataflow-java:compileJava' as it is up-to-date.
:beam-runners-google-cloud-dataflow-java:compileJava (Thread[Task worker for ':' Thread 10,5,main]) completed. Took 0.066 secs.
:beam-runners-google-cloud-dataflow-java:classes (Thread[Task worker for ':' Thread 10,5,main]) started.

> Task :beam-runners-google-cloud-dataflow-java:classes UP-TO-DATE
Skipping task ':beam-runners-google-cloud-dataflow-java:classes' as it has no actions.
:beam-runners-google-cloud-dataflow-java:classes (Thread[Task worker for ':' Thread 10,5,main]) completed. Took 0.0 secs.
:beam-runners-google-cloud-dataflow-java:shadowJar (Thread[Task worker for ':' Thread 10,5,main]) started.

> Task :beam-runners-google-cloud-dataflow-java:shadowJar UP-TO-DATE
Build cache key for task ':beam-runners-google-cloud-dataflow-java:shadowJar' is 5d3a7599b39a831346248bed5b28069c
Caching disabled for task ':beam-runners-google-cloud-dataflow-java:shadowJar': Caching has not been enabled for the task
Skipping task ':beam-runners-google-cloud-dataflow-java:shadowJar' as it is up-to-date.
:beam-runners-google-cloud-dataflow-java:shadowJar (Thread[Task worker for ':' Thread 10,5,main]) completed. Took 0.016 secs.

> Task :beam-sdks-java-core:compileTestJava UP-TO-DATE
Build cache key for task ':beam-sdks-java-core:compileTestJava' is 2088198e806cc366406be68efd4d0415
Skipping task ':beam-sdks-java-core:compileTestJava' as it is up-to-date.
:beam-sdks-java-core:compileTestJava (Thread[Task worker for ':' Thread 8,5,main]) completed. Took 0.335 secs.
:beam-sdks-java-core:processTestResources (Thread[Task worker for ':' Thread 8,5,main]) started.

> Task :beam-sdks-java-core:processTestResources NO-SOURCE
file or directory '<https://builds.apache.org/job/beam_PerformanceTests_JDBC/ws/src/sdks/java/core/src/test/resources',> not found
Skipping task ':beam-sdks-java-core:processTestResources' as it has no source files and no previous output files.
:beam-sdks-java-core:processTestResources (Thread[Task worker for ':' Thread 8,5,main]) completed. Took 0.001 secs.
:beam-sdks-java-core:testClasses (Thread[Task worker for ':' Thread 8,5,main]) started.

> Task :beam-sdks-java-core:testClasses UP-TO-DATE
Skipping task ':beam-sdks-java-core:testClasses' as it has no actions.
:beam-sdks-java-core:testClasses (Thread[Task worker for ':' Thread 8,5,main]) completed. Took 0.0 secs.
:beam-sdks-java-core:shadowTestJar (Thread[Task worker for ':' Thread 11,5,main]) started.

> Task :beam-sdks-java-core:shadowTestJar UP-TO-DATE
Build cache key for task ':beam-sdks-java-core:shadowTestJar' is b808aa36cfce2399882f3b320911390f
Caching disabled for task ':beam-sdks-java-core:shadowTestJar': Caching has not been enabled for the task
Skipping task ':beam-sdks-java-core:shadowTestJar' as it is up-to-date.
:beam-sdks-java-core:shadowTestJar (Thread[Task worker for ':' Thread 11,5,main]) completed. Took 0.053 secs.
:beam-sdks-java-extensions-google-cloud-platform-core:compileTestJava (Thread[Task worker for ':' Thread 11,5,main]) started.

> Task :beam-sdks-java-harness:compileJava
Build cache key for task ':beam-sdks-java-harness:compileJava' is e764beee21936682b6202c7edc471aed
Task ':beam-sdks-java-harness:compileJava' is not up-to-date because:
  Task has failed previously.
Custom actions are attached to task ':beam-sdks-java-harness:compileJava'.
All input files are considered out-of-date for incremental task ':beam-sdks-java-harness:compileJava'.
Compiling with error-prone compiler

> Task :beam-sdks-java-harness:compileJava FAILED
:beam-sdks-java-harness:compileJava (Thread[Task worker for ':',5,main]) completed. Took 4.156 secs.

> Task :beam-sdks-java-extensions-google-cloud-platform-core:compileTestJava
Build cache key for task ':beam-sdks-java-extensions-google-cloud-platform-core:compileTestJava' is b69268bdb862b25e9a59214a4857d747
Task ':beam-sdks-java-extensions-google-cloud-platform-core:compileTestJava' is not up-to-date because:
  No history is available.
Custom actions are attached to task ':beam-sdks-java-extensions-google-cloud-platform-core:compileTestJava'.
All input files are considered out-of-date for incremental task ':beam-sdks-java-extensions-google-cloud-platform-core:compileTestJava'.
Compiling with error-prone compiler
Packing task ':beam-sdks-java-extensions-google-cloud-platform-core:compileTestJava'
:beam-sdks-java-extensions-google-cloud-platform-core:compileTestJava (Thread[Task worker for ':' Thread 11,5,main]) completed. Took 5.251 secs.

Deprecated Gradle features were used in this build, making it incompatible with Gradle 5.0.
See https://docs.gradle.org/4.8/userguide/command_line_interface.html#sec:command_line_warnings
49 actionable tasks: 2 executed, 47 up-to-date

Publishing build scan...
https://gradle.com/s/pkigtapibh576


STDERR: <https://builds.apache.org/job/beam_PerformanceTests_JDBC/ws/src/sdks/java/harness/src/main/java/org/apache/beam/fn/harness/CombineRunners.java>:53: error: cannot find symbol
          BeamUrns.getUrn(StandardPTransforms.Composites.COMBINE_GROUPED_VALUES),
                                                        ^
  symbol:   variable COMBINE_GROUPED_VALUES
  location: class Composites
Note: <https://builds.apache.org/job/beam_PerformanceTests_JDBC/ws/src/sdks/java/harness/src/main/java/org/apache/beam/fn/harness/state/FnApiStateAccessor.java> uses or overrides a deprecated API.
Note: Recompile with -Xlint:deprecation for details.
Note: Some input files use unchecked or unsafe operations.
Note: Recompile with -Xlint:unchecked for details.
1 error

FAILURE: Build failed with an exception.

* What went wrong:
Execution failed for task ':beam-sdks-java-harness:compileJava'.
> Compilation failed with exit code 1; see the compiler error output for details.

* Try:
Run with --debug option to get more log output. Run with --scan to get full insights.

* Exception is:
org.gradle.api.tasks.TaskExecutionException: Execution failed for task ':beam-sdks-java-harness:compileJava'.
	at org.gradle.api.internal.tasks.execution.ExecuteActionsTaskExecuter.executeActions(ExecuteActionsTaskExecuter.java:110)
	at org.gradle.api.internal.tasks.execution.ExecuteActionsTaskExecuter.execute(ExecuteActionsTaskExecuter.java:77)
	at org.gradle.api.internal.tasks.execution.OutputDirectoryCreatingTaskExecuter.execute(OutputDirectoryCreatingTaskExecuter.java:51)
	at org.gradle.api.internal.tasks.execution.SkipCachedTaskExecuter.execute(SkipCachedTaskExecuter.java:105)
	at org.gradle.api.internal.tasks.execution.SkipUpToDateTaskExecuter.execute(SkipUpToDateTaskExecuter.java:59)
	at org.gradle.api.internal.tasks.execution.ResolveTaskOutputCachingStateExecuter.execute(ResolveTaskOutputCachingStateExecuter.java:54)
	at org.gradle.api.internal.tasks.execution.ResolveBuildCacheKeyExecuter.execute(ResolveBuildCacheKeyExecuter.java:66)
	at org.gradle.api.internal.tasks.execution.ValidatingTaskExecuter.execute(ValidatingTaskExecuter.java:59)
	at org.gradle.api.internal.tasks.execution.SkipEmptySourceFilesTaskExecuter.execute(SkipEmptySourceFilesTaskExecuter.java:101)
	at org.gradle.api.internal.tasks.execution.FinalizeInputFilePropertiesTaskExecuter.execute(FinalizeInputFilePropertiesTaskExecuter.java:44)
	at org.gradle.api.internal.tasks.execution.CleanupStaleOutputsExecuter.execute(CleanupStaleOutputsExecuter.java:91)
	at org.gradle.api.internal.tasks.execution.ResolveTaskArtifactStateTaskExecuter.execute(ResolveTaskArtifactStateTaskExecuter.java:62)
	at org.gradle.api.internal.tasks.execution.SkipTaskWithNoActionsExecuter.execute(SkipTaskWithNoActionsExecuter.java:59)
	at org.gradle.api.internal.tasks.execution.SkipOnlyIfTaskExecuter.execute(SkipOnlyIfTaskExecuter.java:54)
	at org.gradle.api.internal.tasks.execution.ExecuteAtMostOnceTaskExecuter.execute(ExecuteAtMostOnceTaskExecuter.java:43)
	at org.gradle.api.internal.tasks.execution.CatchExceptionTaskExecuter.execute(CatchExceptionTaskExecuter.java:34)
	at org.gradle.api.internal.tasks.execution.EventFiringTaskExecuter$1.run(EventFiringTaskExecuter.java:51)
	at org.gradle.internal.operations.DefaultBuildOperationExecutor$RunnableBuildOperationWorker.execute(DefaultBuildOperationExecutor.java:317)
	at org.gradle.internal.operations.DefaultBuildOperationExecutor$RunnableBuildOperationWorker.execute(DefaultBuildOperationExecutor.java:309)
	at org.gradle.internal.operations.DefaultBuildOperationExecutor.execute(DefaultBuildOperationExecutor.java:185)
	at org.gradle.internal.operations.DefaultBuildOperationExecutor.run(DefaultBuildOperationExecutor.java:97)
	at org.gradle.internal.operations.DelegatingBuildOperationExecutor.run(DelegatingBuildOperationExecutor.java:31)
	at org.gradle.api.internal.tasks.execution.EventFiringTaskExecuter.execute(EventFiringTaskExecuter.java:46)
	at org.gradle.execution.taskgraph.DefaultTaskExecutionGraph$ExecuteTaskAction.execute(DefaultTaskExecutionGraph.java:262)
	at org.gradle.execution.taskgraph.DefaultTaskExecutionGraph$ExecuteTaskAction.execute(DefaultTaskExecutionGraph.java:246)
	at org.gradle.execution.taskgraph.DefaultTaskPlanExecutor$TaskExecutorWorker$1.execute(DefaultTaskPlanExecutor.java:136)
	at org.gradle.execution.taskgraph.DefaultTaskPlanExecutor$TaskExecutorWorker$1.execute(DefaultTaskPlanExecutor.java:130)
	at org.gradle.execution.taskgraph.DefaultTaskPlanExecutor$TaskExecutorWorker.execute(DefaultTaskPlanExecutor.java:201)
	at org.gradle.execution.taskgraph.DefaultTaskPlanExecutor$TaskExecutorWorker.executeWithTask(DefaultTaskPlanExecutor.java:192)
	at org.gradle.execution.taskgraph.DefaultTaskPlanExecutor$TaskExecutorWorker.run(DefaultTaskPlanExecutor.java:130)
	at org.gradle.internal.concurrent.ExecutorPolicy$CatchAndRecordFailures.onExecute(ExecutorPolicy.java:63)
	at org.gradle.internal.concurrent.ManagedExecutorImpl$1.run(ManagedExecutorImpl.java:46)
	at org.gradle.internal.concurrent.ThreadFactoryImpl$ManagedThreadRunnable.run(ThreadFactoryImpl.java:55)
Caused by: org.gradle.api.internal.tasks.compile.CompilationFailedException: Compilation failed with exit code 1; see the compiler error output for details.
	at net.ltgt.gradle.errorprone.ErrorProneCompiler.execute(ErrorProneCompiler.java:74)
	at net.ltgt.gradle.errorprone.ErrorProneCompiler.execute(ErrorProneCompiler.java:23)
	at org.gradle.api.internal.tasks.compile.NormalizingJavaCompiler.delegateAndHandleErrors(NormalizingJavaCompiler.java:86)
	at org.gradle.api.internal.tasks.compile.NormalizingJavaCompiler.execute(NormalizingJavaCompiler.java:47)
	at org.gradle.api.internal.tasks.compile.NormalizingJavaCompiler.execute(NormalizingJavaCompiler.java:33)
	at org.gradle.api.internal.tasks.compile.CleaningJavaCompilerSupport.execute(CleaningJavaCompilerSupport.java:40)
	at org.gradle.api.internal.tasks.compile.CleaningJavaCompilerSupport.execute(CleaningJavaCompilerSupport.java:27)
	at org.gradle.api.tasks.compile.JavaCompile.performCompilation(JavaCompile.java:161)
	at org.gradle.api.tasks.compile.JavaCompile.compile(JavaCompile.java:146)
	at org.gradle.api.tasks.compile.JavaCompile.compile(JavaCompile.java:118)
	at org.gradle.internal.reflect.JavaMethod.invoke(JavaMethod.java:73)
	at org.gradle.api.internal.project.taskfactory.IncrementalTaskAction.doExecute(IncrementalTaskAction.java:50)
	at org.gradle.api.internal.project.taskfactory.StandardTaskAction.execute(StandardTaskAction.java:39)
	at org.gradle.api.internal.project.taskfactory.StandardTaskAction.execute(StandardTaskAction.java:26)
	at org.gradle.api.internal.tasks.execution.ExecuteActionsTaskExecuter$1.run(ExecuteActionsTaskExecuter.java:131)
	at org.gradle.internal.operations.DefaultBuildOperationExecutor$RunnableBuildOperationWorker.execute(DefaultBuildOperationExecutor.java:317)
	at org.gradle.internal.operations.DefaultBuildOperationExecutor$RunnableBuildOperationWorker.execute(DefaultBuildOperationExecutor.java:309)
	at org.gradle.internal.operations.DefaultBuildOperationExecutor.execute(DefaultBuildOperationExecutor.java:185)
	at org.gradle.internal.operations.DefaultBuildOperationExecutor.run(DefaultBuildOperationExecutor.java:97)
	at org.gradle.internal.operations.DelegatingBuildOperationExecutor.run(DelegatingBuildOperationExecutor.java:31)
	at org.gradle.api.internal.tasks.execution.ExecuteActionsTaskExecuter.executeAction(ExecuteActionsTaskExecuter.java:120)
	at org.gradle.api.internal.tasks.execution.ExecuteActionsTaskExecuter.executeActions(ExecuteActionsTaskExecuter.java:99)
	... 32 more


* Get more help at https://help.gradle.org

BUILD FAILED in 16s

2018-06-26 18:26:13,836 7e268fbe MainThread beam_integration_benchmark(1/1) ERROR    Error during benchmark beam_integration_benchmark
Traceback (most recent call last):
  File "<https://builds.apache.org/job/beam_PerformanceTests_JDBC/ws/PerfKitBenchmarker/perfkitbenchmarker/pkb.py",> line 667, in RunBenchmark
    DoRunPhase(spec, collector, detailed_timer)
  File "<https://builds.apache.org/job/beam_PerformanceTests_JDBC/ws/PerfKitBenchmarker/perfkitbenchmarker/pkb.py",> line 547, in DoRunPhase
    samples = spec.BenchmarkRun(spec)
  File "<https://builds.apache.org/job/beam_PerformanceTests_JDBC/ws/PerfKitBenchmarker/perfkitbenchmarker/linux_benchmarks/beam_integration_benchmark.py",> line 159, in Run
    job_type=job_type)
  File "<https://builds.apache.org/job/beam_PerformanceTests_JDBC/ws/PerfKitBenchmarker/perfkitbenchmarker/providers/gcp/gcp_dpb_dataflow.py",> line 90, in SubmitJob
    assert retcode == 0, "Integration Test Failed."
AssertionError: Integration Test Failed.
2018-06-26 18:26:13,837 7e268fbe MainThread beam_integration_benchmark(1/1) INFO     Cleaning up benchmark beam_integration_benchmark
2018-06-26 18:26:13,837 7e268fbe MainThread beam_integration_benchmark(1/1) INFO     Running: kubectl --kubeconfig=<https://builds.apache.org/job/beam_PerformanceTests_JDBC/ws/config-beam-performancetests-jdbc-772> delete -f <https://builds.apache.org/job/beam_PerformanceTests_JDBC/ws/src/.test-infra/kubernetes/postgres/postgres-service-for-local-dev.yml> --ignore-not-found
2018-06-26 18:26:14,407 7e268fbe MainThread beam_integration_benchmark(1/1) ERROR    Exception running benchmark
Traceback (most recent call last):
  File "<https://builds.apache.org/job/beam_PerformanceTests_JDBC/ws/PerfKitBenchmarker/perfkitbenchmarker/pkb.py",> line 801, in RunBenchmarkTask
    RunBenchmark(spec, collector)
  File "<https://builds.apache.org/job/beam_PerformanceTests_JDBC/ws/PerfKitBenchmarker/perfkitbenchmarker/pkb.py",> line 667, in RunBenchmark
    DoRunPhase(spec, collector, detailed_timer)
  File "<https://builds.apache.org/job/beam_PerformanceTests_JDBC/ws/PerfKitBenchmarker/perfkitbenchmarker/pkb.py",> line 547, in DoRunPhase
    samples = spec.BenchmarkRun(spec)
  File "<https://builds.apache.org/job/beam_PerformanceTests_JDBC/ws/PerfKitBenchmarker/perfkitbenchmarker/linux_benchmarks/beam_integration_benchmark.py",> line 159, in Run
    job_type=job_type)
  File "<https://builds.apache.org/job/beam_PerformanceTests_JDBC/ws/PerfKitBenchmarker/perfkitbenchmarker/providers/gcp/gcp_dpb_dataflow.py",> line 90, in SubmitJob
    assert retcode == 0, "Integration Test Failed."
AssertionError: Integration Test Failed.
2018-06-26 18:26:14,407 7e268fbe MainThread beam_integration_benchmark(1/1) ERROR    Benchmark 1/1 beam_integration_benchmark (UID: beam_integration_benchmark0) failed. Execution will continue.
2018-06-26 18:26:14,441 7e268fbe MainThread INFO     Benchmark run statuses:
---------------------------------------------------------------------------------
Name                        UID                          Status  Failed Substatus
---------------------------------------------------------------------------------
beam_integration_benchmark  beam_integration_benchmark0  FAILED                  
---------------------------------------------------------------------------------
Success rate: 0.00% (0/1)
2018-06-26 18:26:14,441 7e268fbe MainThread INFO     Complete logs can be found at: <https://builds.apache.org/job/beam_PerformanceTests_JDBC/ws/runs/7e268fbe/pkb.log>
2018-06-26 18:26:14,442 7e268fbe MainThread INFO     Completion statuses can be found at: <https://builds.apache.org/job/beam_PerformanceTests_JDBC/ws/runs/7e268fbe/completion_statuses.json>
Build step 'Execute shell' marked build as failure

Build failed in Jenkins: beam_PerformanceTests_JDBC #771

Posted by Apache Jenkins Server <je...@builds.apache.org>.
See <https://builds.apache.org/job/beam_PerformanceTests_JDBC/771/display/redirect>

------------------------------------------
[...truncated 2.10 KB...]
[beam_PerformanceTests_JDBC] $ /bin/bash -xe /tmp/jenkins5589147977137791381.sh
+ cp /home/jenkins/.kube/config <https://builds.apache.org/job/beam_PerformanceTests_JDBC/ws/config-beam-performancetests-jdbc-771>
[beam_PerformanceTests_JDBC] $ /bin/bash -xe /tmp/jenkins2803595865906801405.sh
+ kubectl --kubeconfig=<https://builds.apache.org/job/beam_PerformanceTests_JDBC/ws/config-beam-performancetests-jdbc-771> create namespace beam-performancetests-jdbc-771
namespace "beam-performancetests-jdbc-771" created
[beam_PerformanceTests_JDBC] $ /bin/bash -xe /tmp/jenkins2540249936405958421.sh
++ kubectl config current-context
+ kubectl --kubeconfig=<https://builds.apache.org/job/beam_PerformanceTests_JDBC/ws/config-beam-performancetests-jdbc-771> config set-context gke_apache-beam-testing_us-central1-a_io-datastores --namespace=beam-performancetests-jdbc-771
Context "gke_apache-beam-testing_us-central1-a_io-datastores" modified.
[beam_PerformanceTests_JDBC] $ /bin/bash -xe /tmp/jenkins7678922410555383324.sh
+ rm -rf PerfKitBenchmarker
[beam_PerformanceTests_JDBC] $ /bin/bash -xe /tmp/jenkins6082380627724274361.sh
+ rm -rf .env
[beam_PerformanceTests_JDBC] $ /bin/bash -xe /tmp/jenkins2292159618135371956.sh
+ virtualenv .env --system-site-packages
New python executable in <https://builds.apache.org/job/beam_PerformanceTests_JDBC/ws/.env/bin/python2>
Also creating executable in <https://builds.apache.org/job/beam_PerformanceTests_JDBC/ws/.env/bin/python>
Installing setuptools, pkg_resources, pip, wheel...done.
Running virtualenv with interpreter /usr/bin/python2
[beam_PerformanceTests_JDBC] $ /bin/bash -xe /tmp/jenkins5202243475506091673.sh
+ .env/bin/pip install --upgrade setuptools pip
Requirement already up-to-date: setuptools in ./.env/lib/python2.7/site-packages (39.2.0)
Requirement already up-to-date: pip in ./.env/lib/python2.7/site-packages (10.0.1)
[beam_PerformanceTests_JDBC] $ /bin/bash -xe /tmp/jenkins8844563578861263051.sh
+ git clone https://github.com/GoogleCloudPlatform/PerfKitBenchmarker.git
Cloning into 'PerfKitBenchmarker'...
[beam_PerformanceTests_JDBC] $ /bin/bash -xe /tmp/jenkins3375520508209833813.sh
+ .env/bin/pip install -r PerfKitBenchmarker/requirements.txt
Collecting absl-py (from -r PerfKitBenchmarker/requirements.txt (line 14))
Requirement already satisfied: jinja2>=2.7 in /usr/local/lib/python2.7/dist-packages (from -r PerfKitBenchmarker/requirements.txt (line 15)) (2.10)
Requirement already satisfied: setuptools in ./.env/lib/python2.7/site-packages (from -r PerfKitBenchmarker/requirements.txt (line 16)) (39.2.0)
Collecting colorlog[windows]==2.6.0 (from -r PerfKitBenchmarker/requirements.txt (line 17))
  Using cached https://files.pythonhosted.org/packages/59/1a/46a1bf2044ad8b30b52fed0f389338c85747e093fe7f51a567f4cb525892/colorlog-2.6.0-py2.py3-none-any.whl
Collecting blinker>=1.3 (from -r PerfKitBenchmarker/requirements.txt (line 18))
Collecting futures>=3.0.3 (from -r PerfKitBenchmarker/requirements.txt (line 19))
  Using cached https://files.pythonhosted.org/packages/2d/99/b2c4e9d5a30f6471e410a146232b4118e697fa3ffc06d6a65efde84debd0/futures-3.2.0-py2-none-any.whl
Requirement already satisfied: PyYAML==3.12 in /usr/local/lib/python2.7/dist-packages (from -r PerfKitBenchmarker/requirements.txt (line 20)) (3.12)
Collecting pint>=0.7 (from -r PerfKitBenchmarker/requirements.txt (line 21))
Collecting numpy==1.13.3 (from -r PerfKitBenchmarker/requirements.txt (line 22))
  Using cached https://files.pythonhosted.org/packages/eb/be/737f3df5806192ac4096e549e48c8c76cfaa2fb880a1c62a7bb085adaa9b/numpy-1.13.3-cp27-cp27mu-manylinux1_x86_64.whl
Requirement already satisfied: functools32 in /usr/local/lib/python2.7/dist-packages (from -r PerfKitBenchmarker/requirements.txt (line 23)) (3.2.3.post2)
Collecting contextlib2>=0.5.1 (from -r PerfKitBenchmarker/requirements.txt (line 24))
  Using cached https://files.pythonhosted.org/packages/a2/71/8273a7eeed0aff6a854237ab5453bc9aa67deb49df4832801c21f0ff3782/contextlib2-0.5.5-py2.py3-none-any.whl
Collecting pywinrm (from -r PerfKitBenchmarker/requirements.txt (line 25))
  Using cached https://files.pythonhosted.org/packages/0d/12/13a3117bbd2230043aa32dcfa2198c33269665eaa1a8fa26174ce49b338f/pywinrm-0.3.0-py2.py3-none-any.whl
Collecting timeout-decorator (from -r PerfKitBenchmarker/requirements.txt (line 26))
Requirement already satisfied: six in /usr/local/lib/python2.7/dist-packages (from absl-py->-r PerfKitBenchmarker/requirements.txt (line 14)) (1.11.0)
Requirement already satisfied: MarkupSafe>=0.23 in /usr/local/lib/python2.7/dist-packages (from jinja2>=2.7->-r PerfKitBenchmarker/requirements.txt (line 15)) (1.0)
Collecting colorama; extra == "windows" (from colorlog[windows]==2.6.0->-r PerfKitBenchmarker/requirements.txt (line 17))
  Using cached https://files.pythonhosted.org/packages/db/c8/7dcf9dbcb22429512708fe3a547f8b6101c0d02137acbd892505aee57adf/colorama-0.3.9-py2.py3-none-any.whl
Collecting requests-ntlm>=0.3.0 (from pywinrm->-r PerfKitBenchmarker/requirements.txt (line 25))
  Using cached https://files.pythonhosted.org/packages/03/4b/8b9a1afde8072c4d5710d9fa91433d504325821b038e00237dc8d6d833dc/requests_ntlm-1.1.0-py2.py3-none-any.whl
Requirement already satisfied: requests>=2.9.1 in /usr/local/lib/python2.7/dist-packages (from pywinrm->-r PerfKitBenchmarker/requirements.txt (line 25)) (2.18.4)
Collecting xmltodict (from pywinrm->-r PerfKitBenchmarker/requirements.txt (line 25))
  Using cached https://files.pythonhosted.org/packages/42/a9/7e99652c6bc619d19d58cdd8c47560730eb5825d43a7e25db2e1d776ceb7/xmltodict-0.11.0-py2.py3-none-any.whl
Requirement already satisfied: cryptography>=1.3 in /usr/local/lib/python2.7/dist-packages (from requests-ntlm>=0.3.0->pywinrm->-r PerfKitBenchmarker/requirements.txt (line 25)) (2.2.2)
Collecting ntlm-auth>=1.0.2 (from requests-ntlm>=0.3.0->pywinrm->-r PerfKitBenchmarker/requirements.txt (line 25))
  Using cached https://files.pythonhosted.org/packages/8e/5b/4047779fb456b0de503c4acb7b166becf2567efb772abb53998440791d3c/ntlm_auth-1.2.0-py2.py3-none-any.whl
Requirement already satisfied: certifi>=2017.4.17 in /usr/local/lib/python2.7/dist-packages (from requests>=2.9.1->pywinrm->-r PerfKitBenchmarker/requirements.txt (line 25)) (2018.4.16)
Requirement already satisfied: chardet<3.1.0,>=3.0.2 in /usr/local/lib/python2.7/dist-packages (from requests>=2.9.1->pywinrm->-r PerfKitBenchmarker/requirements.txt (line 25)) (3.0.4)
Requirement already satisfied: idna<2.7,>=2.5 in /usr/local/lib/python2.7/dist-packages (from requests>=2.9.1->pywinrm->-r PerfKitBenchmarker/requirements.txt (line 25)) (2.6)
Requirement already satisfied: urllib3<1.23,>=1.21.1 in /usr/local/lib/python2.7/dist-packages (from requests>=2.9.1->pywinrm->-r PerfKitBenchmarker/requirements.txt (line 25)) (1.22)
Requirement already satisfied: cffi>=1.7; platform_python_implementation != "PyPy" in /usr/local/lib/python2.7/dist-packages (from cryptography>=1.3->requests-ntlm>=0.3.0->pywinrm->-r PerfKitBenchmarker/requirements.txt (line 25)) (1.11.5)
Requirement already satisfied: enum34; python_version < "3" in /usr/local/lib/python2.7/dist-packages (from cryptography>=1.3->requests-ntlm>=0.3.0->pywinrm->-r PerfKitBenchmarker/requirements.txt (line 25)) (1.1.6)
Requirement already satisfied: asn1crypto>=0.21.0 in /usr/local/lib/python2.7/dist-packages (from cryptography>=1.3->requests-ntlm>=0.3.0->pywinrm->-r PerfKitBenchmarker/requirements.txt (line 25)) (0.24.0)
Requirement already satisfied: ipaddress; python_version < "3" in /usr/local/lib/python2.7/dist-packages (from cryptography>=1.3->requests-ntlm>=0.3.0->pywinrm->-r PerfKitBenchmarker/requirements.txt (line 25)) (1.0.22)
Requirement already satisfied: pycparser in /usr/local/lib/python2.7/dist-packages (from cffi>=1.7; platform_python_implementation != "PyPy"->cryptography>=1.3->requests-ntlm>=0.3.0->pywinrm->-r PerfKitBenchmarker/requirements.txt (line 25)) (2.18)
Installing collected packages: absl-py, colorama, colorlog, blinker, futures, pint, numpy, contextlib2, ntlm-auth, requests-ntlm, xmltodict, pywinrm, timeout-decorator
Successfully installed absl-py-0.2.2 blinker-1.4 colorama-0.3.9 colorlog-2.6.0 contextlib2-0.5.5 futures-3.2.0 ntlm-auth-1.2.0 numpy-1.13.3 pint-0.8.1 pywinrm-0.3.0 requests-ntlm-1.1.0 timeout-decorator-0.4.0 xmltodict-0.11.0
[beam_PerformanceTests_JDBC] $ /bin/bash -xe /tmp/jenkins4844548185384065651.sh
+ .env/bin/pip install -e 'src/sdks/python/[gcp,test]'
Obtaining file://<https://builds.apache.org/job/beam_PerformanceTests_JDBC/ws/src/sdks/python>
Collecting avro<2.0.0,>=1.8.1 (from apache-beam==2.6.0.dev0)
Requirement already satisfied: crcmod<2.0,>=1.7 in /usr/lib/python2.7/dist-packages (from apache-beam==2.6.0.dev0) (1.7)
Collecting dill==0.2.6 (from apache-beam==2.6.0.dev0)
Collecting grpcio<2,>=1.8 (from apache-beam==2.6.0.dev0)
  Using cached https://files.pythonhosted.org/packages/1d/0d/146582f71161a0074dda2378617ae5f7e2c3d6cf62d4588eb586c1d6b675/grpcio-1.12.1-cp27-cp27mu-manylinux1_x86_64.whl
Collecting hdfs<3.0.0,>=2.1.0 (from apache-beam==2.6.0.dev0)
Collecting httplib2<=0.11.3,>=0.8 (from apache-beam==2.6.0.dev0)
Collecting mock<3.0.0,>=1.0.1 (from apache-beam==2.6.0.dev0)
  Using cached https://files.pythonhosted.org/packages/e6/35/f187bdf23be87092bd0f1200d43d23076cee4d0dec109f195173fd3ebc79/mock-2.0.0-py2.py3-none-any.whl
Collecting oauth2client<5,>=2.0.1 (from apache-beam==2.6.0.dev0)
  Using cached https://files.pythonhosted.org/packages/82/d8/3eab58811282ac7271a081ba5c0d4b875ce786ca68ce43e2a62ade32e9a8/oauth2client-4.1.2-py2.py3-none-any.whl
Collecting protobuf<4,>=3.5.0.post1 (from apache-beam==2.6.0.dev0)
  Using cached https://files.pythonhosted.org/packages/27/e7/bf96130ebe633b08a3913da4bb25e50dac5779f1f68e51c99485423f7443/protobuf-3.6.0-cp27-cp27mu-manylinux1_x86_64.whl
Collecting pytz>=2018.3 (from apache-beam==2.6.0.dev0)
  Using cached https://files.pythonhosted.org/packages/dc/83/15f7833b70d3e067ca91467ca245bae0f6fe56ddc7451aa0dc5606b120f2/pytz-2018.4-py2.py3-none-any.whl
Requirement already satisfied: pyyaml<4.0.0,>=3.12 in /usr/local/lib/python2.7/dist-packages (from apache-beam==2.6.0.dev0) (3.12)
Collecting pyvcf<0.7.0,>=0.6.8 (from apache-beam==2.6.0.dev0)
Requirement already satisfied: six<1.12,>=1.9 in /usr/local/lib/python2.7/dist-packages (from apache-beam==2.6.0.dev0) (1.11.0)
Collecting typing<3.7.0,>=3.6.0 (from apache-beam==2.6.0.dev0)
  Using cached https://files.pythonhosted.org/packages/0d/4d/4e5985d075d241d686a1663fa1f88b61d544658d08c1375c7c6aac32afc3/typing-3.6.4-py2-none-any.whl
Requirement already satisfied: futures<4.0.0,>=3.1.1 in ./.env/lib/python2.7/site-packages (from apache-beam==2.6.0.dev0) (3.2.0)
Collecting future<1.0.0,>=0.16.0 (from apache-beam==2.6.0.dev0)
Collecting google-apitools<=0.5.20,>=0.5.18 (from apache-beam==2.6.0.dev0)
  Using cached https://files.pythonhosted.org/packages/1d/0c/64f84f91643f775fdb64c6c10f4a4f0d827f8b0d98a2ba2b4bb9dc2f8646/google_apitools-0.5.20-py2-none-any.whl
Collecting proto-google-cloud-datastore-v1<=0.90.4,>=0.90.0 (from apache-beam==2.6.0.dev0)
Collecting googledatastore==7.0.1 (from apache-beam==2.6.0.dev0)
Collecting google-cloud-pubsub==0.26.0 (from apache-beam==2.6.0.dev0)
  Using cached https://files.pythonhosted.org/packages/37/92/c74a643126d58505daec9addf872dfaffea3305981b90cc435f4b9213cdd/google_cloud_pubsub-0.26.0-py2.py3-none-any.whl
Collecting proto-google-cloud-pubsub-v1==0.15.4 (from apache-beam==2.6.0.dev0)
Collecting google-cloud-bigquery==0.25.0 (from apache-beam==2.6.0.dev0)
  Using cached https://files.pythonhosted.org/packages/76/67/6165c516ff6ceaa62eb61f11d8451e1b0acc4d3775e181630aba9652babb/google_cloud_bigquery-0.25.0-py2.py3-none-any.whl
Collecting nose>=1.3.7 (from apache-beam==2.6.0.dev0)
  Using cached https://files.pythonhosted.org/packages/99/4f/13fb671119e65c4dce97c60e67d3fd9e6f7f809f2b307e2611f4701205cb/nose-1.3.7-py2-none-any.whl
Collecting pyhamcrest<2.0,>=1.9 (from apache-beam==2.6.0.dev0)
  Using cached https://files.pythonhosted.org/packages/9a/d5/d37fd731b7d0e91afcc84577edeccf4638b4f9b82f5ffe2f8b62e2ddc609/PyHamcrest-1.9.0-py2.py3-none-any.whl
Requirement already satisfied: enum34>=1.0.4 in /usr/local/lib/python2.7/dist-packages (from grpcio<2,>=1.8->apache-beam==2.6.0.dev0) (1.1.6)
Requirement already satisfied: docopt in /usr/local/lib/python2.7/dist-packages (from hdfs<3.0.0,>=2.1.0->apache-beam==2.6.0.dev0) (0.6.2)
Requirement already satisfied: requests>=2.7.0 in /usr/local/lib/python2.7/dist-packages (from hdfs<3.0.0,>=2.1.0->apache-beam==2.6.0.dev0) (2.18.4)
Requirement already satisfied: pbr>=0.11 in /usr/lib/python2.7/dist-packages (from mock<3.0.0,>=1.0.1->apache-beam==2.6.0.dev0) (1.8.0)
Collecting funcsigs>=1; python_version < "3.3" (from mock<3.0.0,>=1.0.1->apache-beam==2.6.0.dev0)
  Using cached https://files.pythonhosted.org/packages/69/cb/f5be453359271714c01b9bd06126eaf2e368f1fddfff30818754b5ac2328/funcsigs-1.0.2-py2.py3-none-any.whl
Requirement already satisfied: pyasn1>=0.1.7 in /usr/local/lib/python2.7/dist-packages (from oauth2client<5,>=2.0.1->apache-beam==2.6.0.dev0) (0.4.2)
Collecting pyasn1-modules>=0.0.5 (from oauth2client<5,>=2.0.1->apache-beam==2.6.0.dev0)
  Using cached https://files.pythonhosted.org/packages/e9/51/bcd96bf6231d4b2cc5e023c511bee86637ba375c44a6f9d1b4b7ad1ce4b9/pyasn1_modules-0.2.1-py2.py3-none-any.whl
Collecting rsa>=3.1.4 (from oauth2client<5,>=2.0.1->apache-beam==2.6.0.dev0)
  Using cached https://files.pythonhosted.org/packages/e1/ae/baedc9cb175552e95f3395c43055a6a5e125ae4d48a1d7a924baca83e92e/rsa-3.4.2-py2.py3-none-any.whl
Requirement already satisfied: setuptools in ./.env/lib/python2.7/site-packages (from protobuf<4,>=3.5.0.post1->apache-beam==2.6.0.dev0) (39.2.0)
Collecting fasteners>=0.14 (from google-apitools<=0.5.20,>=0.5.18->apache-beam==2.6.0.dev0)
  Using cached https://files.pythonhosted.org/packages/14/3a/096c7ad18e102d4f219f5dd15951f9728ca5092a3385d2e8f79a7c1e1017/fasteners-0.14.1-py2.py3-none-any.whl
Collecting googleapis-common-protos<2.0dev,>=1.5.2 (from proto-google-cloud-datastore-v1<=0.90.4,>=0.90.0->apache-beam==2.6.0.dev0)
Collecting gapic-google-cloud-pubsub-v1<0.16dev,>=0.15.0 (from google-cloud-pubsub==0.26.0->apache-beam==2.6.0.dev0)
Collecting google-cloud-core<0.26dev,>=0.25.0 (from google-cloud-pubsub==0.26.0->apache-beam==2.6.0.dev0)
  Using cached https://files.pythonhosted.org/packages/ef/dd/00e90bd1f6788f06ca5ea83a0ec8dd76350b38303bb8f09d2bf692eb1294/google_cloud_core-0.25.0-py2.py3-none-any.whl
Requirement already satisfied: certifi>=2017.4.17 in /usr/local/lib/python2.7/dist-packages (from requests>=2.7.0->hdfs<3.0.0,>=2.1.0->apache-beam==2.6.0.dev0) (2018.4.16)
Requirement already satisfied: chardet<3.1.0,>=3.0.2 in /usr/local/lib/python2.7/dist-packages (from requests>=2.7.0->hdfs<3.0.0,>=2.1.0->apache-beam==2.6.0.dev0) (3.0.4)
Requirement already satisfied: idna<2.7,>=2.5 in /usr/local/lib/python2.7/dist-packages (from requests>=2.7.0->hdfs<3.0.0,>=2.1.0->apache-beam==2.6.0.dev0) (2.6)
Requirement already satisfied: urllib3<1.23,>=1.21.1 in /usr/local/lib/python2.7/dist-packages (from requests>=2.7.0->hdfs<3.0.0,>=2.1.0->apache-beam==2.6.0.dev0) (1.22)
Collecting monotonic>=0.1 (from fasteners>=0.14->google-apitools<=0.5.20,>=0.5.18->apache-beam==2.6.0.dev0)
  Using cached https://files.pythonhosted.org/packages/ac/aa/063eca6a416f397bd99552c534c6d11d57f58f2e94c14780f3bbf818c4cf/monotonic-1.5-py2.py3-none-any.whl
Collecting google-gax<0.16dev,>=0.15.7 (from gapic-google-cloud-pubsub-v1<0.16dev,>=0.15.0->google-cloud-pubsub==0.26.0->apache-beam==2.6.0.dev0)
  Using cached https://files.pythonhosted.org/packages/4f/b4/ff312fa42f91535c67567c1d08e972db0e7c548e9a63c6f3bcc5213b32fc/google_gax-0.15.16-py2.py3-none-any.whl
Collecting grpc-google-iam-v1<0.12dev,>=0.11.1 (from gapic-google-cloud-pubsub-v1<0.16dev,>=0.15.0->google-cloud-pubsub==0.26.0->apache-beam==2.6.0.dev0)
Collecting google-auth-httplib2 (from google-cloud-core<0.26dev,>=0.25.0->google-cloud-pubsub==0.26.0->apache-beam==2.6.0.dev0)
  Using cached https://files.pythonhosted.org/packages/33/49/c814d6d438b823441552198f096fcd0377fd6c88714dbed34f1d3c8c4389/google_auth_httplib2-0.0.3-py2.py3-none-any.whl
Collecting google-auth<2.0.0dev,>=0.4.0 (from google-cloud-core<0.26dev,>=0.25.0->google-cloud-pubsub==0.26.0->apache-beam==2.6.0.dev0)
  Using cached https://files.pythonhosted.org/packages/53/06/6e6d5bfa4d23ee40efd772d6b681a7afecd859a9176e564b8c329382370f/google_auth-1.5.0-py2.py3-none-any.whl
Collecting ply==3.8 (from google-gax<0.16dev,>=0.15.7->gapic-google-cloud-pubsub-v1<0.16dev,>=0.15.0->google-cloud-pubsub==0.26.0->apache-beam==2.6.0.dev0)
Collecting cachetools>=2.0.0 (from google-auth<2.0.0dev,>=0.4.0->google-cloud-core<0.26dev,>=0.25.0->google-cloud-pubsub==0.26.0->apache-beam==2.6.0.dev0)
  Using cached https://files.pythonhosted.org/packages/0a/58/cbee863250b31d80f47401d04f34038db6766f95dea1cc909ea099c7e571/cachetools-2.1.0-py2.py3-none-any.whl
gapic-google-cloud-pubsub-v1 0.15.4 has requirement oauth2client<4.0dev,>=2.0.0, but you'll have oauth2client 4.1.2 which is incompatible.
proto-google-cloud-datastore-v1 0.90.4 has requirement oauth2client<4.0dev,>=2.0.0, but you'll have oauth2client 4.1.2 which is incompatible.
proto-google-cloud-pubsub-v1 0.15.4 has requirement oauth2client<4.0dev,>=2.0.0, but you'll have oauth2client 4.1.2 which is incompatible.
googledatastore 7.0.1 has requirement httplib2<0.10,>=0.9.1, but you'll have httplib2 0.11.3 which is incompatible.
googledatastore 7.0.1 has requirement oauth2client<4.0.0,>=2.0.1, but you'll have oauth2client 4.1.2 which is incompatible.
Installing collected packages: avro, dill, grpcio, hdfs, httplib2, funcsigs, mock, pyasn1-modules, rsa, oauth2client, protobuf, pytz, pyvcf, typing, future, monotonic, fasteners, google-apitools, googleapis-common-protos, proto-google-cloud-datastore-v1, googledatastore, proto-google-cloud-pubsub-v1, ply, cachetools, google-auth, google-gax, grpc-google-iam-v1, gapic-google-cloud-pubsub-v1, google-auth-httplib2, google-cloud-core, google-cloud-pubsub, google-cloud-bigquery, nose, pyhamcrest, apache-beam
  Running setup.py develop for apache-beam
Successfully installed apache-beam avro-1.8.2 cachetools-2.1.0 dill-0.2.6 fasteners-0.14.1 funcsigs-1.0.2 future-0.16.0 gapic-google-cloud-pubsub-v1-0.15.4 google-apitools-0.5.20 google-auth-1.5.0 google-auth-httplib2-0.0.3 google-cloud-bigquery-0.25.0 google-cloud-core-0.25.0 google-cloud-pubsub-0.26.0 google-gax-0.15.16 googleapis-common-protos-1.5.3 googledatastore-7.0.1 grpc-google-iam-v1-0.11.4 grpcio-1.12.1 hdfs-2.1.0 httplib2-0.11.3 mock-2.0.0 monotonic-1.5 nose-1.3.7 oauth2client-4.1.2 ply-3.8 proto-google-cloud-datastore-v1-0.90.4 proto-google-cloud-pubsub-v1-0.15.4 protobuf-3.6.0 pyasn1-modules-0.2.1 pyhamcrest-1.9.0 pytz-2018.4 pyvcf-0.6.8 rsa-3.4.2 typing-3.6.4
[beam_PerformanceTests_JDBC] $ /bin/bash -xe /tmp/jenkins6116771582164524787.sh
+ .env/bin/python PerfKitBenchmarker/pkb.py --project=apache-beam-testing --dpb_log_level=INFO --maven_binary=/home/jenkins/tools/maven/latest/bin/mvn --bigquery_table=beam_performance.jdbcioit_pkb_results --k8s_get_retry_count=36 --k8s_get_wait_interval=10 --temp_dir=<https://builds.apache.org/job/beam_PerformanceTests_JDBC/ws/> --beam_location=<https://builds.apache.org/job/beam_PerformanceTests_JDBC/ws/src> --official=true --kubeconfig=<https://builds.apache.org/job/beam_PerformanceTests_JDBC/ws/config-beam-performancetests-jdbc-771> --beam_it_timeout=1800 --benchmarks=beam_integration_benchmark --beam_it_profile=io-it --beam_prebuilt=false --beam_sdk=java --beam_it_module=sdks/java/io/jdbc --beam_it_class=org.apache.beam.sdk.io.jdbc.JdbcIOIT '--beam_it_options=[--tempRoot=gs://temp-storage-for-perf-tests,--project=apache-beam-testing,--postgresPort=5432,--numberOfRecords=5000000]' --beam_kubernetes_scripts=<https://builds.apache.org/job/beam_PerformanceTests_JDBC/ws/src/.test-infra/kubernetes/postgres/postgres-service-for-local-dev.yml> --beam_options_config_file=<https://builds.apache.org/job/beam_PerformanceTests_JDBC/ws/src/.test-infra/kubernetes/postgres/pkb-config-local.yml>
2018-06-26 13:26:22,289 fdd538e9 MainThread INFO     Verbose logging to: <https://builds.apache.org/job/beam_PerformanceTests_JDBC/ws/runs/fdd538e9/pkb.log>
2018-06-26 13:26:22,290 fdd538e9 MainThread INFO     PerfKitBenchmarker version: v1.12.0-691-g79e6328
2018-06-26 13:26:22,291 fdd538e9 MainThread INFO     Flag values:
--beam_it_class=org.apache.beam.sdk.io.jdbc.JdbcIOIT
--beam_it_timeout=1800
--beam_it_module=sdks/java/io/jdbc
--beam_sdk=java
--k8s_get_wait_interval=10
--temp_dir=<https://builds.apache.org/job/beam_PerformanceTests_JDBC/ws/>
--maven_binary=/home/jenkins/tools/maven/latest/bin/mvn
--beam_it_options=[--tempRoot=gs://temp-storage-for-perf-tests,--project=apache-beam-testing,--postgresPort=5432,--numberOfRecords=5000000]
--nobeam_prebuilt
--kubeconfig=<https://builds.apache.org/job/beam_PerformanceTests_JDBC/ws/config-beam-performancetests-jdbc-771>
--project=apache-beam-testing
--beam_kubernetes_scripts=<https://builds.apache.org/job/beam_PerformanceTests_JDBC/ws/src/.test-infra/kubernetes/postgres/postgres-service-for-local-dev.yml>
--bigquery_table=beam_performance.jdbcioit_pkb_results
--official
--dpb_log_level=INFO
--beam_options_config_file=<https://builds.apache.org/job/beam_PerformanceTests_JDBC/ws/src/.test-infra/kubernetes/postgres/pkb-config-local.yml>
--beam_location=<https://builds.apache.org/job/beam_PerformanceTests_JDBC/ws/src>
--beam_it_profile=io-it
--k8s_get_retry_count=36
--benchmarks=beam_integration_benchmark
2018-06-26 13:26:22,493 fdd538e9 MainThread WARNING  The key "flags" was not in the default config, but was in user overrides. This may indicate a typo.
2018-06-26 13:26:22,635 fdd538e9 MainThread beam_integration_benchmark(1/1) INFO     Provisioning resources for benchmark beam_integration_benchmark
2018-06-26 13:26:22,638 fdd538e9 MainThread beam_integration_benchmark(1/1) INFO     Preparing benchmark beam_integration_benchmark
2018-06-26 13:26:22,638 fdd538e9 MainThread beam_integration_benchmark(1/1) INFO     Running: <https://builds.apache.org/job/beam_PerformanceTests_JDBC/ws/src/gradlew> clean assemble --stacktrace --info -p sdks/java/io/jdbc -DintegrationTestRunner=dataflow
2018-06-26 13:28:50,757 fdd538e9 MainThread beam_integration_benchmark(1/1) INFO     Running: kubectl --kubeconfig=<https://builds.apache.org/job/beam_PerformanceTests_JDBC/ws/config-beam-performancetests-jdbc-771> create -f <https://builds.apache.org/job/beam_PerformanceTests_JDBC/ws/src/.test-infra/kubernetes/postgres/postgres-service-for-local-dev.yml>
2018-06-26 13:28:51,086 fdd538e9 MainThread beam_integration_benchmark(1/1) INFO     Running benchmark beam_integration_benchmark
2018-06-26 13:28:51,091 fdd538e9 MainThread beam_integration_benchmark(1/1) INFO     Running: kubectl --kubeconfig=<https://builds.apache.org/job/beam_PerformanceTests_JDBC/ws/config-beam-performancetests-jdbc-771> get svc postgres-for-dev -ojsonpath={.status.loadBalancer.ingress[0].ip}
2018-06-26 13:29:01,246 fdd538e9 MainThread beam_integration_benchmark(1/1) INFO     Running: kubectl --kubeconfig=<https://builds.apache.org/job/beam_PerformanceTests_JDBC/ws/config-beam-performancetests-jdbc-771> get svc postgres-for-dev -ojsonpath={.status.loadBalancer.ingress[0].ip}
2018-06-26 13:29:11,374 fdd538e9 MainThread beam_integration_benchmark(1/1) INFO     Running: kubectl --kubeconfig=<https://builds.apache.org/job/beam_PerformanceTests_JDBC/ws/config-beam-performancetests-jdbc-771> get svc postgres-for-dev -ojsonpath={.status.loadBalancer.ingress[0].ip}
2018-06-26 13:29:21,506 fdd538e9 MainThread beam_integration_benchmark(1/1) INFO     Running: kubectl --kubeconfig=<https://builds.apache.org/job/beam_PerformanceTests_JDBC/ws/config-beam-performancetests-jdbc-771> get svc postgres-for-dev -ojsonpath={.status.loadBalancer.ingress[0].ip}
2018-06-26 13:29:31,630 fdd538e9 MainThread beam_integration_benchmark(1/1) INFO     Running: kubectl --kubeconfig=<https://builds.apache.org/job/beam_PerformanceTests_JDBC/ws/config-beam-performancetests-jdbc-771> get svc postgres-for-dev -ojsonpath={.status.loadBalancer.ingress[0].ip}
2018-06-26 13:29:41,764 fdd538e9 MainThread beam_integration_benchmark(1/1) INFO     Running: kubectl --kubeconfig=<https://builds.apache.org/job/beam_PerformanceTests_JDBC/ws/config-beam-performancetests-jdbc-771> get svc postgres-for-dev -ojsonpath={.status.loadBalancer.ingress[0].ip}
2018-06-26 13:29:41,882 fdd538e9 MainThread beam_integration_benchmark(1/1) INFO     Using LoadBalancer IP Address: 35.224.117.183
2018-06-26 13:29:41,889 fdd538e9 MainThread beam_integration_benchmark(1/1) INFO     Running: <https://builds.apache.org/job/beam_PerformanceTests_JDBC/ws/src/gradlew> integrationTest --tests=org.apache.beam.sdk.io.jdbc.JdbcIOIT -p sdks/java/io/jdbc -DintegrationTestRunner=dataflow -DintegrationTestPipelineOptions=["--tempRoot=gs://temp-storage-for-perf-tests","--project=apache-beam-testing","--postgresPort=5432","--numberOfRecords=5000000","--postgresServerName=35.224.117.183","--postgresUsername=postgres","--postgresPassword=uuinkks","--postgresDatabaseName=postgres","--postgresSsl=False","--runner=TestDataflowRunner"] --stacktrace --info
2018-06-26 13:44:33,517 fdd538e9 MainThread beam_integration_benchmark(1/1) INFO     Cleaning up benchmark beam_integration_benchmark
2018-06-26 13:44:33,517 fdd538e9 MainThread beam_integration_benchmark(1/1) INFO     Running: kubectl --kubeconfig=<https://builds.apache.org/job/beam_PerformanceTests_JDBC/ws/config-beam-performancetests-jdbc-771> delete -f <https://builds.apache.org/job/beam_PerformanceTests_JDBC/ws/src/.test-infra/kubernetes/postgres/postgres-service-for-local-dev.yml> --ignore-not-found
2018-06-26 13:44:34,306 fdd538e9 MainThread beam_integration_benchmark(1/1) INFO     Tearing down resources for benchmark beam_integration_benchmark
2018-06-26 13:44:34,335 fdd538e9 MainThread INFO     Publishing 2 samples to <https://builds.apache.org/job/beam_PerformanceTests_JDBC/ws/runs/fdd538e9/perfkit-bq-pubSnchvz.json>
2018-06-26 13:44:34,336 fdd538e9 MainThread INFO     Publishing 2 samples to beam_performance.jdbcioit_pkb_results
2018-06-26 13:44:34,336 fdd538e9 MainThread INFO     Running: bq load --autodetect --source_format=NEWLINE_DELIMITED_JSON beam_performance.jdbcioit_pkb_results <https://builds.apache.org/job/beam_PerformanceTests_JDBC/ws/runs/fdd538e9/perfkit-bq-pubSnchvz.json>
2018-06-26 13:44:38,388 fdd538e9 MainThread INFO     
-------------------------PerfKitBenchmarker Complete Results-------------------------
{'metadata': {'dpb_cluster_id': None,
              'dpb_cluster_shape': 'n1-standard-1',
              'dpb_cluster_size': 2,
              'dpb_dataflow_runner': 'DataflowRunner',
              'dpb_dataflow_sdk': None,
              'dpb_service': 'dataflow',
              'perfkitbenchmarker_version': 'v1.12.0-691-g79e6328',
              'run_number': 0},
 'metric': 'run_time',
 'official': True,
 'owner': 'jenkins',
 'product_name': 'PerfKitBenchmarker',
 'run_uri': 'fdd538e9-087fff03-519e-4871-8dc3-d607fe305706',
 'sample_uri': '437e22ba-f452-451c-911c-bf39d4a1f73f',
 'test': 'beam_integration_benchmark',
 'timestamp': 1530020673.516471,
 'unit': 'seconds',
 'value': 891.633194}
{'metadata': {'perfkitbenchmarker_version': 'v1.12.0-691-g79e6328'},
 'metric': 'End to End Runtime',
 'official': True,
 'owner': 'jenkins',
 'product_name': 'PerfKitBenchmarker',
 'run_uri': 'fdd538e9-087fff03-519e-4871-8dc3-d607fe305706',
 'sample_uri': '83eb1d21-c1ce-4336-9602-2eec13139e2b',
 'test': 'beam_integration_benchmark',
 'timestamp': 1530020674.307061,
 'unit': 'seconds',
 'value': 1091.6717751026154}


-------------------------PerfKitBenchmarker Results Summary-------------------------
BEAM_INTEGRATION_BENCHMARK:
  dpb_cluster_shape="n1-standard-1" dpb_cluster_size="2" dpb_dataflow_runner="DataflowRunner" dpb_service="dataflow" run_number="0"
  run_time                            891.633194 seconds                       
  End to End Runtime                 1091.671775 seconds                       

-------------------------
For all tests: dpb_cluster_id="None" dpb_dataflow_sdk="None" perfkitbenchmarker_version="v1.12.0-691-g79e6328"
2018-06-26 13:44:38,389 fdd538e9 MainThread INFO     Publishing 2 samples to <https://builds.apache.org/job/beam_PerformanceTests_JDBC/ws/runs/fdd538e9/perfkitbenchmarker_results.json>
2018-06-26 13:44:38,390 fdd538e9 MainThread INFO     Benchmark run statuses:
------------------------------------------------------------------------------------
Name                        UID                          Status     Failed Substatus
------------------------------------------------------------------------------------
beam_integration_benchmark  beam_integration_benchmark0  SUCCEEDED                  
------------------------------------------------------------------------------------
Success rate: 100.00% (1/1)
2018-06-26 13:44:38,390 fdd538e9 MainThread INFO     Complete logs can be found at: <https://builds.apache.org/job/beam_PerformanceTests_JDBC/ws/runs/fdd538e9/pkb.log>
2018-06-26 13:44:38,390 fdd538e9 MainThread INFO     Completion statuses can be found at: <https://builds.apache.org/job/beam_PerformanceTests_JDBC/ws/runs/fdd538e9/completion_statuses.json>
[beam_PerformanceTests_JDBC] $ /bin/bash -xe /tmp/jenkins1780162244185610689.sh
+ .env/bin/python src.test-infra/jenkins/verify_performance_tests_results.py
.env/bin/python: can't open file 'src.test-infra/jenkins/verify_performance_tests_results.py': [Errno 2] No such file or directory
Build step 'Execute shell' marked build as failure