You are viewing a plain text version of this content. The canonical link for it is here.
Posted to notifications@commons.apache.org by Apache Jenkins Server <je...@builds.apache.org> on 2025/11/21 14:42:41 UTC
Build failed in Jenkins: Commons » commons-net-windows #222
See <https://ci-builds.apache.org/job/Commons/job/commons-net-windows/222/display/redirect?page=changes>
Changes:
[garydgregory] Use HTTPS to download XML Schema
------------------------------------------
Started by an SCM change
Running as SYSTEM
[EnvInject] - Loading node environment variables.
Building remotely on jenkins-win-azr-5 (Windows-Docker Windows) in workspace <https://ci-builds.apache.org/job/Commons/job/commons-net-windows/ws/>
The recommended git tool is: NONE
No credentials specified
> git rev-parse --resolve-git-dir <https://ci-builds.apache.org/job/Commons/job/commons-net-windows/ws/.git> # timeout=10
Fetching changes from the remote Git repository
> git config remote.origin.url https://gitbox.apache.org/repos/asf/commons-net.git # timeout=10
Fetching upstream changes from https://gitbox.apache.org/repos/asf/commons-net.git
> git --version # timeout=10
> git --version # 'git version 2.14.3.windows.1'
> git fetch --tags --progress -- https://gitbox.apache.org/repos/asf/commons-net.git +refs/heads/*:refs/remotes/origin/* # timeout=10
> git rev-parse "refs/remotes/origin/master^{commit}" # timeout=10
Checking out Revision 1d33900554a0cc5ace2c5e4d862c154f9ecd01a2 (refs/remotes/origin/master)
> git config core.sparsecheckout # timeout=10
> git checkout -f 1d33900554a0cc5ace2c5e4d862c154f9ecd01a2 # timeout=10
Commit message: "Use HTTPS to download XML Schema"
> git rev-list --no-walk 8bb87895dee561d84abd6567bedb739b330fa738 # timeout=10
[EnvInject] - Injecting environment variables from a build step.
ERROR: No tool found matching JDK_1_7_LATEST__HOME
Setting JDK_1_8_LATEST_WINDOWS_HOME=F:\jenkins\tools\java\latest1.8
[EnvInject] - Injecting as environment variables the properties content
JAVA_1_8_HOME=F:\jenkins\tools\java\latest1.8
[EnvInject] - Variables injected successfully.
ERROR: No tool found matching JDK_1_7_LATEST__HOME
Setting JDK_1_8_LATEST_WINDOWS_HOME=F:\jenkins\tools\java\latest1.8
Parsing POMs
ERROR: No tool found matching JDK_1_7_LATEST__HOME
Setting JDK_1_8_LATEST_WINDOWS_HOME=F:\jenkins\tools\java\latest1.8
Established TCP socket on 50834
maven35-agent.jar already up to date
maven35-interceptor.jar already up to date
maven3-interceptor-commons.jar already up to date
[commons-net-windows] $ java -cp f:\jenkins\jenkins-home\712657a4\maven35-agent.jar;f:\jenkins\tools\maven\latest\boot\plexus-classworlds-2.8.0.jar;f:\\jenkins\\tools\\maven\\latest/conf/logging jenkins.maven3.agent.Maven35Main f:\\jenkins\\tools\\maven\\latest F:\jenkins\jenkins-home\slave.jar f:\jenkins\jenkins-home\712657a4\maven35-interceptor.jar f:\jenkins\jenkins-home\712657a4\maven3-interceptor-commons.jar 50834
<===[JENKINS REMOTING CAPACITY]===> channel started
ERROR: No tool found matching JDK_1_7_LATEST__HOME
Setting JDK_1_8_LATEST_WINDOWS_HOME=F:\jenkins\tools\java\latest1.8
Executing Maven: -B -f <https://ci-builds.apache.org/job/Commons/job/commons-net-windows/ws/pom.xml> -V clean install --no-transfer-progress --batch-mode -Pjava-1.8
[1mApache Maven 3.9.9 (8e8579a9e76f7d015ee5ec7bfcdc97d260186937)[m
Maven home: F:\jenkins\tools\maven\latest
Java version: 17.0.7, vendor: Eclipse Adoptium, runtime: F:\jenkins\tools\java\latest17
Default locale: en_US, platform encoding: Cp1252
OS name: "windows server 2019", version: "10.0", arch: "amd64", family: "windows"
[INFO] Scanning for projects...
[HUDSON] Collecting dependencies info
[INFO]
[INFO] ----------------------< commons-net:commons-net >-----------------------
[INFO] Building Apache Commons Net 3.12.1-SNAPSHOT
[INFO] from pom.xml
[INFO] --------------------------------[ jar ]---------------------------------
[INFO] Downloading from central: https://repo.maven.apache.org/maven2/org/codehaus/mojo/exec-maven-plugin/3.6.2/exec-maven-plugin-3.6.2.pom
[INFO] Downloaded from central: https://repo.maven.apache.org/maven2/org/codehaus/mojo/exec-maven-plugin/3.6.2/exec-maven-plugin-3.6.2.pom (17 kB at 32 kB/s)
[INFO] Downloading from central: https://repo.maven.apache.org/maven2/org/codehaus/mojo/exec-maven-plugin/3.6.2/exec-maven-plugin-3.6.2.jar
[INFO] Downloaded from central: https://repo.maven.apache.org/maven2/org/codehaus/mojo/exec-maven-plugin/3.6.2/exec-maven-plugin-3.6.2.jar (95 kB at 613 kB/s)
[INFO]
[INFO] --- clean:3.5.0:clean (default-clean) @ commons-net ---
[INFO] Deleting <https://ci-builds.apache.org/job/Commons/job/commons-net-windows/ws/target>
[INFO]
[INFO] --- enforcer:3.5.0:enforce (enforce-maven-version) @ commons-net ---
[INFO] Rule 0: org.apache.maven.enforcer.rules.version.RequireMavenVersion passed
[INFO]
[INFO] --- enforcer:3.5.0:enforce (enforce-java-version) @ commons-net ---
[INFO] Rule 0: org.apache.maven.enforcer.rules.version.RequireJavaVersion passed
[INFO]
[INFO] --- apache-rat:0.17:check (rat-check) @ commons-net ---
[WARNING] Parameter 'excludes' is deprecated: Deprecated for removal since 0.17: Use <inputExclude> instead.
[WARNING] Basedir is : <https://ci-builds.apache.org/job/Commons/job/commons-net-windows/ws/>
[ERROR] Could not create report parent directory <https://ci-builds.apache.org/job/Commons/job/commons-net-windows/ws/f>:\jenkins\jenkins-home\712657a4\workspace\Commons\commons-net-windows\target\rat.txt
[WARNING] Unable to create directory: <https://ci-builds.apache.org/job/Commons/job/commons-net-windows/ws/f>:\jenkins\jenkins-home\712657a4\workspace\Commons\commons-net-windows\target
[WARNING] Use of deprecated option 'exclude'. Deprecated for removal since 0.17: Use <inputExclude> instead.
[INFO] Excluding patterns: site-content/**, .checkstyle, .fbprefs, .pmd, .asf.yaml, .gitattributes, src/site/resources/download_*.cgi, maven-eclipse.xml, .externalToolBuilders/**, .vscode/**, .project, .classpath, .settings/**, **/*.svg, **/*.xcf
[INFO] Excluding MAVEN collection.
[INFO] Excluding ECLIPSE collection.
[INFO] Excluding IDEA collection.
[INFO] Processing exclude file from STANDARD_SCMS.
[INFO] Excluding STANDARD_SCMS collection.
[INFO] Excluding MISC collection.
[INFO] Excluding HIDDEN_DIR collection.
[WARNING] Attempt to (de-)serialize anonymous class org.jfrog.hudson.maven2.MavenDependenciesRecorder$1; see: https://jenkins.io/redirect/serialization-of-anonymous-classes/
[INFO] ------------------------------------------------------------------------
[INFO] BUILD FAILURE
[INFO] ------------------------------------------------------------------------
[INFO] Total time: 01:12 min
[INFO] Finished at: 2025-11-21T14:42:35Z
[INFO] ------------------------------------------------------------------------
Waiting for Jenkins to finish collecting data
[ERROR] Failed to execute goal org.apache.rat:apache-rat-plugin:0.17:check (rat-check) on project commons-net: java.io.FileNotFoundException: <https://ci-builds.apache.org/job/Commons/job/commons-net-windows/ws/f>:\jenkins\jenkins-home\712657a4\workspace\Commons\commons-net-windows\target\rat.txt (The filename, directory name, or volume label syntax is incorrect) -> [Help 1]
[ERROR]
[ERROR] To see the full stack trace of the errors, re-run Maven with the -e switch.
[ERROR] Re-run Maven using the -X switch to enable full debug logging.
[ERROR]
[ERROR] For more information about the errors and possible solutions, please read the following articles:
[ERROR] [Help 1] http://cwiki.apache.org/confluence/display/MAVEN/MojoExecutionException
[JENKINS] Archiving <https://ci-builds.apache.org/job/Commons/job/commons-net-windows/ws/pom.xml> to commons-net/commons-net/3.12.1-SNAPSHOT/commons-net-3.12.1-SNAPSHOT.pom
Sending e-mails to: notifications@commons.apache.org
channel stopped
ERROR: No tool found matching JDK_1_7_LATEST__HOME
Setting JDK_1_8_LATEST_WINDOWS_HOME=F:\jenkins\tools\java\latest1.8
ERROR: No tool found matching JDK_1_7_LATEST__HOME
Setting JDK_1_8_LATEST_WINDOWS_HOME=F:\jenkins\tools\java\latest1.8
Build failed in Jenkins: Commons » commons-net-windows #225
Posted by Apache Jenkins Server <je...@builds.apache.org>.
See <https://ci-builds.apache.org/job/Commons/job/commons-net-windows/225/display/redirect?page=changes>
Changes:
[github] Bump org.apache.commons:commons-lang3 from 3.19.0 to 3.20.0
[github] Bump org.apache.commons:commons-parent from 92 to 93
[github] Bump org.apache.commons:commons-lang3 from 3.19.0 to 3.20.0 #389
------------------------------------------
Started by an SCM change
Running as SYSTEM
[EnvInject] - Loading node environment variables.
Building remotely on jenkins-win-azr-7 (Windows-Docker Windows) in workspace <https://ci-builds.apache.org/job/Commons/job/commons-net-windows/ws/>
The recommended git tool is: NONE
No credentials specified
> git rev-parse --resolve-git-dir <https://ci-builds.apache.org/job/Commons/job/commons-net-windows/ws/.git> # timeout=10
Fetching changes from the remote Git repository
> git config remote.origin.url https://gitbox.apache.org/repos/asf/commons-net.git # timeout=10
Fetching upstream changes from https://gitbox.apache.org/repos/asf/commons-net.git
> git --version # timeout=10
> git --version # 'git version 2.14.3.windows.1'
> git fetch --tags --progress -- https://gitbox.apache.org/repos/asf/commons-net.git +refs/heads/*:refs/remotes/origin/* # timeout=10
> git rev-parse "refs/remotes/origin/master^{commit}" # timeout=10
Checking out Revision b406d3cca5974e6101633690adeca384f6484c7c (refs/remotes/origin/master)
> git config core.sparsecheckout # timeout=10
> git checkout -f b406d3cca5974e6101633690adeca384f6484c7c # timeout=10
Commit message: "Merge pull request #390 from apache/dependabot/maven/org.apache.commons-commons-parent-93"
> git rev-list --no-walk 7e5ce554da69d4cccca46f8738b3756d926149c8 # timeout=10
[EnvInject] - Injecting environment variables from a build step.
ERROR: No tool found matching JDK_1_7_LATEST__HOME
Setting JDK_1_8_LATEST_WINDOWS_HOME=F:\jenkins\tools\java\latest1.8
[EnvInject] - Injecting as environment variables the properties content
JAVA_1_8_HOME=F:\jenkins\tools\java\latest1.8
[EnvInject] - Variables injected successfully.
ERROR: No tool found matching JDK_1_7_LATEST__HOME
Setting JDK_1_8_LATEST_WINDOWS_HOME=F:\jenkins\tools\java\latest1.8
Parsing POMs
ERROR: No tool found matching JDK_1_7_LATEST__HOME
Setting JDK_1_8_LATEST_WINDOWS_HOME=F:\jenkins\tools\java\latest1.8
Downloaded artifact https://repo.maven.apache.org/maven2/org/apache/commons/commons-parent/93/commons-parent-93.pom
Downloaded artifact https://repo.maven.apache.org/maven2/org/junit/junit-bom/5.14.1/junit-bom-5.14.1.pom
Modules changed, recalculating dependency graph
Established TCP socket on 49359
maven35-agent.jar already up to date
maven35-interceptor.jar already up to date
maven3-interceptor-commons.jar already up to date
[commons-net-windows] $ java -cp f:\jenkins\jenkins-home\712657a4\maven35-agent.jar;f:\jenkins\tools\maven\latest\boot\plexus-classworlds-2.8.0.jar;f:\\jenkins\\tools\\maven\\latest/conf/logging jenkins.maven3.agent.Maven35Main f:\\jenkins\\tools\\maven\\latest F:\jenkins\jenkins-home\slave.jar f:\jenkins\jenkins-home\712657a4\maven35-interceptor.jar f:\jenkins\jenkins-home\712657a4\maven3-interceptor-commons.jar 49359
<===[JENKINS REMOTING CAPACITY]===> channel started
ERROR: No tool found matching JDK_1_7_LATEST__HOME
Setting JDK_1_8_LATEST_WINDOWS_HOME=F:\jenkins\tools\java\latest1.8
Executing Maven: -B -f <https://ci-builds.apache.org/job/Commons/job/commons-net-windows/ws/pom.xml> -V clean install --no-transfer-progress --batch-mode -Pjava-1.8
[1mApache Maven 3.9.9 (8e8579a9e76f7d015ee5ec7bfcdc97d260186937)[m
Maven home: F:\jenkins\tools\maven\latest
Java version: 17.0.7, vendor: Eclipse Adoptium, runtime: F:\jenkins\tools\java\latest17
Default locale: en_US, platform encoding: Cp1252
OS name: "windows server 2019", version: "10.0", arch: "amd64", family: "windows"
[INFO] Scanning for projects...
[HUDSON] Collecting dependencies info
[INFO]
[INFO] ----------------------< commons-net:commons-net >-----------------------
[INFO] Building Apache Commons Net 3.12.1-SNAPSHOT
[INFO] from pom.xml
[INFO] --------------------------------[ jar ]---------------------------------
[INFO] Downloading from central: https://repo.maven.apache.org/maven2/org/apache/maven/plugins/maven-jar-plugin/3.5.0/maven-jar-plugin-3.5.0.pom
[INFO] Downloaded from central: https://repo.maven.apache.org/maven2/org/apache/maven/plugins/maven-jar-plugin/3.5.0/maven-jar-plugin-3.5.0.pom (7.6 kB at 17 kB/s)
[INFO] Downloading from central: https://repo.maven.apache.org/maven2/org/apache/maven/plugins/maven-jar-plugin/3.5.0/maven-jar-plugin-3.5.0.jar
[INFO] Downloaded from central: https://repo.maven.apache.org/maven2/org/apache/maven/plugins/maven-jar-plugin/3.5.0/maven-jar-plugin-3.5.0.jar (35 kB at 80 kB/s)
[INFO] Downloading from central: https://repo.maven.apache.org/maven2/org/junit/jupiter/junit-jupiter-api/5.14.1/junit-jupiter-api-5.14.1.pom
[INFO] Downloaded from central: https://repo.maven.apache.org/maven2/org/junit/jupiter/junit-jupiter-api/5.14.1/junit-jupiter-api-5.14.1.pom (3.2 kB at 45 kB/s)
[INFO] Downloading from central: https://repo.maven.apache.org/maven2/org/junit/platform/junit-platform-commons/1.14.1/junit-platform-commons-1.14.1.pom
[INFO] Downloaded from central: https://repo.maven.apache.org/maven2/org/junit/platform/junit-platform-commons/1.14.1/junit-platform-commons-1.14.1.pom (2.9 kB at 36 kB/s)
[INFO] Downloading from central: https://repo.maven.apache.org/maven2/org/junit/jupiter/junit-jupiter-engine/5.14.1/junit-jupiter-engine-5.14.1.pom
[INFO] Downloaded from central: https://repo.maven.apache.org/maven2/org/junit/jupiter/junit-jupiter-engine/5.14.1/junit-jupiter-engine-5.14.1.pom (3.2 kB at 44 kB/s)
[INFO] Downloading from central: https://repo.maven.apache.org/maven2/org/junit/platform/junit-platform-engine/1.14.1/junit-platform-engine-1.14.1.pom
[INFO] Downloaded from central: https://repo.maven.apache.org/maven2/org/junit/platform/junit-platform-engine/1.14.1/junit-platform-engine-1.14.1.pom (3.2 kB at 46 kB/s)
[INFO] Downloading from central: https://repo.maven.apache.org/maven2/org/junit/jupiter/junit-jupiter-params/5.14.1/junit-jupiter-params-5.14.1.pom
[INFO] Downloaded from central: https://repo.maven.apache.org/maven2/org/junit/jupiter/junit-jupiter-params/5.14.1/junit-jupiter-params-5.14.1.pom (3.0 kB at 40 kB/s)
[INFO] Downloading from central: https://repo.maven.apache.org/maven2/org/junit/jupiter/junit-jupiter-api/5.14.1/junit-jupiter-api-5.14.1.jar
[INFO] Downloaded from central: https://repo.maven.apache.org/maven2/org/junit/jupiter/junit-jupiter-api/5.14.1/junit-jupiter-api-5.14.1.jar (242 kB at 2.0 MB/s)
[INFO] Downloading from central: https://repo.maven.apache.org/maven2/org/junit/platform/junit-platform-commons/1.14.1/junit-platform-commons-1.14.1.jar
[INFO] Downloading from central: https://repo.maven.apache.org/maven2/org/junit/jupiter/junit-jupiter-engine/5.14.1/junit-jupiter-engine-5.14.1.jar
[INFO] Downloading from central: https://repo.maven.apache.org/maven2/org/junit/platform/junit-platform-engine/1.14.1/junit-platform-engine-1.14.1.jar
[INFO] Downloading from central: https://repo.maven.apache.org/maven2/org/junit/jupiter/junit-jupiter-params/5.14.1/junit-jupiter-params-5.14.1.jar
[INFO] Downloaded from central: https://repo.maven.apache.org/maven2/org/junit/platform/junit-platform-engine/1.14.1/junit-platform-engine-1.14.1.jar (272 kB at 1.4 MB/s)
[INFO] Downloaded from central: https://repo.maven.apache.org/maven2/org/junit/platform/junit-platform-commons/1.14.1/junit-platform-commons-1.14.1.jar (164 kB at 830 kB/s)
[INFO] Downloaded from central: https://repo.maven.apache.org/maven2/org/junit/jupiter/junit-jupiter-params/5.14.1/junit-jupiter-params-5.14.1.jar (663 kB at 3.2 MB/s)
[INFO] Downloaded from central: https://repo.maven.apache.org/maven2/org/junit/jupiter/junit-jupiter-engine/5.14.1/junit-jupiter-engine-5.14.1.jar (343 kB at 1.6 MB/s)
[INFO]
[INFO] --- clean:3.5.0:clean (default-clean) @ commons-net ---
[INFO]
[INFO] --- enforcer:3.5.0:enforce (enforce-maven-version) @ commons-net ---
[INFO] Rule 0: org.apache.maven.enforcer.rules.version.RequireMavenVersion passed
[INFO]
[INFO] --- enforcer:3.5.0:enforce (enforce-java-version) @ commons-net ---
[INFO] Rule 0: org.apache.maven.enforcer.rules.version.RequireJavaVersion passed
[INFO]
[INFO] --- apache-rat:0.17:check (rat-check) @ commons-net ---
[WARNING] Basedir is : <https://ci-builds.apache.org/job/Commons/job/commons-net-windows/ws/>
[ERROR] Could not create report parent directory <https://ci-builds.apache.org/job/Commons/job/commons-net-windows/ws/f>:\jenkins\jenkins-home\712657a4\workspace\Commons\commons-net-windows\target\rat.txt
[WARNING] Unable to create directory: <https://ci-builds.apache.org/job/Commons/job/commons-net-windows/ws/f>:\jenkins\jenkins-home\712657a4\workspace\Commons\commons-net-windows\target
[INFO] Excluding patterns: site-content/**, .checkstyle, .fbprefs, .pmd, .asf.yaml, .gitattributes, src/site/resources/download_*.cgi, maven-eclipse.xml, .externalToolBuilders/**, .vscode/**, .project, .classpath, .settings/**, **/*.svg, **/*.xcf
[INFO] Excluding MAVEN collection.
[INFO] Excluding ECLIPSE collection.
[INFO] Excluding IDEA collection.
[INFO] Processing exclude file from STANDARD_SCMS.
[INFO] Excluding STANDARD_SCMS collection.
[INFO] Excluding MISC collection.
[INFO] Excluding HIDDEN_DIR collection.
[WARNING] Attempt to (de-)serialize anonymous class org.jfrog.hudson.maven2.MavenDependenciesRecorder$1; see: https://jenkins.io/redirect/serialization-of-anonymous-classes/
[INFO] ------------------------------------------------------------------------
[INFO] BUILD FAILURE
[INFO] ------------------------------------------------------------------------
[INFO] Total time: 41.819 s
[INFO] Finished at: 2025-11-22T22:44:46Z
[INFO] ------------------------------------------------------------------------
Waiting for Jenkins to finish collecting data
[ERROR] Failed to execute goal org.apache.rat:apache-rat-plugin:0.17:check (rat-check) on project commons-net: java.io.FileNotFoundException: <https://ci-builds.apache.org/job/Commons/job/commons-net-windows/ws/f>:\jenkins\jenkins-home\712657a4\workspace\Commons\commons-net-windows\target\rat.txt (The filename, directory name, or volume label syntax is incorrect) -> [Help 1]
[ERROR]
[ERROR] To see the full stack trace of the errors, re-run Maven with the -e switch.
[ERROR] Re-run Maven using the -X switch to enable full debug logging.
[ERROR]
[ERROR] For more information about the errors and possible solutions, please read the following articles:
[ERROR] [Help 1] http://cwiki.apache.org/confluence/display/MAVEN/MojoExecutionException
[JENKINS] Archiving <https://ci-builds.apache.org/job/Commons/job/commons-net-windows/ws/pom.xml> to commons-net/commons-net/3.12.1-SNAPSHOT/commons-net-3.12.1-SNAPSHOT.pom
Sending e-mails to: notifications@commons.apache.org
channel stopped
ERROR: No tool found matching JDK_1_7_LATEST__HOME
Setting JDK_1_8_LATEST_WINDOWS_HOME=F:\jenkins\tools\java\latest1.8
ERROR: No tool found matching JDK_1_7_LATEST__HOME
Setting JDK_1_8_LATEST_WINDOWS_HOME=F:\jenkins\tools\java\latest1.8
Build failed in Jenkins: Commons » commons-net-windows #224
Posted by Apache Jenkins Server <je...@builds.apache.org>.
See <https://ci-builds.apache.org/job/Commons/job/commons-net-windows/224/display/redirect?page=changes>
Changes:
[garydgregory] Bump actions/checkout from v5.0.0 to v6.0.0
------------------------------------------
Started by an SCM change
Running as SYSTEM
[EnvInject] - Loading node environment variables.
Building remotely on jenkins-win-azr-2 (Windows-Docker Windows) in workspace <https://ci-builds.apache.org/job/Commons/job/commons-net-windows/ws/>
The recommended git tool is: NONE
No credentials specified
> git rev-parse --resolve-git-dir <https://ci-builds.apache.org/job/Commons/job/commons-net-windows/ws/.git> # timeout=10
Fetching changes from the remote Git repository
> git config remote.origin.url https://gitbox.apache.org/repos/asf/commons-net.git # timeout=10
Fetching upstream changes from https://gitbox.apache.org/repos/asf/commons-net.git
> git --version # timeout=10
> git --version # 'git version 2.14.3.windows.1'
> git fetch --tags --progress -- https://gitbox.apache.org/repos/asf/commons-net.git +refs/heads/*:refs/remotes/origin/* # timeout=10
> git rev-parse "refs/remotes/origin/master^{commit}" # timeout=10
Checking out Revision 7e5ce554da69d4cccca46f8738b3756d926149c8 (refs/remotes/origin/master)
> git config core.sparsecheckout # timeout=10
> git checkout -f 7e5ce554da69d4cccca46f8738b3756d926149c8 # timeout=10
Commit message: "Bump actions/checkout from v5.0.0 to v6.0.0"
> git rev-list --no-walk c44b7be36dbc4bf6dd1b25261f740debb7f5a105 # timeout=10
[EnvInject] - Injecting environment variables from a build step.
ERROR: No tool found matching JDK_1_7_LATEST__HOME
Setting JDK_1_8_LATEST_WINDOWS_HOME=F:\jenkins\tools\java\latest1.8
[EnvInject] - Injecting as environment variables the properties content
JAVA_1_8_HOME=F:\jenkins\tools\java\latest1.8
[EnvInject] - Variables injected successfully.
ERROR: No tool found matching JDK_1_7_LATEST__HOME
Setting JDK_1_8_LATEST_WINDOWS_HOME=F:\jenkins\tools\java\latest1.8
Parsing POMs
ERROR: No tool found matching JDK_1_7_LATEST__HOME
Setting JDK_1_8_LATEST_WINDOWS_HOME=F:\jenkins\tools\java\latest1.8
Established TCP socket on 63508
maven35-agent.jar already up to date
maven35-interceptor.jar already up to date
maven3-interceptor-commons.jar already up to date
[commons-net-windows] $ java -cp f:\jenkins\jenkins-home\712657a4\maven35-agent.jar;f:\jenkins\tools\maven\latest\boot\plexus-classworlds-2.8.0.jar;f:\\jenkins\\tools\\maven\\latest/conf/logging jenkins.maven3.agent.Maven35Main f:\\jenkins\\tools\\maven\\latest F:\jenkins\jenkins-home\agent.jar f:\jenkins\jenkins-home\712657a4\maven35-interceptor.jar f:\jenkins\jenkins-home\712657a4\maven3-interceptor-commons.jar 63508
<===[JENKINS REMOTING CAPACITY]===> channel started
ERROR: No tool found matching JDK_1_7_LATEST__HOME
Setting JDK_1_8_LATEST_WINDOWS_HOME=F:\jenkins\tools\java\latest1.8
Executing Maven: -B -f <https://ci-builds.apache.org/job/Commons/job/commons-net-windows/ws/pom.xml> -V clean install --no-transfer-progress --batch-mode -Pjava-1.8
[1mApache Maven 3.9.9 (8e8579a9e76f7d015ee5ec7bfcdc97d260186937)[m
Maven home: F:\jenkins\tools\maven\latest
Java version: 17.0.7, vendor: Eclipse Adoptium, runtime: F:\jenkins\tools\java\latest17
Default locale: en_US, platform encoding: Cp1252
OS name: "windows server 2022", version: "10.0", arch: "amd64", family: "windows"
[INFO] Scanning for projects...
[HUDSON] Collecting dependencies info
[INFO]
[INFO] ----------------------< commons-net:commons-net >-----------------------
[INFO] Building Apache Commons Net 3.12.1-SNAPSHOT
[INFO] from pom.xml
[INFO] --------------------------------[ jar ]---------------------------------
[INFO] Downloading from central: https://repo.maven.apache.org/maven2/org/codehaus/mojo/exec-maven-plugin/3.6.2/exec-maven-plugin-3.6.2.pom
[INFO] Downloaded from central: https://repo.maven.apache.org/maven2/org/codehaus/mojo/exec-maven-plugin/3.6.2/exec-maven-plugin-3.6.2.pom (17 kB at 31 kB/s)
[INFO] Downloading from central: https://repo.maven.apache.org/maven2/org/codehaus/mojo/exec-maven-plugin/3.6.2/exec-maven-plugin-3.6.2.jar
[INFO] Downloaded from central: https://repo.maven.apache.org/maven2/org/codehaus/mojo/exec-maven-plugin/3.6.2/exec-maven-plugin-3.6.2.jar (95 kB at 630 kB/s)
[INFO] Downloading from central: https://repo.maven.apache.org/maven2/commons-io/commons-io/2.21.0/commons-io-2.21.0.pom
[INFO] Downloaded from central: https://repo.maven.apache.org/maven2/commons-io/commons-io/2.21.0/commons-io-2.21.0.pom (21 kB at 199 kB/s)
[INFO] Downloading from central: https://repo.maven.apache.org/maven2/commons-io/commons-io/2.21.0/commons-io-2.21.0.jar
[INFO] Downloaded from central: https://repo.maven.apache.org/maven2/commons-io/commons-io/2.21.0/commons-io-2.21.0.jar (585 kB at 4.3 MB/s)
[INFO]
[INFO] --- clean:3.5.0:clean (default-clean) @ commons-net ---
[INFO] Deleting <https://ci-builds.apache.org/job/Commons/job/commons-net-windows/ws/target>
[INFO]
[INFO] --- enforcer:3.5.0:enforce (enforce-maven-version) @ commons-net ---
[INFO] Rule 0: org.apache.maven.enforcer.rules.version.RequireMavenVersion passed
[INFO]
[INFO] --- enforcer:3.5.0:enforce (enforce-java-version) @ commons-net ---
[INFO] Rule 0: org.apache.maven.enforcer.rules.version.RequireJavaVersion passed
[INFO]
[INFO] --- apache-rat:0.17:check (rat-check) @ commons-net ---
[WARNING] Parameter 'excludes' is deprecated: Deprecated for removal since 0.17: Use <inputExclude> instead.
[WARNING] Basedir is : <https://ci-builds.apache.org/job/Commons/job/commons-net-windows/ws/>
[ERROR] Could not create report parent directory <https://ci-builds.apache.org/job/Commons/job/commons-net-windows/ws/f>:\jenkins\jenkins-home\712657a4\workspace\Commons\commons-net-windows\target\rat.txt
[WARNING] Unable to create directory: <https://ci-builds.apache.org/job/Commons/job/commons-net-windows/ws/f>:\jenkins\jenkins-home\712657a4\workspace\Commons\commons-net-windows\target
[WARNING] Use of deprecated option 'exclude'. Deprecated for removal since 0.17: Use <inputExclude> instead.
[INFO] Excluding patterns: site-content/**, .checkstyle, .fbprefs, .pmd, .asf.yaml, .gitattributes, src/site/resources/download_*.cgi, maven-eclipse.xml, .externalToolBuilders/**, .vscode/**, .project, .classpath, .settings/**, **/*.svg, **/*.xcf
[INFO] Excluding MAVEN collection.
[INFO] Excluding ECLIPSE collection.
[INFO] Excluding IDEA collection.
[INFO] Processing exclude file from STANDARD_SCMS.
[INFO] Excluding STANDARD_SCMS collection.
[INFO] Excluding MISC collection.
[INFO] Excluding HIDDEN_DIR collection.
[WARNING] Attempt to (de-)serialize anonymous class org.jfrog.hudson.maven2.MavenDependenciesRecorder$1; see: https://jenkins.io/redirect/serialization-of-anonymous-classes/
[INFO] ------------------------------------------------------------------------
[INFO] BUILD FAILURE
[INFO] ------------------------------------------------------------------------
[INFO] Total time: 51.096 s
[INFO] Finished at: 2025-11-21T20:41:56Z
[INFO] ------------------------------------------------------------------------
Waiting for Jenkins to finish collecting data
[ERROR] Failed to execute goal org.apache.rat:apache-rat-plugin:0.17:check (rat-check) on project commons-net: java.io.FileNotFoundException: <https://ci-builds.apache.org/job/Commons/job/commons-net-windows/ws/f>:\jenkins\jenkins-home\712657a4\workspace\Commons\commons-net-windows\target\rat.txt (The filename, directory name, or volume label syntax is incorrect) -> [Help 1]
[ERROR]
[ERROR] To see the full stack trace of the errors, re-run Maven with the -e switch.
[ERROR] Re-run Maven using the -X switch to enable full debug logging.
[ERROR]
[ERROR] For more information about the errors and possible solutions, please read the following articles:
[ERROR] [Help 1] http://cwiki.apache.org/confluence/display/MAVEN/MojoExecutionException
[JENKINS] Archiving <https://ci-builds.apache.org/job/Commons/job/commons-net-windows/ws/pom.xml> to commons-net/commons-net/3.12.1-SNAPSHOT/commons-net-3.12.1-SNAPSHOT.pom
Sending e-mails to: notifications@commons.apache.org
channel stopped
ERROR: No tool found matching JDK_1_7_LATEST__HOME
Setting JDK_1_8_LATEST_WINDOWS_HOME=F:\jenkins\tools\java\latest1.8
ERROR: No tool found matching JDK_1_7_LATEST__HOME
Setting JDK_1_8_LATEST_WINDOWS_HOME=F:\jenkins\tools\java\latest1.8
Build failed in Jenkins: Commons » commons-net-windows #223
Posted by Apache Jenkins Server <je...@builds.apache.org>.
See <https://ci-builds.apache.org/job/Commons/job/commons-net-windows/223/display/redirect?page=changes>
Changes:
[garydgregory] Bump CodeQL 4.31.4
------------------------------------------
Started by an SCM change
Running as SYSTEM
[EnvInject] - Loading node environment variables.
Building remotely on jenkins-win-azr-3 (Windows-Docker Windows) in workspace <https://ci-builds.apache.org/job/Commons/job/commons-net-windows/ws/>
The recommended git tool is: NONE
No credentials specified
> git rev-parse --resolve-git-dir <https://ci-builds.apache.org/job/Commons/job/commons-net-windows/ws/.git> # timeout=10
Fetching changes from the remote Git repository
> git config remote.origin.url https://gitbox.apache.org/repos/asf/commons-net.git # timeout=10
Fetching upstream changes from https://gitbox.apache.org/repos/asf/commons-net.git
> git --version # timeout=10
> git --version # 'git version 2.14.3.windows.1'
> git fetch --tags --progress -- https://gitbox.apache.org/repos/asf/commons-net.git +refs/heads/*:refs/remotes/origin/* # timeout=10
> git rev-parse "refs/remotes/origin/master^{commit}" # timeout=10
Checking out Revision c44b7be36dbc4bf6dd1b25261f740debb7f5a105 (refs/remotes/origin/master)
> git config core.sparsecheckout # timeout=10
> git checkout -f c44b7be36dbc4bf6dd1b25261f740debb7f5a105 # timeout=10
Commit message: "Bump CodeQL 4.31.4"
> git rev-list --no-walk 1d33900554a0cc5ace2c5e4d862c154f9ecd01a2 # timeout=10
[EnvInject] - Injecting environment variables from a build step.
ERROR: No tool found matching JDK_1_7_LATEST__HOME
Setting JDK_1_8_LATEST_WINDOWS_HOME=F:\jenkins\tools\java\latest1.8
[EnvInject] - Injecting as environment variables the properties content
JAVA_1_8_HOME=F:\jenkins\tools\java\latest1.8
[EnvInject] - Variables injected successfully.
ERROR: No tool found matching JDK_1_7_LATEST__HOME
Setting JDK_1_8_LATEST_WINDOWS_HOME=F:\jenkins\tools\java\latest1.8
Parsing POMs
ERROR: No tool found matching JDK_1_7_LATEST__HOME
Setting JDK_1_8_LATEST_WINDOWS_HOME=F:\jenkins\tools\java\latest1.8
Established TCP socket on 49640
maven35-agent.jar already up to date
maven35-interceptor.jar already up to date
maven3-interceptor-commons.jar already up to date
[commons-net-windows] $ java -cp f:\jenkins\jenkins-home\712657a4\maven35-agent.jar;f:\jenkins\tools\maven\latest\boot\plexus-classworlds-2.8.0.jar;f:\\jenkins\\tools\\maven\\latest/conf/logging jenkins.maven3.agent.Maven35Main f:\\jenkins\\tools\\maven\\latest F:\jenkins\jenkins-home\slave.jar f:\jenkins\jenkins-home\712657a4\maven35-interceptor.jar f:\jenkins\jenkins-home\712657a4\maven3-interceptor-commons.jar 49640
<===[JENKINS REMOTING CAPACITY]===> channel started
ERROR: No tool found matching JDK_1_7_LATEST__HOME
Setting JDK_1_8_LATEST_WINDOWS_HOME=F:\jenkins\tools\java\latest1.8
Executing Maven: -B -f <https://ci-builds.apache.org/job/Commons/job/commons-net-windows/ws/pom.xml> -V clean install --no-transfer-progress --batch-mode -Pjava-1.8
[1mApache Maven 3.9.9 (8e8579a9e76f7d015ee5ec7bfcdc97d260186937)[m
Maven home: F:\jenkins\tools\maven\latest
Java version: 17.0.7, vendor: Eclipse Adoptium, runtime: F:\jenkins\tools\java\latest17
Default locale: en_US, platform encoding: Cp1252
OS name: "windows server 2019", version: "10.0", arch: "amd64", family: "windows"
[INFO] Scanning for projects...
[HUDSON] Collecting dependencies info
[INFO]
[INFO] ----------------------< commons-net:commons-net >-----------------------
[INFO] Building Apache Commons Net 3.12.1-SNAPSHOT
[INFO] from pom.xml
[INFO] --------------------------------[ jar ]---------------------------------
[INFO]
[INFO] --- clean:3.5.0:clean (default-clean) @ commons-net ---
[INFO]
[INFO] --- enforcer:3.5.0:enforce (enforce-maven-version) @ commons-net ---
[INFO] Rule 0: org.apache.maven.enforcer.rules.version.RequireMavenVersion passed
[INFO]
[INFO] --- enforcer:3.5.0:enforce (enforce-java-version) @ commons-net ---
[INFO] Rule 0: org.apache.maven.enforcer.rules.version.RequireJavaVersion passed
[INFO]
[INFO] --- apache-rat:0.17:check (rat-check) @ commons-net ---
[WARNING] Parameter 'excludes' is deprecated: Deprecated for removal since 0.17: Use <inputExclude> instead.
[WARNING] Basedir is : <https://ci-builds.apache.org/job/Commons/job/commons-net-windows/ws/>
[ERROR] Could not create report parent directory <https://ci-builds.apache.org/job/Commons/job/commons-net-windows/ws/f>:\jenkins\jenkins-home\712657a4\workspace\Commons\commons-net-windows\target\rat.txt
[WARNING] Unable to create directory: <https://ci-builds.apache.org/job/Commons/job/commons-net-windows/ws/f>:\jenkins\jenkins-home\712657a4\workspace\Commons\commons-net-windows\target
[WARNING] Use of deprecated option 'exclude'. Deprecated for removal since 0.17: Use <inputExclude> instead.
[INFO] Excluding patterns: site-content/**, .checkstyle, .fbprefs, .pmd, .asf.yaml, .gitattributes, src/site/resources/download_*.cgi, maven-eclipse.xml, .externalToolBuilders/**, .vscode/**, .project, .classpath, .settings/**, **/*.svg, **/*.xcf
[INFO] Excluding MAVEN collection.
[INFO] Excluding ECLIPSE collection.
[INFO] Excluding IDEA collection.
[INFO] Processing exclude file from STANDARD_SCMS.
[INFO] Excluding STANDARD_SCMS collection.
[INFO] Excluding MISC collection.
[INFO] Excluding HIDDEN_DIR collection.
[WARNING] Attempt to (de-)serialize anonymous class org.jfrog.hudson.maven2.MavenDependenciesRecorder$1; see: https://jenkins.io/redirect/serialization-of-anonymous-classes/
[INFO] ------------------------------------------------------------------------
[INFO] BUILD FAILURE
[INFO] ------------------------------------------------------------------------
[INFO] Total time: 01:05 min
[INFO] Finished at: 2025-11-21T15:43:39Z
[INFO] ------------------------------------------------------------------------
Waiting for Jenkins to finish collecting data
[ERROR] Failed to execute goal org.apache.rat:apache-rat-plugin:0.17:check (rat-check) on project commons-net: java.io.FileNotFoundException: <https://ci-builds.apache.org/job/Commons/job/commons-net-windows/ws/f>:\jenkins\jenkins-home\712657a4\workspace\Commons\commons-net-windows\target\rat.txt (The filename, directory name, or volume label syntax is incorrect) -> [Help 1]
[ERROR]
[ERROR] To see the full stack trace of the errors, re-run Maven with the -e switch.
[ERROR] Re-run Maven using the -X switch to enable full debug logging.
[ERROR]
[ERROR] For more information about the errors and possible solutions, please read the following articles:
[ERROR] [Help 1] http://cwiki.apache.org/confluence/display/MAVEN/MojoExecutionException
[JENKINS] Archiving <https://ci-builds.apache.org/job/Commons/job/commons-net-windows/ws/pom.xml> to commons-net/commons-net/3.12.1-SNAPSHOT/commons-net-3.12.1-SNAPSHOT.pom
Sending e-mails to: notifications@commons.apache.org
channel stopped
ERROR: No tool found matching JDK_1_7_LATEST__HOME
Setting JDK_1_8_LATEST_WINDOWS_HOME=F:\jenkins\tools\java\latest1.8
ERROR: No tool found matching JDK_1_7_LATEST__HOME
Setting JDK_1_8_LATEST_WINDOWS_HOME=F:\jenkins\tools\java\latest1.8