You are viewing a plain text version of this content. The canonical link for it is here.
Posted to dev@sling.apache.org by Apache Jenkins Server <je...@builds.apache.org> on 2015/04/06 20:29:42 UTC

Build failed in Jenkins: sling-trunk-1.6 #3256

See <https://builds.apache.org/job/sling-trunk-1.6/3256/changes>

Changes:

[sboehme] SLING-4555 Resource Editor: fixed e2e tests, node name handling in the add node dialog and added an initial version of the add node e2e test

------------------------------------------
[...truncated 48421 lines...]
[INFO] Apache Sling OSGi LogService Implementation ....... SUCCESS [4.836s]
[INFO] Apache Sling MIME type mapping support ............ SUCCESS [5.730s]
[INFO] Apache Sling Commons OSGi support ................. SUCCESS [5.272s]
[INFO] Apache Sling Scheduler Support .................... SUCCESS [4.440s]
[INFO] Apache Sling Testing Utilities .................... SUCCESS [17.019s]
[INFO] Apache Sling Thread Dumper ........................ SUCCESS [4.168s]
[INFO] Apache Sling Thread Support ....................... SUCCESS [4.045s]
[INFO] Apache Sling Authentication Service ............... SUCCESS [9.208s]
[INFO] Apache Sling Form Based Authentication Handler .... SUCCESS [10.522s]
[INFO] Apache Sling Engine Implementation ................ SUCCESS [13.983s]
[INFO] Apache Sling Repository API Bundle ................ SUCCESS [6.224s]
[INFO] Apache Sling Testing JCR Mock ..................... SUCCESS [5.498s]
[INFO] Apache Sling JCR Base Bundle ...................... SUCCESS [4.513s]
[INFO] Apache Sling JCR ClassLoader ...................... SUCCESS [3.454s]
[INFO] Apache Sling Initial Content Loader ............... SUCCESS [11.830s]
[INFO] Apache Sling Jackrabbit Embedded Repository ....... SUCCESS [16.057s]
[INFO] Apache Sling Jackrabbit UserManager Support ....... SUCCESS [4.177s]
[INFO] Apache Sling Jackrabbit JSR-283 Access Control Manager Support  SUCCESS [3.873s]
[INFO] Apache Sling Wrapper Bundle for the JCR API ....... SUCCESS [3.090s]
[INFO] Apache Sling JCR Resource Resolver ................ SUCCESS [36.481s]
[INFO] Apache Sling Testing Sling Mock Jackrabbit-based Resource Resolver  SUCCESS [14.717s]
[INFO] Apache Sling Versioning Integration Tests ......... SUCCESS [10.242s]
[INFO] Apache Sling JCR Repository Registration .......... SUCCESS [7.332s]
[INFO] Apache Sling Simple WebDAV Access to repositories . SUCCESS [7.086s]
[INFO] Apache Sling DavEx Access to repositories ......... SUCCESS [5.318s]
[INFO] Apache Sling JCR WebConsole Bundle ................ SUCCESS [3.542s]
[INFO] Apache Sling Oak Repository Server ................ SUCCESS [5.679s]
[INFO] Apache Sling SlingRepository Integration Tests .... SUCCESS [50.579s]
[INFO] Apache Sling Servlet Resolver ..................... SUCCESS [17.228s]
[INFO] Apache Sling Default GET Servlets ................. SUCCESS [4.552s]
[INFO] Apache Sling Default POST Servlets ................ SUCCESS [5.282s]
[INFO] Apache Sling Compat Servlets ...................... SUCCESS [3.713s]
[INFO] Apache Sling Scripting Implementation API ......... SUCCESS [3.828s]
[INFO] Apache Sling Scripting Core implementation ........ SUCCESS [11.951s]
[INFO] Apache Sling Scripting JavaScript Support ......... SUCCESS [11.548s]
[INFO] Apache Sling Scripting JSP Support ................ SUCCESS [10.252s]
[INFO] Apache Sling JSP Tag Library ...................... SUCCESS [8.450s]
[INFO] Apache Sling JSP Standard Tag Library ............. SUCCESS [6.704s]
[INFO] Apache Sling Adapter Manager Implementation ....... SUCCESS [3.577s]
[INFO] Apache Sling Bundle Resource Provider ............. SUCCESS [3.998s]
[INFO] Apache Sling Distributed Event Admin .............. SUCCESS [11.709s]
[INFO] Apache Sling Discovery API ........................ SUCCESS [3.680s]
[INFO] Apache Sling Resource-Based Discovery Service ..... SUCCESS [4:36.912s]
[INFO] Apache Sling Discovery Support Bundle ............. SUCCESS [3.925s]
[INFO] Apache Sling Discovery Standalone Implementation .. SUCCESS [3.074s]
[INFO] Apache Sling Event Support ........................ FAILURE [5:04.421s]
[INFO] Apache Sling Feature Flags ........................ SKIPPED
[INFO] Apache Sling Filesystem Resource Provider ......... SKIPPED
[INFO] Apache Sling javax.activation bundle .............. SKIPPED
[INFO] Apache Sling Service User Mapper .................. SKIPPED
[INFO] Apache Sling Settings ............................. SKIPPED
[INFO] Apache Sling Web Console Branding ................. SKIPPED
[INFO] Apache Sling Web Console Security Provider ........ SKIPPED
[INFO] Apache Sling Explorer ............................. SKIPPED
[INFO] Apache Sling Health Check Core .................... SKIPPED
[INFO] Apache Sling Health Check Annotations ............. SKIPPED
[INFO] Apache Sling Health Check Samples ................. SKIPPED
[INFO] Apache Sling Health Check Support Components ...... SKIPPED
[INFO] Apache Sling Health Check Webconsole Plugin ....... SKIPPED
[INFO] Apache Sling Health Check JUnit Bridge ............ SKIPPED
[INFO] Apache Sling Health Check Integration Tests ....... SKIPPED
[INFO] Apache Sling Health Check Reactor POM ............. SKIPPED
[INFO] Apache Sling Resource Access Security ............. SKIPPED
[INFO] Apache Sling Resource Access Security Integration Tests  SKIPPED
[INFO] Apache Sling Models API ........................... SKIPPED
[INFO] Apache Sling Models Implementation ................ SKIPPED
[INFO] Apache Sling Test Tools ........................... SKIPPED
[INFO] Apache Sling Models Integration Tests ............. SKIPPED
[INFO] Apache Sling JUnit Core ........................... SKIPPED
[INFO] Apache Sling JUnit Scriptable Tests Provider ...... SKIPPED
[INFO] Apache Sling JUnit Health Checks .................. SKIPPED
[INFO] Apache Sling JUnit Remote Tests Runners ........... SKIPPED
[INFO] Apache Sling JUnit Performance .................... SKIPPED
[INFO] Apache Sling Testing Resource Resolver Mock ....... SKIPPED
[INFO] Apache Sling Testing OSGi Mock .................... SKIPPED
[INFO] Apache Sling Testing Sling Mock ................... SKIPPED
[INFO] Apache Sling Pax Exam Utilities ................... SKIPPED
[INFO] Apache Sling Sample Server-Side Tests ............. SKIPPED
[INFO] Apache Sling Failing Server-Side Tests ............ SKIPPED
[INFO] Apache Sling Launchpad Base ....................... SKIPPED
[INFO] Apache Sling Launchpad Application Builder ........ SKIPPED
[INFO] Apache Sling Sample Integration Tests ............. SKIPPED
[INFO] Apache Sling Testing Modules Reactor .............. SKIPPED
[INFO] Apache Sling Installer ............................ SKIPPED
[INFO] Apache Sling Installer WebConsole Plugin .......... SKIPPED
[INFO] Apache Sling File Installer ....................... SKIPPED
[INFO] Apache Sling JCR Installer ........................ SKIPPED
[INFO] Apache Sling Installer Configuration Admin Support  SKIPPED
[INFO] Apache Sling Deployment Package Installer ......... SKIPPED
[INFO] Apache Sling Subsystems Installer ................. SKIPPED
[INFO] Apache Sling Installer Integration Tests .......... SKIPPED
[INFO] Apache Sling Launchpad API ........................ SKIPPED
[INFO] Apache Sling Launchpad Installer .................. SKIPPED
[INFO] Apache Sling Launchpad Content .................... SKIPPED
[INFO] Apache Sling Launchpad Testing Services ........... SKIPPED
[INFO] Apache Sling Launchpad Testing Services WAR ....... SKIPPED
[INFO] Apache Sling Launchpad Testing Fragment Bundle .... SKIPPED
[INFO] Apache Sling Launchpad Test Bundles ............... SKIPPED
[INFO] Apache Sling Integration Tests .................... SKIPPED
[INFO] Apache Sling Launchpad Testing .................... SKIPPED
[INFO] Apache Sling (Builder) ............................ SKIPPED
[INFO] ------------------------------------------------------------------------
[INFO] BUILD FAILURE
[INFO] ------------------------------------------------------------------------
[INFO] Total time: 20:39.443s
[INFO] Finished at: Mon Apr 06 18:29:00 UTC 2015
[INFO] Final Memory: 135M/325M
[INFO] ------------------------------------------------------------------------
[JENKINS] Archiving disabled
[JENKINS] Archiving disabled
[JENKINS] Archiving disabled
[JENKINS] Archiving disabled
[JENKINS] Archiving disabled
[JENKINS] Archiving disabled
[JENKINS] Archiving disabled
[JENKINS] Archiving disabled
[JENKINS] Archiving disabled
[JENKINS] Archiving disabled
[JENKINS] Archiving disabled
[JENKINS] Archiving disabled
[JENKINS] Archiving disabled
[JENKINS] Archiving disabled
[JENKINS] Archiving disabled
[JENKINS] Archiving disabled
[JENKINS] Archiving disabled
[JENKINS] Archiving disabled
[JENKINS] Archiving disabled
[JENKINS] Archiving disabled
[JENKINS] Archiving disabled
[JENKINS] Archiving disabled
[JENKINS] Archiving disabled
[JENKINS] Archiving disabled
[JENKINS] Archiving disabled
[JENKINS] Archiving disabled
[JENKINS] Archiving disabled
[JENKINS] Archiving disabled
[JENKINS] Archiving disabled
[JENKINS] Archiving disabled
[JENKINS] Archiving disabled
[JENKINS] Archiving disabled
[JENKINS] Archiving disabled
[JENKINS] Archiving disabled
[JENKINS] Archiving disabled
[JENKINS] Archiving disabled
[JENKINS] Archiving disabled
[JENKINS] Archiving disabled
[JENKINS] Archiving disabled
[JENKINS] Archiving disabled
[JENKINS] Archiving disabled
[JENKINS] Archiving disabled
[JENKINS] Archiving disabled
[JENKINS] Archiving disabled
[JENKINS] Archiving disabled
[JENKINS] Archiving disabled
[JENKINS] Archiving disabled
[JENKINS] Archiving disabled
[JENKINS] Archiving disabled
[JENKINS] Archiving disabled
[JENKINS] Archiving disabled
[JENKINS] Archiving disabled
[JENKINS] Archiving disabled
[JENKINS] Archiving disabled
[JENKINS] Archiving disabled
[JENKINS] Archiving disabled
[JENKINS] Archiving disabled
[JENKINS] Archiving disabled
[JENKINS] Archiving disabled
[JENKINS] Archiving disabled
[JENKINS] Archiving disabled
[JENKINS] Archiving disabled
[JENKINS] Archiving disabled
[JENKINS] Archiving disabled
[JENKINS] Archiving disabled
[JENKINS] Archiving disabled
[JENKINS] Archiving disabled
[JENKINS] Archiving disabled
[JENKINS] Archiving disabled
[JENKINS] Archiving disabled
[JENKINS] Archiving disabled
[JENKINS] Archiving disabled
[JENKINS] Archiving disabled
[JENKINS] Archiving disabled
[JENKINS] Archiving disabled
[JENKINS] Archiving disabled
[JENKINS] Archiving disabled
[JENKINS] Archiving disabled
[JENKINS] Archiving disabled
[JENKINS] Archiving disabled
[JENKINS] Archiving disabled
[JENKINS] Archiving disabled
[JENKINS] Archiving disabled
[JENKINS] Archiving disabled
[JENKINS] Archiving disabled
[JENKINS] Archiving disabled
[JENKINS] Archiving disabled
[JENKINS] Archiving disabled
[JENKINS] Archiving disabled
[JENKINS] Archiving disabled
[JENKINS] Archiving disabled
[JENKINS] Archiving disabled
[JENKINS] Archiving disabled
[JENKINS] Archiving disabled
[JENKINS] Archiving disabled
[JENKINS] Archiving disabled
[JENKINS] Archiving disabled
[JENKINS] Archiving disabled
[JENKINS] Archiving disabled
[JENKINS] Archiving disabled
[JENKINS] Archiving disabled
[JENKINS] Archiving disabled
[JENKINS] Archiving disabled
[JENKINS] Archiving disabled
[JENKINS] Archiving disabled
[JENKINS] Archiving disabled
[JENKINS] Archiving disabled
[JENKINS] Archiving disabled
[JENKINS] Archiving disabled
[JENKINS] Archiving disabled
[JENKINS] Archiving disabled
[JENKINS] Archiving disabled
[JENKINS] Archiving disabled
[JENKINS] Archiving disabled
[JENKINS] Archiving disabled
[JENKINS] Archiving disabled
[JENKINS] Archiving disabled
[JENKINS] Archiving disabled
[JENKINS] Archiving disabled
[JENKINS] Archiving disabled
[JENKINS] Archiving disabled
[JENKINS] Archiving disabled
[JENKINS] Archiving disabled
[JENKINS] Archiving disabled
[JENKINS] Archiving disabled
[JENKINS] Archiving disabled
[JENKINS] Archiving disabled
Waiting for Jenkins to finish collecting data
[ERROR] Failed to execute goal org.apache.maven.plugins:maven-failsafe-plugin:2.16:integration-test (default) on project org.apache.sling.event: Execution default of goal org.apache.maven.plugins:maven-failsafe-plugin:2.16:integration-test failed: The forked VM terminated without saying properly goodbye. VM crash or System.exit called ?
[ERROR] Command was/bin/sh -c cd <https://builds.apache.org/job/sling-trunk-1.6/ws/trunk/bundles/extensions/event> && /home/jenkins/tools/java/jdk1.6.0_45-32/jre/bin/java -Xmx2048m -XX:MaxPermSize=512m -jar <https://builds.apache.org/job/sling-trunk-1.6/ws/trunk/bundles/extensions/event/target/surefire/surefirebooter8966558270306960395.jar> <https://builds.apache.org/job/sling-trunk-1.6/ws/trunk/bundles/extensions/event/target/surefire/surefire4336694494544216414tmp> <https://builds.apache.org/job/sling-trunk-1.6/ws/trunk/bundles/extensions/event/target/surefire/surefire_23694121237566832733tmp>
[ERROR] -> [Help 1]
[ERROR] 
[ERROR] To see the full stack trace of the errors, re-run Maven with the -e switch.
[ERROR] Re-run Maven using the -X switch to enable full debug logging.
[ERROR] 
[ERROR] For more information about the errors and possible solutions, please read the following articles:
[ERROR] [Help 1] http://cwiki.apache.org/confluence/display/MAVEN/PluginExecutionException
[ERROR] 
[ERROR] After correcting the problems, you can resume the build with the command
[ERROR]   mvn <goals> -rf :org.apache.sling.event
channel stopped

Jenkins build is back to normal : sling-trunk-1.6 #3264

Posted by Apache Jenkins Server <je...@builds.apache.org>.
See <https://builds.apache.org/job/sling-trunk-1.6/3264/changes>


Build failed in Jenkins: sling-trunk-1.6 #3263

Posted by Apache Jenkins Server <je...@builds.apache.org>.
See <https://builds.apache.org/job/sling-trunk-1.6/3263/changes>

Changes:

[cziegeler] SLING-4563 : Log start level number on STARTLEVEL CHANGED event

------------------------------------------
[...truncated 58079 lines...]
[INFO] Apache Sling JSON Library ......................... SUCCESS [7.946s]
[INFO] Apache Sling SLF4J Implementation (Logback) ....... SUCCESS [30.051s]
[INFO] Apache Sling OSGi LogService Implementation ....... SUCCESS [4.370s]
[INFO] Apache Sling MIME type mapping support ............ SUCCESS [8.663s]
[INFO] Apache Sling Commons OSGi support ................. SUCCESS [6.048s]
[INFO] Apache Sling Scheduler Support .................... SUCCESS [15.729s]
[INFO] Apache Sling Testing Utilities .................... SUCCESS [17.574s]
[INFO] Apache Sling Thread Dumper ........................ SUCCESS [3.704s]
[INFO] Apache Sling Thread Support ....................... SUCCESS [4.106s]
[INFO] Apache Sling Authentication Service ............... SUCCESS [8.672s]
[INFO] Apache Sling Form Based Authentication Handler .... SUCCESS [9.143s]
[INFO] Apache Sling Engine Implementation ................ SUCCESS [16.264s]
[INFO] Apache Sling Repository API Bundle ................ SUCCESS [3.052s]
[INFO] Apache Sling Testing JCR Mock ..................... SUCCESS [4.701s]
[INFO] Apache Sling JCR Base Bundle ...................... SUCCESS [6.584s]
[INFO] Apache Sling JCR ClassLoader ...................... SUCCESS [8.468s]
[INFO] Apache Sling Initial Content Loader ............... SUCCESS [5.966s]
[INFO] Apache Sling Jackrabbit Embedded Repository ....... SUCCESS [15.795s]
[INFO] Apache Sling Jackrabbit UserManager Support ....... SUCCESS [7.031s]
[INFO] Apache Sling Jackrabbit JSR-283 Access Control Manager Support  SUCCESS [3.699s]
[INFO] Apache Sling Wrapper Bundle for the JCR API ....... SUCCESS [3.010s]
[INFO] Apache Sling JCR Resource Resolver ................ SUCCESS [36.722s]
[INFO] Apache Sling Testing Sling Mock Jackrabbit-based Resource Resolver  SUCCESS [14.419s]
[INFO] Apache Sling Versioning Integration Tests ......... SUCCESS [12.728s]
[INFO] Apache Sling JCR Repository Registration .......... SUCCESS [5.897s]
[INFO] Apache Sling Simple WebDAV Access to repositories . SUCCESS [5.502s]
[INFO] Apache Sling DavEx Access to repositories ......... SUCCESS [4.391s]
[INFO] Apache Sling JCR WebConsole Bundle ................ SUCCESS [4.063s]
[INFO] Apache Sling Oak Repository Server ................ SUCCESS [4.721s]
[INFO] Apache Sling SlingRepository Integration Tests .... SUCCESS [50.687s]
[INFO] Apache Sling Servlet Resolver ..................... SUCCESS [6.537s]
[INFO] Apache Sling Default GET Servlets ................. SUCCESS [5.592s]
[INFO] Apache Sling Default POST Servlets ................ SUCCESS [5.629s]
[INFO] Apache Sling Compat Servlets ...................... SUCCESS [3.601s]
[INFO] Apache Sling Scripting Implementation API ......... SUCCESS [3.691s]
[INFO] Apache Sling Scripting Core implementation ........ SUCCESS [13.431s]
[INFO] Apache Sling Scripting JavaScript Support ......... SUCCESS [11.257s]
[INFO] Apache Sling Scripting JSP Support ................ SUCCESS [9.511s]
[INFO] Apache Sling JSP Tag Library ...................... SUCCESS [6.189s]
[INFO] Apache Sling JSP Standard Tag Library ............. SUCCESS [5.786s]
[INFO] Apache Sling Adapter Manager Implementation ....... SUCCESS [4.427s]
[INFO] Apache Sling Bundle Resource Provider ............. SUCCESS [4.606s]
[INFO] Apache Sling Distributed Event Admin .............. SUCCESS [6.427s]
[INFO] Apache Sling Discovery API ........................ SUCCESS [7.338s]
[INFO] Apache Sling Resource-Based Discovery Service ..... SUCCESS [4:37.174s]
[INFO] Apache Sling Discovery Support Bundle ............. SUCCESS [3.476s]
[INFO] Apache Sling Discovery Standalone Implementation .. SUCCESS [3.043s]
[INFO] Apache Sling Event Support ........................ SUCCESS [12:07.011s]
[INFO] Apache Sling Feature Flags ........................ SUCCESS [6.752s]
[INFO] Apache Sling Filesystem Resource Provider ......... SUCCESS [5.823s]
[INFO] Apache Sling javax.activation bundle .............. SUCCESS [5.187s]
[INFO] Apache Sling Service User Mapper .................. SUCCESS [4.757s]
[INFO] Apache Sling Settings ............................. SUCCESS [8.199s]
[INFO] Apache Sling Web Console Branding ................. SUCCESS [5.146s]
[INFO] Apache Sling Web Console Security Provider ........ SUCCESS [4.167s]
[INFO] Apache Sling Explorer ............................. SUCCESS [5.818s]
[INFO] Apache Sling Health Check Core .................... SUCCESS [10.266s]
[INFO] Apache Sling Health Check Annotations ............. SUCCESS [5.312s]
[INFO] Apache Sling Health Check Samples ................. SUCCESS [7.870s]
[INFO] Apache Sling Health Check Support Components ...... SUCCESS [6.361s]
[INFO] Apache Sling Health Check Webconsole Plugin ....... SUCCESS [3.498s]
[INFO] Apache Sling Health Check JUnit Bridge ............ SUCCESS [8.102s]
[INFO] Apache Sling Health Check Integration Tests ....... SUCCESS [31.932s]
[INFO] Apache Sling Health Check Reactor POM ............. SUCCESS [1.955s]
[INFO] Apache Sling Resource Access Security ............. SUCCESS [8.423s]
[INFO] Apache Sling Resource Access Security Integration Tests  SUCCESS [27.103s]
[INFO] Apache Sling Models API ........................... SUCCESS [10.917s]
[INFO] Apache Sling Models Implementation ................ SUCCESS [20.857s]
[INFO] Apache Sling Test Tools ........................... SUCCESS [8.211s]
[INFO] Apache Sling Models Integration Tests ............. SUCCESS [30.910s]
[INFO] Apache Sling JUnit Core ........................... SUCCESS [5.853s]
[INFO] Apache Sling JUnit Scriptable Tests Provider ...... SUCCESS [4.580s]
[INFO] Apache Sling JUnit Health Checks .................. SUCCESS [7.062s]
[INFO] Apache Sling JUnit Remote Tests Runners ........... SUCCESS [7.893s]
[INFO] Apache Sling JUnit Performance .................... SUCCESS [6.743s]
[INFO] Apache Sling Testing Resource Resolver Mock ....... SUCCESS [3.686s]
[INFO] Apache Sling Testing OSGi Mock .................... SUCCESS [6.326s]
[INFO] Apache Sling Testing Sling Mock ................... SUCCESS [7.846s]
[INFO] Apache Sling Pax Exam Utilities ................... SUCCESS [23.962s]
[INFO] Apache Sling Sample Server-Side Tests ............. SUCCESS [4.415s]
[INFO] Apache Sling Failing Server-Side Tests ............ SUCCESS [4.706s]
[INFO] Apache Sling Launchpad Base ....................... SUCCESS [17.404s]
[INFO] Apache Sling Launchpad Application Builder ........ SUCCESS [1:04.244s]
[INFO] Apache Sling Sample Integration Tests ............. FAILURE [1:06.961s]
[INFO] Apache Sling Testing Modules Reactor .............. SKIPPED
[INFO] Apache Sling Installer ............................ SKIPPED
[INFO] Apache Sling Installer WebConsole Plugin .......... SKIPPED
[INFO] Apache Sling File Installer ....................... SKIPPED
[INFO] Apache Sling JCR Installer ........................ SKIPPED
[INFO] Apache Sling Installer Configuration Admin Support  SKIPPED
[INFO] Apache Sling Deployment Package Installer ......... SKIPPED
[INFO] Apache Sling Subsystems Installer ................. SKIPPED
[INFO] Apache Sling Installer Integration Tests .......... SKIPPED
[INFO] Apache Sling Launchpad API ........................ SKIPPED
[INFO] Apache Sling Launchpad Installer .................. SKIPPED
[INFO] Apache Sling Launchpad Content .................... SKIPPED
[INFO] Apache Sling Launchpad Testing Services ........... SKIPPED
[INFO] Apache Sling Launchpad Testing Services WAR ....... SKIPPED
[INFO] Apache Sling Launchpad Testing Fragment Bundle .... SKIPPED
[INFO] Apache Sling Launchpad Test Bundles ............... SKIPPED
[INFO] Apache Sling Integration Tests .................... SKIPPED
[INFO] Apache Sling Launchpad Testing .................... SKIPPED
[INFO] Apache Sling (Builder) ............................ SKIPPED
[INFO] ------------------------------------------------------------------------
[INFO] BUILD FAILURE
[INFO] ------------------------------------------------------------------------
[INFO] Total time: 35:42.204s
[INFO] Finished at: Tue Apr 07 15:40:42 UTC 2015
[INFO] Final Memory: 162M/350M
[INFO] ------------------------------------------------------------------------
[JENKINS] Archiving disabled
[JENKINS] Archiving disabled
[JENKINS] Archiving disabled
[JENKINS] Archiving disabled
[JENKINS] Archiving disabled
[JENKINS] Archiving disabled
[JENKINS] Archiving disabled
[JENKINS] Archiving disabled
[JENKINS] Archiving disabled
[JENKINS] Archiving disabled
[JENKINS] Archiving disabled
[JENKINS] Archiving disabled
[JENKINS] Archiving disabled
[JENKINS] Archiving disabled
[JENKINS] Archiving disabled
[JENKINS] Archiving disabled
[JENKINS] Archiving disabled
[JENKINS] Archiving disabled
[JENKINS] Archiving disabled
[JENKINS] Archiving disabled
[JENKINS] Archiving disabled
[JENKINS] Archiving disabled
[JENKINS] Archiving disabled
[JENKINS] Archiving disabled
[JENKINS] Archiving disabled
[JENKINS] Archiving disabled
[JENKINS] Archiving disabled
[JENKINS] Archiving disabled
[JENKINS] Archiving disabled
[JENKINS] Archiving disabled
[JENKINS] Archiving disabled
[JENKINS] Archiving disabled
[JENKINS] Archiving disabled
[JENKINS] Archiving disabled
[JENKINS] Archiving disabled
[JENKINS] Archiving disabled
[JENKINS] Archiving disabled
[JENKINS] Archiving disabled
[JENKINS] Archiving disabled
[JENKINS] Archiving disabled
[JENKINS] Archiving disabled
[JENKINS] Archiving disabled
[JENKINS] Archiving disabled
[JENKINS] Archiving disabled
[JENKINS] Archiving disabled
[JENKINS] Archiving disabled
[JENKINS] Archiving disabled
[JENKINS] Archiving disabled
[JENKINS] Archiving disabled
[JENKINS] Archiving disabled
[JENKINS] Archiving disabled
[JENKINS] Archiving disabled
[JENKINS] Archiving disabled
[JENKINS] Archiving disabled
[JENKINS] Archiving disabled
[JENKINS] Archiving disabled
[JENKINS] Archiving disabled
[JENKINS] Archiving disabled
[JENKINS] Archiving disabled
[JENKINS] Archiving disabled
[JENKINS] Archiving disabled
[JENKINS] Archiving disabled
[JENKINS] Archiving disabled
[JENKINS] Archiving disabled
[JENKINS] Archiving disabled
[JENKINS] Archiving disabled
[JENKINS] Archiving disabled
[JENKINS] Archiving disabled
[JENKINS] Archiving disabled
[JENKINS] Archiving disabled
[JENKINS] Archiving disabled
[JENKINS] Archiving disabled
[JENKINS] Archiving disabled
[JENKINS] Archiving disabled
[JENKINS] Archiving disabled
[JENKINS] Archiving disabled
[JENKINS] Archiving disabled
[JENKINS] Archiving disabled
[JENKINS] Archiving disabled
[JENKINS] Archiving disabled
[JENKINS] Archiving disabled
[JENKINS] Archiving disabled
[JENKINS] Archiving disabled
[JENKINS] Archiving disabled
[JENKINS] Archiving disabled
[JENKINS] Archiving disabled
[JENKINS] Archiving disabled
[JENKINS] Archiving disabled
[JENKINS] Archiving disabled
[JENKINS] Archiving disabled
[JENKINS] Archiving disabled
[JENKINS] Archiving disabled
[JENKINS] Archiving disabled
[JENKINS] Archiving disabled
[JENKINS] Archiving disabled
[JENKINS] Archiving disabled
[JENKINS] Archiving disabled
[JENKINS] Archiving disabled
[JENKINS] Archiving disabled
[JENKINS] Archiving disabled
[JENKINS] Archiving disabled
[JENKINS] Archiving disabled
[JENKINS] Archiving disabled
[JENKINS] Archiving disabled
[JENKINS] Archiving disabled
[JENKINS] Archiving disabled
[JENKINS] Archiving disabled
[JENKINS] Archiving disabled
[JENKINS] Archiving disabled
[JENKINS] Archiving disabled
[JENKINS] Archiving disabled
[JENKINS] Archiving disabled
[JENKINS] Archiving disabled
[JENKINS] Archiving disabled
[JENKINS] Archiving disabled
[JENKINS] Archiving disabled
[JENKINS] Archiving disabled
[JENKINS] Archiving disabled
[JENKINS] Archiving disabled
[JENKINS] Archiving disabled
[JENKINS] Archiving disabled
[JENKINS] Archiving disabled
[JENKINS] Archiving disabled
[JENKINS] Archiving disabled
[JENKINS] Archiving disabled
[JENKINS] Archiving disabled
[JENKINS] Archiving disabled
Waiting for Jenkins to finish collecting data
[ERROR] Failed to execute goal org.apache.maven.plugins:maven-deploy-plugin:2.8.1:deploy (default-deploy) on project org.apache.sling.testing.samples.integrationtests: Failed to retrieve remote metadata org.apache.sling:org.apache.sling.testing.samples.integrationtests:1.0.7-SNAPSHOT/maven-metadata.xml: Could not transfer metadata org.apache.sling:org.apache.sling.testing.samples.integrationtests:1.0.7-SNAPSHOT/maven-metadata.xml from/to apache.snapshots.https (https://repository.apache.org/content/repositories/snapshots): Failed to transfer file: https://repository.apache.org/content/repositories/snapshots/org/apache/sling/org.apache.sling.testing.samples.integrationtests/1.0.7-SNAPSHOT/maven-metadata.xml. Return code is: 503 , ReasonPhrase:Service Temporarily Unavailable. -> [Help 1]
[ERROR] 
[ERROR] To see the full stack trace of the errors, re-run Maven with the -e switch.
[ERROR] Re-run Maven using the -X switch to enable full debug logging.
[ERROR] 
[ERROR] For more information about the errors and possible solutions, please read the following articles:
[ERROR] [Help 1] http://cwiki.apache.org/confluence/display/MAVEN/MojoExecutionException
[ERROR] 
[ERROR] After correcting the problems, you can resume the build with the command
[ERROR]   mvn <goals> -rf :org.apache.sling.testing.samples.integrationtests
channel stopped

Jenkins build is still unstable: sling-trunk-1.6 #3262

Posted by Apache Jenkins Server <je...@builds.apache.org>.
See <https://builds.apache.org/job/sling-trunk-1.6/changes>


Jenkins build is still unstable: sling-trunk-1.6 #3261

Posted by Apache Jenkins Server <je...@builds.apache.org>.
See <https://builds.apache.org/job/sling-trunk-1.6/changes>


Jenkins build is unstable: sling-trunk-1.6 #3260

Posted by Apache Jenkins Server <je...@builds.apache.org>.
See <https://builds.apache.org/job/sling-trunk-1.6/3260/changes>


Build failed in Jenkins: sling-trunk-1.6 #3259

Posted by Apache Jenkins Server <je...@builds.apache.org>.
See <https://builds.apache.org/job/sling-trunk-1.6/3259/changes>

Changes:

[cziegeler] SLING-4566 : Get array of namespace prefixes only once

[cziegeler] SLING-4580 : Remove extra null check for metadata

------------------------------------------
[...truncated 932 lines...]
[INFO] Apache Sling JSON Library ......................... SKIPPED
[INFO] Apache Sling SLF4J Implementation (Logback) ....... SKIPPED
[INFO] Apache Sling OSGi LogService Implementation ....... SKIPPED
[INFO] Apache Sling MIME type mapping support ............ SKIPPED
[INFO] Apache Sling Commons OSGi support ................. SKIPPED
[INFO] Apache Sling Scheduler Support .................... SKIPPED
[INFO] Apache Sling Testing Utilities .................... SKIPPED
[INFO] Apache Sling Thread Dumper ........................ SKIPPED
[INFO] Apache Sling Thread Support ....................... SKIPPED
[INFO] Apache Sling Authentication Service ............... SKIPPED
[INFO] Apache Sling Form Based Authentication Handler .... SKIPPED
[INFO] Apache Sling Engine Implementation ................ SKIPPED
[INFO] Apache Sling Repository API Bundle ................ SKIPPED
[INFO] Apache Sling Testing JCR Mock ..................... SKIPPED
[INFO] Apache Sling JCR Base Bundle ...................... SKIPPED
[INFO] Apache Sling JCR ClassLoader ...................... SKIPPED
[INFO] Apache Sling Initial Content Loader ............... SKIPPED
[INFO] Apache Sling Jackrabbit Embedded Repository ....... SKIPPED
[INFO] Apache Sling Jackrabbit UserManager Support ....... SKIPPED
[INFO] Apache Sling Jackrabbit JSR-283 Access Control Manager Support  SKIPPED
[INFO] Apache Sling Wrapper Bundle for the JCR API ....... SKIPPED
[INFO] Apache Sling JCR Resource Resolver ................ SKIPPED
[INFO] Apache Sling Testing Sling Mock Jackrabbit-based Resource Resolver  SKIPPED
[INFO] Apache Sling Versioning Integration Tests ......... SKIPPED
[INFO] Apache Sling JCR Repository Registration .......... SKIPPED
[INFO] Apache Sling Simple WebDAV Access to repositories . SKIPPED
[INFO] Apache Sling DavEx Access to repositories ......... SKIPPED
[INFO] Apache Sling JCR WebConsole Bundle ................ SKIPPED
[INFO] Apache Sling Oak Repository Server ................ SKIPPED
[INFO] Apache Sling SlingRepository Integration Tests .... SKIPPED
[INFO] Apache Sling Servlet Resolver ..................... SKIPPED
[INFO] Apache Sling Default GET Servlets ................. SKIPPED
[INFO] Apache Sling Default POST Servlets ................ SKIPPED
[INFO] Apache Sling Compat Servlets ...................... SKIPPED
[INFO] Apache Sling Scripting Implementation API ......... SKIPPED
[INFO] Apache Sling Scripting Core implementation ........ SKIPPED
[INFO] Apache Sling Scripting JavaScript Support ......... SKIPPED
[INFO] Apache Sling Scripting JSP Support ................ SKIPPED
[INFO] Apache Sling JSP Tag Library ...................... SKIPPED
[INFO] Apache Sling JSP Standard Tag Library ............. SKIPPED
[INFO] Apache Sling Adapter Manager Implementation ....... SKIPPED
[INFO] Apache Sling Bundle Resource Provider ............. SKIPPED
[INFO] Apache Sling Distributed Event Admin .............. SKIPPED
[INFO] Apache Sling Discovery API ........................ SKIPPED
[INFO] Apache Sling Resource-Based Discovery Service ..... SKIPPED
[INFO] Apache Sling Discovery Support Bundle ............. SKIPPED
[INFO] Apache Sling Discovery Standalone Implementation .. SKIPPED
[INFO] Apache Sling Event Support ........................ SKIPPED
[INFO] Apache Sling Feature Flags ........................ SKIPPED
[INFO] Apache Sling Filesystem Resource Provider ......... SKIPPED
[INFO] Apache Sling javax.activation bundle .............. SKIPPED
[INFO] Apache Sling Service User Mapper .................. SKIPPED
[INFO] Apache Sling Settings ............................. SKIPPED
[INFO] Apache Sling Web Console Branding ................. SKIPPED
[INFO] Apache Sling Web Console Security Provider ........ SKIPPED
[INFO] Apache Sling Explorer ............................. SKIPPED
[INFO] Apache Sling Health Check Core .................... SKIPPED
[INFO] Apache Sling Health Check Annotations ............. SKIPPED
[INFO] Apache Sling Health Check Samples ................. SKIPPED
[INFO] Apache Sling Health Check Support Components ...... SKIPPED
[INFO] Apache Sling Health Check Webconsole Plugin ....... SKIPPED
[INFO] Apache Sling Health Check JUnit Bridge ............ SKIPPED
[INFO] Apache Sling Health Check Integration Tests ....... SKIPPED
[INFO] Apache Sling Health Check Reactor POM ............. SKIPPED
[INFO] Apache Sling Resource Access Security ............. SKIPPED
[INFO] Apache Sling Resource Access Security Integration Tests  SKIPPED
[INFO] Apache Sling Models API ........................... SKIPPED
[INFO] Apache Sling Models Implementation ................ SKIPPED
[INFO] Apache Sling Test Tools ........................... SKIPPED
[INFO] Apache Sling Models Integration Tests ............. SKIPPED
[INFO] Apache Sling JUnit Core ........................... SKIPPED
[INFO] Apache Sling JUnit Scriptable Tests Provider ...... SKIPPED
[INFO] Apache Sling JUnit Health Checks .................. SKIPPED
[INFO] Apache Sling JUnit Remote Tests Runners ........... SKIPPED
[INFO] Apache Sling JUnit Performance .................... SKIPPED
[INFO] Apache Sling Testing Resource Resolver Mock ....... SKIPPED
[INFO] Apache Sling Testing OSGi Mock .................... SKIPPED
[INFO] Apache Sling Testing Sling Mock ................... SKIPPED
[INFO] Apache Sling Pax Exam Utilities ................... SKIPPED
[INFO] Apache Sling Sample Server-Side Tests ............. SKIPPED
[INFO] Apache Sling Failing Server-Side Tests ............ SKIPPED
[INFO] Apache Sling Launchpad Base ....................... SKIPPED
[INFO] Apache Sling Launchpad Application Builder ........ SKIPPED
[INFO] Apache Sling Sample Integration Tests ............. SKIPPED
[INFO] Apache Sling Testing Modules Reactor .............. SKIPPED
[INFO] Apache Sling Installer ............................ SKIPPED
[INFO] Apache Sling Installer WebConsole Plugin .......... SKIPPED
[INFO] Apache Sling File Installer ....................... SKIPPED
[INFO] Apache Sling JCR Installer ........................ SKIPPED
[INFO] Apache Sling Installer Configuration Admin Support  SKIPPED
[INFO] Apache Sling Deployment Package Installer ......... SKIPPED
[INFO] Apache Sling Subsystems Installer ................. SKIPPED
[INFO] Apache Sling Installer Integration Tests .......... SKIPPED
[INFO] Apache Sling Launchpad API ........................ SKIPPED
[INFO] Apache Sling Launchpad Installer .................. SKIPPED
[INFO] Apache Sling Launchpad Content .................... SKIPPED
[INFO] Apache Sling Launchpad Testing Services ........... SKIPPED
[INFO] Apache Sling Launchpad Testing Services WAR ....... SKIPPED
[INFO] Apache Sling Launchpad Testing Fragment Bundle .... SKIPPED
[INFO] Apache Sling Launchpad Test Bundles ............... SKIPPED
[INFO] Apache Sling Integration Tests .................... SKIPPED
[INFO] Apache Sling Launchpad Testing .................... SKIPPED
[INFO] Apache Sling (Builder) ............................ SKIPPED
[INFO] ------------------------------------------------------------------------
[INFO] BUILD FAILURE
[INFO] ------------------------------------------------------------------------
[INFO] Total time: 2:50.596s
[INFO] Finished at: Tue Apr 07 07:32:07 UTC 2015
[INFO] Final Memory: 57M/216M
[INFO] ------------------------------------------------------------------------
[JENKINS] Archiving disabled
[JENKINS] Archiving disabled
[JENKINS] Archiving disabled
[JENKINS] Archiving disabled
[JENKINS] Archiving disabled
[JENKINS] Archiving disabled
[JENKINS] Archiving disabled
[JENKINS] Archiving disabled
[JENKINS] Archiving disabled
[JENKINS] Archiving disabled
[JENKINS] Archiving disabled
[JENKINS] Archiving disabled
[JENKINS] Archiving disabled
[JENKINS] Archiving disabled
[JENKINS] Archiving disabled
[JENKINS] Archiving disabled
[JENKINS] Archiving disabled
[JENKINS] Archiving disabled
[JENKINS] Archiving disabled
[JENKINS] Archiving disabled
[JENKINS] Archiving disabled
[JENKINS] Archiving disabled
[JENKINS] Archiving disabled
[JENKINS] Archiving disabled
[JENKINS] Archiving disabled
[JENKINS] Archiving disabled
[JENKINS] Archiving disabled
[JENKINS] Archiving disabled
[JENKINS] Archiving disabled
[JENKINS] Archiving disabled
[JENKINS] Archiving disabled
[JENKINS] Archiving disabled
[JENKINS] Archiving disabled
[JENKINS] Archiving disabled
[JENKINS] Archiving disabled
[JENKINS] Archiving disabled
[JENKINS] Archiving disabled
[JENKINS] Archiving disabled
[JENKINS] Archiving disabled
[JENKINS] Archiving disabled
[JENKINS] Archiving disabled
[JENKINS] Archiving disabled
[JENKINS] Archiving disabled
[JENKINS] Archiving disabled
[JENKINS] Archiving disabled
[JENKINS] Archiving disabled
[JENKINS] Archiving disabled
[JENKINS] Archiving disabled
[JENKINS] Archiving disabled
[JENKINS] Archiving disabled
[JENKINS] Archiving disabled
[JENKINS] Archiving disabled
[JENKINS] Archiving disabled
[JENKINS] Archiving disabled
[JENKINS] Archiving disabled
[JENKINS] Archiving disabled
[JENKINS] Archiving disabled
[JENKINS] Archiving disabled
[JENKINS] Archiving disabled
[JENKINS] Archiving disabled
[JENKINS] Archiving disabled
[JENKINS] Archiving disabled
[JENKINS] Archiving disabled
[JENKINS] Archiving disabled
[JENKINS] Archiving disabled
[JENKINS] Archiving disabled
[JENKINS] Archiving disabled
[JENKINS] Archiving disabled
[JENKINS] Archiving disabled
[JENKINS] Archiving disabled
[JENKINS] Archiving disabled
[JENKINS] Archiving disabled
[JENKINS] Archiving disabled
[JENKINS] Archiving disabled
[JENKINS] Archiving disabled
[JENKINS] Archiving disabled
[JENKINS] Archiving disabled
[JENKINS] Archiving disabled
[JENKINS] Archiving disabled
[JENKINS] Archiving disabled
[JENKINS] Archiving disabled
[JENKINS] Archiving disabled
[JENKINS] Archiving disabled
[JENKINS] Archiving disabled
[JENKINS] Archiving disabled
[JENKINS] Archiving disabled
[JENKINS] Archiving disabled
[JENKINS] Archiving disabled
[JENKINS] Archiving disabled
[JENKINS] Archiving disabled
[JENKINS] Archiving disabled
[JENKINS] Archiving disabled
[JENKINS] Archiving disabled
[JENKINS] Archiving disabled
[JENKINS] Archiving disabled
[JENKINS] Archiving disabled
[JENKINS] Archiving disabled
[JENKINS] Archiving disabled
[JENKINS] Archiving disabled
[JENKINS] Archiving disabled
[JENKINS] Archiving disabled
[JENKINS] Archiving disabled
[JENKINS] Archiving disabled
[JENKINS] Archiving disabled
[JENKINS] Archiving disabled
[JENKINS] Archiving disabled
[JENKINS] Archiving disabled
[JENKINS] Archiving disabled
[JENKINS] Archiving disabled
[JENKINS] Archiving disabled
[JENKINS] Archiving disabled
[JENKINS] Archiving disabled
[JENKINS] Archiving disabled
[JENKINS] Archiving disabled
[JENKINS] Archiving disabled
[JENKINS] Archiving disabled
[JENKINS] Archiving disabled
[JENKINS] Archiving disabled
[JENKINS] Archiving disabled
[JENKINS] Archiving disabled
[JENKINS] Archiving disabled
[JENKINS] Archiving disabled
[JENKINS] Archiving disabled
[JENKINS] Archiving disabled
[JENKINS] Archiving disabled
[JENKINS] Archiving disabled
[JENKINS] Archiving disabled
Waiting for Jenkins to finish collecting data[ERROR] Failed to execute goal org.apache.maven.plugins:maven-deploy-plugin:2.8.1:deploy (default-deploy) on project maven-jcrocm-plugin: Failed to deploy metadata: Could not transfer metadata org.apache.sling:maven-jcrocm-plugin:2.0.5-SNAPSHOT/maven-metadata.xml from/to apache.snapshots.https (https://repository.apache.org/content/repositories/snapshots): Failed to transfer file: https://repository.apache.org/content/repositories/snapshots/org/apache/sling/maven-jcrocm-plugin/2.0.5-SNAPSHOT/maven-metadata.xml. Return code is: 502, ReasonPhrase: Proxy Error. -> [Help 1]
[ERROR] 
[ERROR] To see the full stack trace of the errors, re-run Maven with the -e switch.
[ERROR] Re-run Maven using the -X switch to enable full debug logging.
[ERROR] 
[ERROR] For more information about the errors and possible solutions, please read the following articles:
[ERROR] [Help 1] http://cwiki.apache.org/confluence/display/MAVEN/MojoExecutionException
[ERROR] 
[ERROR] After correcting the problems, you can resume the build with the command
[ERROR]   mvn <goals> -rf :maven-jcrocm-plugin

channel stopped

Jenkins build is unstable: sling-trunk-1.6 #3258

Posted by Apache Jenkins Server <je...@builds.apache.org>.
See <https://builds.apache.org/job/sling-trunk-1.6/3258/changes>


Build failed in Jenkins: sling-trunk-1.6 #3257

Posted by Apache Jenkins Server <je...@builds.apache.org>.
See <https://builds.apache.org/job/sling-trunk-1.6/3257/changes>

Changes:

[radu] releng: added Sightly to contrib reactor

[radu] SLING-4578 - Incorrect Sightly JS Use-API script dependency resolution

* explicitly check component inheritance when resolving script dependencies
* provided tests for Use API dependency inheritance
* made sure IT are run in the same order on all platforms

------------------------------------------
[...truncated 59913 lines...]
[INFO] Apache Sling JSON Library ......................... SUCCESS [13.750s]
[INFO] Apache Sling SLF4J Implementation (Logback) ....... SUCCESS [40.991s]
[INFO] Apache Sling OSGi LogService Implementation ....... SUCCESS [9.545s]
[INFO] Apache Sling MIME type mapping support ............ SUCCESS [11.162s]
[INFO] Apache Sling Commons OSGi support ................. SUCCESS [10.725s]
[INFO] Apache Sling Scheduler Support .................... SUCCESS [10.040s]
[INFO] Apache Sling Testing Utilities .................... SUCCESS [20.046s]
[INFO] Apache Sling Thread Dumper ........................ SUCCESS [8.804s]
[INFO] Apache Sling Thread Support ....................... SUCCESS [9.537s]
[INFO] Apache Sling Authentication Service ............... SUCCESS [10.531s]
[INFO] Apache Sling Form Based Authentication Handler .... SUCCESS [16.897s]
[INFO] Apache Sling Engine Implementation ................ SUCCESS [24.848s]
[INFO] Apache Sling Repository API Bundle ................ SUCCESS [9.296s]
[INFO] Apache Sling Testing JCR Mock ..................... SUCCESS [11.345s]
[INFO] Apache Sling JCR Base Bundle ...................... SUCCESS [11.578s]
[INFO] Apache Sling JCR ClassLoader ...................... SUCCESS [9.201s]
[INFO] Apache Sling Initial Content Loader ............... SUCCESS [13.651s]
[INFO] Apache Sling Jackrabbit Embedded Repository ....... SUCCESS [29.969s]
[INFO] Apache Sling Jackrabbit UserManager Support ....... SUCCESS [11.885s]
[INFO] Apache Sling Jackrabbit JSR-283 Access Control Manager Support  SUCCESS [12.600s]
[INFO] Apache Sling Wrapper Bundle for the JCR API ....... SUCCESS [15.970s]
[INFO] Apache Sling JCR Resource Resolver ................ SUCCESS [41.846s]
[INFO] Apache Sling Testing Sling Mock Jackrabbit-based Resource Resolver  SUCCESS [23.855s]
[INFO] Apache Sling Versioning Integration Tests ......... SUCCESS [22.406s]
[INFO] Apache Sling JCR Repository Registration .......... SUCCESS [12.062s]
[INFO] Apache Sling Simple WebDAV Access to repositories . SUCCESS [10.030s]
[INFO] Apache Sling DavEx Access to repositories ......... SUCCESS [18.938s]
[INFO] Apache Sling JCR WebConsole Bundle ................ SUCCESS [10.377s]
[INFO] Apache Sling Oak Repository Server ................ SUCCESS [12.440s]
[INFO] Apache Sling SlingRepository Integration Tests .... SUCCESS [1:09.027s]
[INFO] Apache Sling Servlet Resolver ..................... SUCCESS [18.058s]
[INFO] Apache Sling Default GET Servlets ................. SUCCESS [12.080s]
[INFO] Apache Sling Default POST Servlets ................ SUCCESS [13.509s]
[INFO] Apache Sling Compat Servlets ...................... SUCCESS [15.598s]
[INFO] Apache Sling Scripting Implementation API ......... SUCCESS [8.879s]
[INFO] Apache Sling Scripting Core implementation ........ SUCCESS [23.195s]
[INFO] Apache Sling Scripting JavaScript Support ......... SUCCESS [19.554s]
[INFO] Apache Sling Scripting JSP Support ................ SUCCESS [14.947s]
[INFO] Apache Sling JSP Tag Library ...................... SUCCESS [14.273s]
[INFO] Apache Sling JSP Standard Tag Library ............. SUCCESS [9.439s]
[INFO] Apache Sling Adapter Manager Implementation ....... SUCCESS [11.859s]
[INFO] Apache Sling Bundle Resource Provider ............. SUCCESS [10.580s]
[INFO] Apache Sling Distributed Event Admin .............. SUCCESS [11.366s]
[INFO] Apache Sling Discovery API ........................ SUCCESS [9.035s]
[INFO] Apache Sling Resource-Based Discovery Service ..... SUCCESS [4:32.098s]
[INFO] Apache Sling Discovery Support Bundle ............. SUCCESS [8.626s]
[INFO] Apache Sling Discovery Standalone Implementation .. SUCCESS [8.531s]
[INFO] Apache Sling Event Support ........................ SUCCESS [12:13.815s]
[INFO] Apache Sling Feature Flags ........................ SUCCESS [10.148s]
[INFO] Apache Sling Filesystem Resource Provider ......... SUCCESS [8.975s]
[INFO] Apache Sling javax.activation bundle .............. SUCCESS [11.939s]
[INFO] Apache Sling Service User Mapper .................. SUCCESS [11.053s]
[INFO] Apache Sling Settings ............................. SUCCESS [9.821s]
[INFO] Apache Sling Web Console Branding ................. SUCCESS [9.140s]
[INFO] Apache Sling Web Console Security Provider ........ SUCCESS [9.845s]
[INFO] Apache Sling Explorer ............................. SUCCESS [11.925s]
[INFO] Apache Sling Health Check Core .................... SUCCESS [15.807s]
[INFO] Apache Sling Health Check Annotations ............. SUCCESS [9.095s]
[INFO] Apache Sling Health Check Samples ................. SUCCESS [13.209s]
[INFO] Apache Sling Health Check Support Components ...... SUCCESS [10.465s]
[INFO] Apache Sling Health Check Webconsole Plugin ....... SUCCESS [8.863s]
[INFO] Apache Sling Health Check JUnit Bridge ............ SUCCESS [10.029s]
[INFO] Apache Sling Health Check Integration Tests ....... SUCCESS [33.909s]
[INFO] Apache Sling Health Check Reactor POM ............. SUCCESS [4.799s]
[INFO] Apache Sling Resource Access Security ............. SUCCESS [9.624s]
[INFO] Apache Sling Resource Access Security Integration Tests  SUCCESS [36.960s]
[INFO] Apache Sling Models API ........................... SUCCESS [10.399s]
[INFO] Apache Sling Models Implementation ................ FAILURE [0.681s]
[INFO] Apache Sling Test Tools ........................... SKIPPED
[INFO] Apache Sling Models Integration Tests ............. SKIPPED
[INFO] Apache Sling JUnit Core ........................... SKIPPED
[INFO] Apache Sling JUnit Scriptable Tests Provider ...... SKIPPED
[INFO] Apache Sling JUnit Health Checks .................. SKIPPED
[INFO] Apache Sling JUnit Remote Tests Runners ........... SKIPPED
[INFO] Apache Sling JUnit Performance .................... SKIPPED
[INFO] Apache Sling Testing Resource Resolver Mock ....... SKIPPED
[INFO] Apache Sling Testing OSGi Mock .................... SKIPPED
[INFO] Apache Sling Testing Sling Mock ................... SKIPPED
[INFO] Apache Sling Pax Exam Utilities ................... SKIPPED
[INFO] Apache Sling Sample Server-Side Tests ............. SKIPPED
[INFO] Apache Sling Failing Server-Side Tests ............ SKIPPED
[INFO] Apache Sling Launchpad Base ....................... SKIPPED
[INFO] Apache Sling Launchpad Application Builder ........ SKIPPED
[INFO] Apache Sling Sample Integration Tests ............. SKIPPED
[INFO] Apache Sling Testing Modules Reactor .............. SKIPPED
[INFO] Apache Sling Installer ............................ SKIPPED
[INFO] Apache Sling Installer WebConsole Plugin .......... SKIPPED
[INFO] Apache Sling File Installer ....................... SKIPPED
[INFO] Apache Sling JCR Installer ........................ SKIPPED
[INFO] Apache Sling Installer Configuration Admin Support  SKIPPED
[INFO] Apache Sling Deployment Package Installer ......... SKIPPED
[INFO] Apache Sling Subsystems Installer ................. SKIPPED
[INFO] Apache Sling Installer Integration Tests .......... SKIPPED
[INFO] Apache Sling Launchpad API ........................ SKIPPED
[INFO] Apache Sling Launchpad Installer .................. SKIPPED
[INFO] Apache Sling Launchpad Content .................... SKIPPED
[INFO] Apache Sling Launchpad Testing Services ........... SKIPPED
[INFO] Apache Sling Launchpad Testing Services WAR ....... SKIPPED
[INFO] Apache Sling Launchpad Testing Fragment Bundle .... SKIPPED
[INFO] Apache Sling Launchpad Test Bundles ............... SKIPPED
[INFO] Apache Sling Integration Tests .................... SKIPPED
[INFO] Apache Sling Launchpad Testing .................... SKIPPED
[INFO] Apache Sling (Builder) ............................ SKIPPED
[INFO] ------------------------------------------------------------------------
[INFO] BUILD FAILURE
[INFO] ------------------------------------------------------------------------
[INFO] Total time: 40:58.240s
[INFO] Finished at: Mon Apr 06 21:52:04 UTC 2015
[INFO] Final Memory: 136M/336M
[INFO] ------------------------------------------------------------------------
[JENKINS] Archiving disabled
[JENKINS] Archiving disabled
[JENKINS] Archiving disabled
[JENKINS] Archiving disabled
[JENKINS] Archiving disabled
[JENKINS] Archiving disabled
[JENKINS] Archiving disabled
[JENKINS] Archiving disabled
[JENKINS] Archiving disabled
[JENKINS] Archiving disabled
[JENKINS] Archiving disabled
[JENKINS] Archiving disabled
[JENKINS] Archiving disabled
[JENKINS] Archiving disabled
[JENKINS] Archiving disabled
[JENKINS] Archiving disabled
[JENKINS] Archiving disabled
[JENKINS] Archiving disabled
[JENKINS] Archiving disabled
[JENKINS] Archiving disabled
[JENKINS] Archiving disabled
[JENKINS] Archiving disabled
[JENKINS] Archiving disabled
[JENKINS] Archiving disabled
[JENKINS] Archiving disabled
[JENKINS] Archiving disabled
[JENKINS] Archiving disabled
[JENKINS] Archiving disabled
[JENKINS] Archiving disabled
[JENKINS] Archiving disabled
[JENKINS] Archiving disabled
[JENKINS] Archiving disabled
[JENKINS] Archiving disabled
[JENKINS] Archiving disabled
[JENKINS] Archiving disabled
[JENKINS] Archiving disabled
[JENKINS] Archiving disabled
[JENKINS] Archiving disabled
[JENKINS] Archiving disabled
[JENKINS] Archiving disabled
[JENKINS] Archiving disabled
[JENKINS] Archiving disabled
[JENKINS] Archiving disabled
[JENKINS] Archiving disabled
[JENKINS] Archiving disabled
[JENKINS] Archiving disabled
[JENKINS] Archiving disabled
[JENKINS] Archiving disabled
[JENKINS] Archiving disabled
[JENKINS] Archiving disabled
[JENKINS] Archiving disabled
[JENKINS] Archiving disabled
[JENKINS] Archiving disabled
[JENKINS] Archiving disabled
[JENKINS] Archiving disabled
[JENKINS] Archiving disabled
[JENKINS] Archiving disabled
[JENKINS] Archiving disabled
[JENKINS] Archiving disabled
[JENKINS] Archiving disabled
[JENKINS] Archiving disabled
[JENKINS] Archiving disabled
[JENKINS] Archiving disabled
[JENKINS] Archiving disabled
[JENKINS] Archiving disabled
[JENKINS] Archiving disabled
[JENKINS] Archiving disabled
[JENKINS] Archiving disabled
[JENKINS] Archiving disabled
[JENKINS] Archiving disabled
[JENKINS] Archiving disabled
[JENKINS] Archiving disabled
[JENKINS] Archiving disabled
[JENKINS] Archiving disabled
[JENKINS] Archiving disabled
[JENKINS] Archiving disabled
[JENKINS] Archiving disabled
[JENKINS] Archiving disabled
[JENKINS] Archiving disabled
[JENKINS] Archiving disabled
[JENKINS] Archiving disabled
[JENKINS] Archiving disabled
[JENKINS] Archiving disabled
[JENKINS] Archiving disabled
[JENKINS] Archiving disabled
[JENKINS] Archiving disabled
[JENKINS] Archiving disabled
[JENKINS] Archiving disabled
[JENKINS] Archiving disabled
[JENKINS] Archiving disabled
[JENKINS] Archiving disabled
[JENKINS] Archiving disabled
[JENKINS] Archiving disabled
[JENKINS] Archiving disabled
[JENKINS] Archiving disabled
[JENKINS] Archiving disabled
[JENKINS] Archiving disabled
[JENKINS] Archiving disabled
[JENKINS] Archiving disabled
[JENKINS] Archiving disabled
[JENKINS] Archiving disabled
[JENKINS] Archiving disabled
[JENKINS] Archiving disabled
[JENKINS] Archiving disabled
[JENKINS] Archiving disabled
[JENKINS] Archiving disabled
[JENKINS] Archiving disabled
[JENKINS] Archiving disabled
[JENKINS] Archiving disabled
[JENKINS] Archiving disabled
[JENKINS] Archiving disabled
[JENKINS] Archiving disabled
[JENKINS] Archiving disabled
[JENKINS] Archiving disabled
[JENKINS] Archiving disabled
[JENKINS] Archiving disabled
[JENKINS] Archiving disabled
[JENKINS] Archiving disabled
[JENKINS] Archiving disabled
[JENKINS] Archiving disabled
[JENKINS] Archiving disabled
[JENKINS] Archiving disabled
[JENKINS] Archiving disabled
[JENKINS] Archiving disabled
[JENKINS] Archiving disabled
[JENKINS] Archiving disabled
[JENKINS] Archiving disabled
Waiting for Jenkins to finish collecting data
[ERROR] Failed to execute goal on project org.apache.sling.models.impl: Could not resolve dependencies for project org.apache.sling:org.apache.sling.models.impl:bundle:1.1.1-SNAPSHOT: Could not find artifact org.apache.sling:org.apache.sling.scripting.sightly:jar:1.0.0-SNAPSHOT in Nexus (http://repository.apache.org/snapshots) -> [Help 1]
[ERROR] 
[ERROR] To see the full stack trace of the errors, re-run Maven with the -e switch.
[ERROR] Re-run Maven using the -X switch to enable full debug logging.
[ERROR] 
[ERROR] For more information about the errors and possible solutions, please read the following articles:
[ERROR] [Help 1] http://cwiki.apache.org/confluence/display/MAVEN/DependencyResolutionException
[ERROR] 
[ERROR] After correcting the problems, you can resume the build with the command
[ERROR]   mvn <goals> -rf :org.apache.sling.models.impl
channel stopped

Re: Build failed in Jenkins: sling-trunk-1.6 #3256

Posted by Konrad Windszus <ko...@gmx.de>.
I just committed a potential fix for that. It seems that the Sightly 1.0.0-SNAPSHOT is no longer available (since now we do have a 1.0.0 release and a newer SNAPSHOT). Obviously the Apache repo will remove old SNAPSHOT versions. I therefore now rely on Sightly 1.0.0 until the proper fix for SLING-4447 is implemented.
Sorry for that.
Konrad

> Am 07.04.2015 um 09:14 schrieb Robert Munteanu <ro...@lmn.ro>:
> 
> Hi Sandro,
> 
> I strongly suspect the failure is unrelated to your checkin.
> 
> Robert
> 
> On Tue, Apr 7, 2015 at 10:09 AM, Sandro Boehme <sa...@gmx.de> wrote:
>> Hi,
>> 
>> ok the build is not broken anymore. Just in time to leave Germany to fly to
>> Dubai in <2h :-).
>> 
>> Best,
>> 
>> Sandro
>> 
>> Am 07.04.15 um 06:59 schrieb Sandro Boehme:
>> 
>>> Hi,
>>> 
>>> I reverted my changes in 'r1671740' and hope it fixes the build.
>>> 
>>> Best,
>>> 
>>> Sandro
>>> 
>>> Am 06.04.15 um 22:14 schrieb Sandro Boehme:
>>>> 
>>>> Hi,
>>>> 
>>>> somehow I managed to break the build of 'sling-trunk-1.6' by checking
>>>> something in to 'contrib/explorers/resourceeditor'. From what I
>>>> understand it should not have a dependency to that build, right?
>>>> It looks like an integration test of the Event Support project failed.
>>>> But I cannot reproduce it.
>>>> The failsafe plugin version has been updated at a commit before but the
>>>> build was blue.
>>>> Does someone have a pointer? The problem is, that I will probably have
>>>> no or not a good internet connection during the next 8 days. I will do
>>>> my best to fix it. I guess I will not commit short before a vacation
>>>> again.
>>>> 
>>>> Best,
>>>> 
>>>> Sandro
>>>> 
>>>> Am 06.04.15 um 20:29 schrieb Apache Jenkins Server:
>>>>> 
>>>>> [ERROR] Failed to execute goal
>>>>> org.apache.maven.plugins:maven-failsafe-plugin:2.16:integration-test
>>>>> (default) on project org.apache.sling.event: Execution default of goal
>>>>> org.apache.maven.plugins:maven-failsafe-plugin:2.16:integration-test
>>>>> failed: The forked VM terminated without saying properly goodbye. VM
>>>>> crash or System.exit called ?
>>>>> [ERROR] Command was/bin/sh -c cd
>>>>> 
>>>>> <https://builds.apache.org/job/sling-trunk-1.6/ws/trunk/bundles/extensions/event>
>>>>> 
>>>>> && /home/jenkins/tools/java/jdk1.6.0_45-32/jre/bin/java -Xmx2048m
>>>>> -XX:MaxPermSize=512m -jar
>>>>> 
>>>>> <https://builds.apache.org/job/sling-trunk-1.6/ws/trunk/bundles/extensions/event/target/surefire/surefirebooter8966558270306960395.jar>
>>>>> 
>>>>> 
>>>>> <https://builds.apache.org/job/sling-trunk-1.6/ws/trunk/bundles/extensions/event/target/surefire/surefire4336694494544216414tmp>
>>>>> 
>>>>> 
>>>>> <https://builds.apache.org/job/sling-trunk-1.6/ws/trunk/bundles/extensions/event/target/surefire/surefire_23694121237566832733tmp>
>>>>> 
>>>>> 
>>>> 
>>>> 
>>> 
>>> 
>> 
> 
> 
> 
> -- 
> Sent from my (old) computer


Re: Build failed in Jenkins: sling-trunk-1.6 #3256

Posted by Robert Munteanu <ro...@lmn.ro>.
Hi Sandro,

I strongly suspect the failure is unrelated to your checkin.

Robert

On Tue, Apr 7, 2015 at 10:09 AM, Sandro Boehme <sa...@gmx.de> wrote:
> Hi,
>
> ok the build is not broken anymore. Just in time to leave Germany to fly to
> Dubai in <2h :-).
>
> Best,
>
> Sandro
>
> Am 07.04.15 um 06:59 schrieb Sandro Boehme:
>
>> Hi,
>>
>> I reverted my changes in 'r1671740' and hope it fixes the build.
>>
>> Best,
>>
>> Sandro
>>
>> Am 06.04.15 um 22:14 schrieb Sandro Boehme:
>>>
>>> Hi,
>>>
>>> somehow I managed to break the build of 'sling-trunk-1.6' by checking
>>> something in to 'contrib/explorers/resourceeditor'. From what I
>>> understand it should not have a dependency to that build, right?
>>> It looks like an integration test of the Event Support project failed.
>>> But I cannot reproduce it.
>>> The failsafe plugin version has been updated at a commit before but the
>>> build was blue.
>>> Does someone have a pointer? The problem is, that I will probably have
>>> no or not a good internet connection during the next 8 days. I will do
>>> my best to fix it. I guess I will not commit short before a vacation
>>> again.
>>>
>>> Best,
>>>
>>> Sandro
>>>
>>> Am 06.04.15 um 20:29 schrieb Apache Jenkins Server:
>>>>
>>>> [ERROR] Failed to execute goal
>>>> org.apache.maven.plugins:maven-failsafe-plugin:2.16:integration-test
>>>> (default) on project org.apache.sling.event: Execution default of goal
>>>> org.apache.maven.plugins:maven-failsafe-plugin:2.16:integration-test
>>>> failed: The forked VM terminated without saying properly goodbye. VM
>>>> crash or System.exit called ?
>>>> [ERROR] Command was/bin/sh -c cd
>>>>
>>>> <https://builds.apache.org/job/sling-trunk-1.6/ws/trunk/bundles/extensions/event>
>>>>
>>>> && /home/jenkins/tools/java/jdk1.6.0_45-32/jre/bin/java -Xmx2048m
>>>> -XX:MaxPermSize=512m -jar
>>>>
>>>> <https://builds.apache.org/job/sling-trunk-1.6/ws/trunk/bundles/extensions/event/target/surefire/surefirebooter8966558270306960395.jar>
>>>>
>>>>
>>>> <https://builds.apache.org/job/sling-trunk-1.6/ws/trunk/bundles/extensions/event/target/surefire/surefire4336694494544216414tmp>
>>>>
>>>>
>>>> <https://builds.apache.org/job/sling-trunk-1.6/ws/trunk/bundles/extensions/event/target/surefire/surefire_23694121237566832733tmp>
>>>>
>>>>
>>>
>>>
>>
>>
>



-- 
Sent from my (old) computer

Re: Build failed in Jenkins: sling-trunk-1.6 #3256

Posted by Sandro Boehme <sa...@gmx.de>.
Hi,

ok the build is not broken anymore. Just in time to leave Germany to fly 
to Dubai in <2h :-).

Best,

Sandro

Am 07.04.15 um 06:59 schrieb Sandro Boehme:
> Hi,
>
> I reverted my changes in 'r1671740' and hope it fixes the build.
>
> Best,
>
> Sandro
>
> Am 06.04.15 um 22:14 schrieb Sandro Boehme:
>> Hi,
>>
>> somehow I managed to break the build of 'sling-trunk-1.6' by checking
>> something in to 'contrib/explorers/resourceeditor'. From what I
>> understand it should not have a dependency to that build, right?
>> It looks like an integration test of the Event Support project failed.
>> But I cannot reproduce it.
>> The failsafe plugin version has been updated at a commit before but the
>> build was blue.
>> Does someone have a pointer? The problem is, that I will probably have
>> no or not a good internet connection during the next 8 days. I will do
>> my best to fix it. I guess I will not commit short before a vacation
>> again.
>>
>> Best,
>>
>> Sandro
>>
>> Am 06.04.15 um 20:29 schrieb Apache Jenkins Server:
>>> [ERROR] Failed to execute goal
>>> org.apache.maven.plugins:maven-failsafe-plugin:2.16:integration-test
>>> (default) on project org.apache.sling.event: Execution default of goal
>>> org.apache.maven.plugins:maven-failsafe-plugin:2.16:integration-test
>>> failed: The forked VM terminated without saying properly goodbye. VM
>>> crash or System.exit called ?
>>> [ERROR] Command was/bin/sh -c cd
>>> <https://builds.apache.org/job/sling-trunk-1.6/ws/trunk/bundles/extensions/event>
>>>
>>> && /home/jenkins/tools/java/jdk1.6.0_45-32/jre/bin/java -Xmx2048m
>>> -XX:MaxPermSize=512m -jar
>>> <https://builds.apache.org/job/sling-trunk-1.6/ws/trunk/bundles/extensions/event/target/surefire/surefirebooter8966558270306960395.jar>
>>>
>>> <https://builds.apache.org/job/sling-trunk-1.6/ws/trunk/bundles/extensions/event/target/surefire/surefire4336694494544216414tmp>
>>>
>>> <https://builds.apache.org/job/sling-trunk-1.6/ws/trunk/bundles/extensions/event/target/surefire/surefire_23694121237566832733tmp>
>>>
>>>
>>
>>
>
>


Re: Build failed in Jenkins: sling-trunk-1.6 #3256

Posted by Sandro Boehme <sa...@gmx.de>.
Hi,

I reverted my changes in 'r1671740' and hope it fixes the build.

Best,

Sandro

Am 06.04.15 um 22:14 schrieb Sandro Boehme:
> Hi,
>
> somehow I managed to break the build of 'sling-trunk-1.6' by checking
> something in to 'contrib/explorers/resourceeditor'. From what I
> understand it should not have a dependency to that build, right?
> It looks like an integration test of the Event Support project failed.
> But I cannot reproduce it.
> The failsafe plugin version has been updated at a commit before but the
> build was blue.
> Does someone have a pointer? The problem is, that I will probably have
> no or not a good internet connection during the next 8 days. I will do
> my best to fix it. I guess I will not commit short before a vacation again.
>
> Best,
>
> Sandro
>
> Am 06.04.15 um 20:29 schrieb Apache Jenkins Server:
>> [ERROR] Failed to execute goal
>> org.apache.maven.plugins:maven-failsafe-plugin:2.16:integration-test
>> (default) on project org.apache.sling.event: Execution default of goal
>> org.apache.maven.plugins:maven-failsafe-plugin:2.16:integration-test
>> failed: The forked VM terminated without saying properly goodbye. VM
>> crash or System.exit called ?
>> [ERROR] Command was/bin/sh -c cd
>> <https://builds.apache.org/job/sling-trunk-1.6/ws/trunk/bundles/extensions/event>
>> && /home/jenkins/tools/java/jdk1.6.0_45-32/jre/bin/java -Xmx2048m
>> -XX:MaxPermSize=512m -jar
>> <https://builds.apache.org/job/sling-trunk-1.6/ws/trunk/bundles/extensions/event/target/surefire/surefirebooter8966558270306960395.jar>
>> <https://builds.apache.org/job/sling-trunk-1.6/ws/trunk/bundles/extensions/event/target/surefire/surefire4336694494544216414tmp>
>> <https://builds.apache.org/job/sling-trunk-1.6/ws/trunk/bundles/extensions/event/target/surefire/surefire_23694121237566832733tmp>
>>
>
>


Re: Build failed in Jenkins: sling-trunk-1.6 #3256

Posted by Sandro Boehme <sa...@gmx.de>.
Hi,

somehow I managed to break the build of 'sling-trunk-1.6' by checking 
something in to 'contrib/explorers/resourceeditor'. From what I 
understand it should not have a dependency to that build, right?
It looks like an integration test of the Event Support project failed. 
But I cannot reproduce it.
The failsafe plugin version has been updated at a commit before but the 
build was blue.
Does someone have a pointer? The problem is, that I will probably have 
no or not a good internet connection during the next 8 days. I will do 
my best to fix it. I guess I will not commit short before a vacation again.

Best,

Sandro

Am 06.04.15 um 20:29 schrieb Apache Jenkins Server:
> [ERROR] Failed to execute goal org.apache.maven.plugins:maven-failsafe-plugin:2.16:integration-test (default) on project org.apache.sling.event: Execution default of goal org.apache.maven.plugins:maven-failsafe-plugin:2.16:integration-test failed: The forked VM terminated without saying properly goodbye. VM crash or System.exit called ?
> [ERROR] Command was/bin/sh -c cd <https://builds.apache.org/job/sling-trunk-1.6/ws/trunk/bundles/extensions/event> && /home/jenkins/tools/java/jdk1.6.0_45-32/jre/bin/java -Xmx2048m -XX:MaxPermSize=512m -jar <https://builds.apache.org/job/sling-trunk-1.6/ws/trunk/bundles/extensions/event/target/surefire/surefirebooter8966558270306960395.jar> <https://builds.apache.org/job/sling-trunk-1.6/ws/trunk/bundles/extensions/event/target/surefire/surefire4336694494544216414tmp> <https://builds.apache.org/job/sling-trunk-1.6/ws/trunk/bundles/extensions/event/target/surefire/surefire_23694121237566832733tmp>