You are viewing a plain text version of this content. The canonical link for it is here.
Posted to builds@mesos.apache.org by Apache Jenkins Server <je...@builds.apache.org> on 2016/10/28 13:06:25 UTC
Build failed in Jenkins: mesos-reviewbot #15854
See <https://builds.apache.org/job/mesos-reviewbot/15854/>
------------------------------------------
[...truncated 219547 lines...]
I1028 13:05:39.783325 29450 slave.cpp:208] Mesos agent started on (636)@172.17.0.2:50703
I1028 13:05:39.783357 29450 slave.cpp:209] Flags at startup: --acls="" --appc_simple_discovery_uri_prefix="http://" --appc_store_dir="/tmp/mesos/store/appc" --authenticate_http_readonly="true" --authenticate_http_readwrite="true" --authenticatee="crammd5" --authentication_backoff_factor="1secs" --authorizer="local" --cgroups_cpu_enable_pids_and_tids_count="false" --cgroups_enable_cfs="false" --cgroups_hierarchy="/sys/fs/cgroup" --cgroups_limit_swap="false" --cgroups_root="mesos" --container_disk_watch_interval="15secs" --containerizers="mesos" --credential="/tmp/Endpoint_SlaveEndpointTest_AuthorizedRequest_1_HXprcq/credential" --default_role="*" --disk_watch_interval="1mins" --docker="docker" --docker_kill_orphans="true" --docker_registry="https://registry-1.docker.io" --docker_remove_delay="6hrs" --docker_socket="/var/run/docker.sock" --docker_stop_timeout="0ns" --docker_store_dir="/tmp/mesos/store/docker" --docker_volume_checkpoint_dir="/var/run/mesos/isolators/docker/volume" --enforce_container_disk_quota="false" --executor_registration_timeout="1mins" --executor_shutdown_grace_period="5secs" --fetcher_cache_dir="/tmp/Endpoint_SlaveEndpointTest_AuthorizedRequest_1_HXprcq/fetch" --fetcher_cache_size="2GB" --frameworks_home="" --gc_delay="1weeks" --gc_disk_headroom="0.1" --hadoop_home="" --help="false" --hostname_lookup="true" --http_authenticators="basic" --http_command_executor="false" --http_credentials="/tmp/Endpoint_SlaveEndpointTest_AuthorizedRequest_1_HXprcq/http_credentials" --image_provisioner_backend="copy" --initialize_driver_logging="true" --isolation="posix/cpu,posix/mem" --launcher="posix" --launcher_dir="/mesos/mesos-1.2.0/_build/src" --logbufsecs="0" --logging_level="INFO" --max_completed_executors_per_framework="150" --oversubscribed_resources_interval="15secs" --perf_duration="10secs" --perf_interval="1mins" --qos_correction_interval_min="0ns" --quiet="false" --recover="reconnect" --recovery_timeout="15mins" --registration_backoff_factor="10ms" --resources="cpus:2;gpus:0;mem:1024;disk:1024;ports:[31000-32000]" --revocable_cpu_low_priority="true" --runtime_dir="/tmp/Endpoint_SlaveEndpointTest_AuthorizedRequest_1_HXprcq" --sandbox_directory="/mnt/mesos/sandbox" --strict="true" --switch_user="true" --systemd_enable_support="true" --systemd_runtime_directory="/run/systemd/system" --version="false" --work_dir="/tmp/Endpoint_SlaveEndpointTest_AuthorizedRequest_1_dGyyV7"
I1028 13:05:39.783897 29450 credentials.hpp:86] Loading credential for authentication from '/tmp/Endpoint_SlaveEndpointTest_AuthorizedRequest_1_HXprcq/credential'
I1028 13:05:39.784025 29450 slave.cpp:346] Agent using credential for: test-principal
I1028 13:05:39.784046 29450 credentials.hpp:37] Loading credentials for authentication from '/tmp/Endpoint_SlaveEndpointTest_AuthorizedRequest_1_HXprcq/http_credentials'
I1028 13:05:39.784271 29450 http.cpp:887] Using default 'basic' HTTP authenticator for realm 'mesos-agent-readonly'
I1028 13:05:39.784405 29450 http.cpp:887] Using default 'basic' HTTP authenticator for realm 'mesos-agent-readwrite'
I1028 13:05:39.785428 29450 slave.cpp:533] Agent resources: cpus(*):2; mem(*):1024; disk(*):1024; ports(*):[31000-32000]
I1028 13:05:39.785500 29450 slave.cpp:541] Agent attributes: [ ]
I1028 13:05:39.785512 29450 slave.cpp:546] Agent hostname: eae5d89ba751
I1028 13:05:39.786612 29440 state.cpp:57] Recovering state from '/tmp/Endpoint_SlaveEndpointTest_AuthorizedRequest_1_dGyyV7/meta'
I1028 13:05:39.786947 29449 status_update_manager.cpp:203] Recovering status update manager
I1028 13:05:39.787240 29437 containerizer.cpp:557] Recovering containerizer
I1028 13:05:39.788472 29441 provisioner.cpp:253] Provisioner recovery complete
I1028 13:05:39.788861 29449 slave.cpp:5399] Finished recovery
I1028 13:05:39.789283 29449 slave.cpp:5573] Querying resource estimator for oversubscribable resources
I1028 13:05:39.789491 29445 slave.cpp:5587] Received oversubscribable resources {} from the resource estimator
I1028 13:05:39.791026 29440 process.cpp:3570] Handling HTTP event for process 'slave(636)' with path: '/slave(636)/monitor/statistics.json'
I1028 13:05:39.791929 29437 http.cpp:839] Authorizing principal 'test-principal' to GET the '/monitor/statistics.json' endpoint
I1028 13:05:39.794996 29444 slave.cpp:787] Agent terminating
[ OK ] Endpoint/SlaveEndpointTest.AuthorizedRequest/1 (24 ms)
[ RUN ] Endpoint/SlaveEndpointTest.AuthorizedRequest/2
I1028 13:05:39.803939 29416 containerizer.cpp:201] Using isolation: posix/cpu,posix/mem,filesystem/posix,network/cni
W1028 13:05:39.804483 29416 backend.cpp:76] Failed to create 'aufs' backend: AufsBackend requires root privileges, but is running as user mesos
W1028 13:05:39.804610 29416 backend.cpp:76] Failed to create 'bind' backend: BindBackend requires root privileges
I1028 13:05:39.807018 29436 slave.cpp:208] Mesos agent started on (637)@172.17.0.2:50703
I1028 13:05:39.807040 29436 slave.cpp:209] Flags at startup: --acls="" --appc_simple_discovery_uri_prefix="http://" --appc_store_dir="/tmp/mesos/store/appc" --authenticate_http_readonly="true" --authenticate_http_readwrite="true" --authenticatee="crammd5" --authentication_backoff_factor="1secs" --authorizer="local" --cgroups_cpu_enable_pids_and_tids_count="false" --cgroups_enable_cfs="false" --cgroups_hierarchy="/sys/fs/cgroup" --cgroups_limit_swap="false" --cgroups_root="mesos" --container_disk_watch_interval="15secs" --containerizers="mesos" --credential="/tmp/Endpoint_SlaveEndpointTest_AuthorizedRequest_2_byJzvB/credential" --default_role="*" --disk_watch_interval="1mins" --docker="docker" --docker_kill_orphans="true" --docker_registry="https://registry-1.docker.io" --docker_remove_delay="6hrs" --docker_socket="/var/run/docker.sock" --docker_stop_timeout="0ns" --docker_store_dir="/tmp/mesos/store/docker" --docker_volume_checkpoint_dir="/var/run/mesos/isolators/docker/volume" --enforce_container_disk_quota="false" --executor_registration_timeout="1mins" --executor_shutdown_grace_period="5secs" --fetcher_cache_dir="/tmp/Endpoint_SlaveEndpointTest_AuthorizedRequest_2_byJzvB/fetch" --fetcher_cache_size="2GB" --frameworks_home="" --gc_delay="1weeks" --gc_disk_headroom="0.1" --hadoop_home="" --help="false" --hostname_lookup="true" --http_authenticators="basic" --http_command_executor="false" --http_credentials="/tmp/Endpoint_SlaveEndpointTest_AuthorizedRequest_2_byJzvB/http_credentials" --image_provisioner_backend="copy" --initialize_driver_logging="true" --isolation="posix/cpu,posix/mem" --launcher="posix" --launcher_dir="/mesos/mesos-1.2.0/_build/src" --logbufsecs="0" --logging_level="INFO" --max_completed_executors_per_framework="150" --oversubscribed_resources_interval="15secs" --perf_duration="10secs" --perf_interval="1mins" --qos_correction_interval_min="0ns" --quiet="false" --recover="reconnect" --recovery_timeout="15mins" --registration_backoff_factor="10ms" --resources="cpus:2;gpus:0;mem:1024;disk:1024;ports:[31000-32000]" --revocable_cpu_low_priority="true" --runtime_dir="/tmp/Endpoint_SlaveEndpointTest_AuthorizedRequest_2_byJzvB" --sandbox_directory="/mnt/mesos/sandbox" --strict="true" --switch_user="true" --systemd_enable_support="true" --systemd_runtime_directory="/run/systemd/system" --version="false" --work_dir="/tmp/Endpoint_SlaveEndpointTest_AuthorizedRequest_2_1XJGaj"
I1028 13:05:39.807667 29436 credentials.hpp:86] Loading credential for authentication from '/tmp/Endpoint_SlaveEndpointTest_AuthorizedRequest_2_byJzvB/credential'
I1028 13:05:39.807844 29436 slave.cpp:346] Agent using credential for: test-principal
I1028 13:05:39.807870 29436 credentials.hpp:37] Loading credentials for authentication from '/tmp/Endpoint_SlaveEndpointTest_AuthorizedRequest_2_byJzvB/http_credentials'
I1028 13:05:39.808145 29436 http.cpp:887] Using default 'basic' HTTP authenticator for realm 'mesos-agent-readonly'
I1028 13:05:39.808267 29436 http.cpp:887] Using default 'basic' HTTP authenticator for realm 'mesos-agent-readwrite'
I1028 13:05:39.809614 29436 slave.cpp:533] Agent resources: cpus(*):2; mem(*):1024; disk(*):1024; ports(*):[31000-32000]
I1028 13:05:39.809689 29436 slave.cpp:541] Agent attributes: [ ]
I1028 13:05:39.809698 29436 slave.cpp:546] Agent hostname: eae5d89ba751
I1028 13:05:39.811424 29443 state.cpp:57] Recovering state from '/tmp/Endpoint_SlaveEndpointTest_AuthorizedRequest_2_1XJGaj/meta'
I1028 13:05:39.811730 29435 status_update_manager.cpp:203] Recovering status update manager
I1028 13:05:39.812108 29447 containerizer.cpp:557] Recovering containerizer
I1028 13:05:39.813877 29449 provisioner.cpp:253] Provisioner recovery complete
I1028 13:05:39.814494 29440 slave.cpp:5399] Finished recovery
I1028 13:05:39.815060 29440 slave.cpp:5573] Querying resource estimator for oversubscribable resources
I1028 13:05:39.815429 29443 slave.cpp:5587] Received oversubscribable resources {} from the resource estimator
I1028 13:05:39.817252 29440 process.cpp:3570] Handling HTTP event for process 'slave(637)' with path: '/slave(637)/containers'
I1028 13:05:39.818248 29449 http.cpp:839] Authorizing principal 'test-principal' to GET the '/containers' endpoint
I1028 13:05:39.822501 29450 slave.cpp:787] Agent terminating
[ OK ] Endpoint/SlaveEndpointTest.AuthorizedRequest/2 (30 ms)
[ RUN ] Endpoint/SlaveEndpointTest.UnauthorizedRequest/0
I1028 13:05:39.835042 29416 containerizer.cpp:201] Using isolation: posix/cpu,posix/mem,filesystem/posix,network/cni
W1028 13:05:39.835808 29416 backend.cpp:76] Failed to create 'aufs' backend: AufsBackend requires root privileges, but is running as user mesos
W1028 13:05:39.836012 29416 backend.cpp:76] Failed to create 'bind' backend: BindBackend requires root privileges
I1028 13:05:39.840152 29441 slave.cpp:208] Mesos agent started on (638)@172.17.0.2:50703
I1028 13:05:39.840180 29441 slave.cpp:209] Flags at startup: --acls="" --appc_simple_discovery_uri_prefix="http://" --appc_store_dir="/tmp/mesos/store/appc" --authenticate_http_readonly="true" --authenticate_http_readwrite="true" --authenticatee="crammd5" --authentication_backoff_factor="1secs" --authorizer="local" --cgroups_cpu_enable_pids_and_tids_count="false" --cgroups_enable_cfs="false" --cgroups_hierarchy="/sys/fs/cgroup" --cgroups_limit_swap="false" --cgroups_root="mesos" --container_disk_watch_interval="15secs" --containerizers="mesos" --credential="/tmp/Endpoint_SlaveEndpointTest_UnauthorizedRequest_0_9TzM7M/credential" --default_role="*" --disk_watch_interval="1mins" --docker="docker" --docker_kill_orphans="true" --docker_registry="https://registry-1.docker.io" --docker_remove_delay="6hrs" --docker_socket="/var/run/docker.sock" --docker_stop_timeout="0ns" --docker_store_dir="/tmp/mesos/store/docker" --docker_volume_checkpoint_dir="/var/run/mesos/isolators/docker/volume" --enforce_container_disk_quota="false" --executor_registration_timeout="1mins" --executor_shutdown_grace_period="5secs" --fetcher_cache_dir="/tmp/Endpoint_SlaveEndpointTest_UnauthorizedRequest_0_9TzM7M/fetch" --fetcher_cache_size="2GB" --frameworks_home="" --gc_delay="1weeks" --gc_disk_headroom="0.1" --hadoop_home="" --help="false" --hostname_lookup="true" --http_authenticators="basic" --http_command_executor="false" --http_credentials="/tmp/Endpoint_SlaveEndpointTest_UnauthorizedRequest_0_9TzM7M/http_credentials" --image_provisioner_backend="copy" --initialize_driver_logging="true" --isolation="posix/cpu,posix/mem" --launcher="posix" --launcher_dir="/mesos/mesos-1.2.0/_build/src" --logbufsecs="0" --logging_level="INFO" --max_completed_executors_per_framework="150" --oversubscribed_resources_interval="15secs" --perf_duration="10secs" --perf_interval="1mins" --qos_correction_interval_min="0ns" --quiet="false" --recover="reconnect" --recovery_timeout="15mins" --registration_backoff_factor="10ms" --resources="cpus:2;gpus:0;mem:1024;disk:1024;ports:[31000-32000]" --revocable_cpu_low_priority="true" --runtime_dir="/tmp/Endpoint_SlaveEndpointTest_UnauthorizedRequest_0_9TzM7M" --sandbox_directory="/mnt/mesos/sandbox" --strict="true" --switch_user="true" --systemd_enable_support="true" --systemd_runtime_directory="/run/systemd/system" --version="false" --work_dir="/tmp/Endpoint_SlaveEndpointTest_UnauthorizedRequest_0_nD6UHu"
I1028 13:05:39.840791 29441 credentials.hpp:86] Loading credential for authentication from '/tmp/Endpoint_SlaveEndpointTest_UnauthorizedRequest_0_9TzM7M/credential'
I1028 13:05:39.840950 29441 slave.cpp:346] Agent using credential for: test-principal
I1028 13:05:39.840976 29441 credentials.hpp:37] Loading credentials for authentication from '/tmp/Endpoint_SlaveEndpointTest_UnauthorizedRequest_0_9TzM7M/http_credentials'
I1028 13:05:39.841239 29441 http.cpp:887] Using default 'basic' HTTP authenticator for realm 'mesos-agent-readonly'
I1028 13:05:39.841413 29441 http.cpp:887] Using default 'basic' HTTP authenticator for realm 'mesos-agent-readwrite'
I1028 13:05:39.842594 29441 slave.cpp:533] Agent resources: cpus(*):2; mem(*):1024; disk(*):1024; ports(*):[31000-32000]
I1028 13:05:39.842666 29441 slave.cpp:541] Agent attributes: [ ]
I1028 13:05:39.842679 29441 slave.cpp:546] Agent hostname: eae5d89ba751
I1028 13:05:39.844162 29450 state.cpp:57] Recovering state from '/tmp/Endpoint_SlaveEndpointTest_UnauthorizedRequest_0_nD6UHu/meta'
I1028 13:05:39.844455 29437 status_update_manager.cpp:203] Recovering status update manager
I1028 13:05:39.844686 29436 containerizer.cpp:557] Recovering containerizer
I1028 13:05:39.845800 29441 provisioner.cpp:253] Provisioner recovery complete
I1028 13:05:39.846132 29447 slave.cpp:5399] Finished recovery
I1028 13:05:39.846616 29447 slave.cpp:5573] Querying resource estimator for oversubscribable resources
I1028 13:05:39.846827 29438 slave.cpp:5587] Received oversubscribable resources {} from the resource estimator
I1028 13:05:39.848587 29438 process.cpp:3570] Handling HTTP event for process 'slave(638)' with path: '/slave(638)/monitor/statistics'
I1028 13:05:39.849684 29443 http.cpp:839] Authorizing principal 'test-principal' to GET the '/monitor/statistics' endpoint
I1028 13:05:39.852730 29443 slave.cpp:787] Agent terminating
[ OK ] Endpoint/SlaveEndpointTest.UnauthorizedRequest/0 (29 ms)
[ RUN ] Endpoint/SlaveEndpointTest.UnauthorizedRequest/1
I1028 13:05:39.865653 29416 containerizer.cpp:201] Using isolation: posix/cpu,posix/mem,filesystem/posix,network/cni
W1028 13:05:39.866369 29416 backend.cpp:76] Failed to create 'aufs' backend: AufsBackend requires root privileges, but is running as user mesos
W1028 13:05:39.866551 29416 backend.cpp:76] Failed to create 'bind' backend: BindBackend requires root privileges
I1028 13:05:39.870337 29436 slave.cpp:208] Mesos agent started on (639)@172.17.0.2:50703
I1028 13:05:39.870364 29436 slave.cpp:209] Flags at startup: --acls="" --appc_simple_discovery_uri_prefix="http://" --appc_store_dir="/tmp/mesos/store/appc" --authenticate_http_readonly="true" --authenticate_http_readwrite="true" --authenticatee="crammd5" --authentication_backoff_factor="1secs" --authorizer="local" --cgroups_cpu_enable_pids_and_tids_count="false" --cgroups_enable_cfs="false" --cgroups_hierarchy="/sys/fs/cgroup" --cgroups_limit_swap="false" --cgroups_root="mesos" --container_disk_watch_interval="15secs" --containerizers="mesos" --credential="/tmp/Endpoint_SlaveEndpointTest_UnauthorizedRequest_1_R7d23Y/credential" --default_role="*" --disk_watch_interval="1mins" --docker="docker" --docker_kill_orphans="true" --docker_registry="https://registry-1.docker.io" --docker_remove_delay="6hrs" --docker_socket="/var/run/docker.sock" --docker_stop_timeout="0ns" --docker_store_dir="/tmp/mesos/store/docker" --docker_volume_checkpoint_dir="/var/run/mesos/isolators/docker/volume" --enforce_container_disk_quota="false" --executor_registration_timeout="1mins" --executor_shutdown_grace_period="5secs" --fetcher_cache_dir="/tmp/Endpoint_SlaveEndpointTest_UnauthorizedRequest_1_R7d23Y/fetch" --fetcher_cache_size="2GB" --frameworks_home="" --gc_delay="1weeks" --gc_disk_headroom="0.1" --hadoop_home="" --help="false" --hostname_lookup="true" --http_authenticators="basic" --http_command_executor="false" --http_credentials="/tmp/Endpoint_SlaveEndpointTest_UnauthorizedRequest_1_R7d23Y/http_credentials" --image_provisioner_backend="copy" --initialize_driver_logging="true" --isolation="posix/cpu,posix/mem" --launcher="posix" --launcher_dir="/mesos/mesos-1.2.0/_build/src" --logbufsecs="0" --logging_level="INFO" --max_completed_executors_per_framework="150" --oversubscribed_resources_interval="15secs" --perf_duration="10secs" --perf_interval="1mins" --qos_correction_interval_min="0ns" --quiet="false" --recover="reconnect" --recovery_timeout="15mins" --registration_backoff_factor="10ms" --resources="cpus:2;gpus:0;mem:1024;disk:1024;ports:[31000-32000]" --revocable_cpu_low_priority="true" --runtime_dir="/tmp/Endpoint_SlaveEndpointTest_UnauthorizedRequest_1_R7d23Y" --sandbox_directory="/mnt/mesos/sandbox" --strict="true" --switch_user="true" --systemd_enable_support="true" --systemd_runtime_directory="/run/systemd/system" --version="false" --work_dir="/tmp/Endpoint_SlaveEndpointTest_UnauthorizedRequest_1_Pl6czG"
I1028 13:05:39.870977 29436 credentials.hpp:86] Loading credential for authentication from '/tmp/Endpoint_SlaveEndpointTest_UnauthorizedRequest_1_R7d23Y/credential'
I1028 13:05:39.871155 29436 slave.cpp:346] Agent using credential for: test-principal
I1028 13:05:39.871181 29436 credentials.hpp:37] Loading credentials for authentication from '/tmp/Endpoint_SlaveEndpointTest_UnauthorizedRequest_1_R7d23Y/http_credentials'
I1028 13:05:39.871470 29436 http.cpp:887] Using default 'basic' HTTP authenticator for realm 'mesos-agent-readonly'
I1028 13:05:39.871618 29436 http.cpp:887] Using default 'basic' HTTP authenticator for realm 'mesos-agent-readwrite'
I1028 13:05:39.873183 29436 slave.cpp:533] Agent resources: cpus(*):2; mem(*):1024; disk(*):1024; ports(*):[31000-32000]
I1028 13:05:39.873281 29436 slave.cpp:541] Agent attributes: [ ]
I1028 13:05:39.873297 29436 slave.cpp:546] Agent hostname: eae5d89ba751
I1028 13:05:39.874980 29439 state.cpp:57] Recovering state from '/tmp/Endpoint_SlaveEndpointTest_UnauthorizedRequest_1_Pl6czG/meta'
I1028 13:05:39.875254 29443 status_update_manager.cpp:203] Recovering status update manager
I1028 13:05:39.875749 29449 containerizer.cpp:557] Recovering containerizer
I1028 13:05:39.877305 29450 provisioner.cpp:253] Provisioner recovery complete
I1028 13:05:39.877867 29439 slave.cpp:5399] Finished recovery
I1028 13:05:39.878453 29439 slave.cpp:5573] Querying resource estimator for oversubscribable resources
I1028 13:05:39.878748 29436 slave.cpp:5587] Received oversubscribable resources {} from the resource estimator
I1028 13:05:39.880899 29447 process.cpp:3570] Handling HTTP event for process 'slave(639)' with path: '/slave(639)/monitor/statistics.json'
I1028 13:05:39.881966 29446 http.cpp:839] Authorizing principal 'test-principal' to GET the '/monitor/statistics.json' endpoint
I1028 13:05:39.885013 29416 slave.cpp:787] Agent terminating
[ OK ] Endpoint/SlaveEndpointTest.UnauthorizedRequest/1 (31 ms)
[ RUN ] Endpoint/SlaveEndpointTest.UnauthorizedRequest/2
I1028 13:05:39.897366 29416 containerizer.cpp:201] Using isolation: posix/cpu,posix/mem,filesystem/posix,network/cni
W1028 13:05:39.898068 29416 backend.cpp:76] Failed to create 'aufs' backend: AufsBackend requires root privileges, but is running as user mesos
W1028 13:05:39.898313 29416 backend.cpp:76] Failed to create 'bind' backend: BindBackend requires root privileges
I1028 13:05:39.901162 29435 slave.cpp:208] Mesos agent started on (640)@172.17.0.2:50703
I1028 13:05:39.901183 29435 slave.cpp:209] Flags at startup: --acls="" --appc_simple_discovery_uri_prefix="http://" --appc_store_dir="/tmp/mesos/store/appc" --authenticate_http_readonly="true" --authenticate_http_readwrite="true" --authenticatee="crammd5" --authentication_backoff_factor="1secs" --authorizer="local" --cgroups_cpu_enable_pids_and_tids_count="false" --cgroups_enable_cfs="false" --cgroups_hierarchy="/sys/fs/cgroup" --cgroups_limit_swap="false" --cgroups_root="mesos" --container_disk_watch_interval="15secs" --containerizers="mesos" --credential="/tmp/Endpoint_SlaveEndpointTest_UnauthorizedRequest_2_3S9Vkb/credential" --default_role="*" --disk_watch_interval="1mins" --docker="docker" --docker_kill_orphans="true" --docker_registry="https://registry-1.docker.io" --docker_remove_delay="6hrs" --docker_socket="/var/run/docker.sock" --docker_stop_timeout="0ns" --docker_store_dir="/tmp/mesos/store/docker" --docker_volume_checkpoint_dir="/var/run/mesos/isolators/docker/volume" --enforce_container_disk_quota="false" --executor_registration_timeout="1mins" --executor_shutdown_grace_period="5secs" --fetcher_cache_dir="/tmp/Endpoint_SlaveEndpointTest_UnauthorizedRequest_2_3S9Vkb/fetch" --fetcher_cache_size="2GB" --frameworks_home="" --gc_delay="1weeks" --gc_disk_headroom="0.1" --hadoop_home="" --help="false" --hostname_lookup="true" --http_authenticators="basic" --http_command_executor="false" --http_credentials="/tmp/Endpoint_SlaveEndpointTest_UnauthorizedRequest_2_3S9Vkb/http_credentials" --image_provisioner_backend="copy" --initialize_driver_logging="true" --isolation="posix/cpu,posix/mem" --launcher="posix" --launcher_dir="/mesos/mesos-1.2.0/_build/src" --logbufsecs="0" --logging_level="INFO" --max_completed_executors_per_framework="150" --oversubscribed_resources_interval="15secs" --perf_duration="10secs" --perf_interval="1mins" --qos_correction_interval_min="0ns" --quiet="false" --recover="reconnect" --recovery_timeout="15mins" --registration_backoff_factor="10ms" --resources="cpus:2;gpus:0;mem:1024;disk:1024;ports:[31000-32000]" --revocable_cpu_low_priority="true" --runtime_dir="/tmp/Endpoint_SlaveEndpointTest_UnauthorizedRequest_2_3S9Vkb" --sandbox_directory="/mnt/mesos/sandbox" --strict="true" --switch_user="true" --systemd_enable_support="true" --systemd_runtime_directory="/run/systemd/system" --version="false" --work_dir="/tmp/Endpoint_SlaveEndpointTest_UnauthorizedRequest_2_flXWKS"
I1028 13:05:39.901567 29435 credentials.hpp:86] Loading credential for authentication from '/tmp/Endpoint_SlaveEndpointTest_UnauthorizedRequest_2_3S9Vkb/credential'
I1028 13:05:39.901681 29435 slave.cpp:346] Agent using credential for: test-principal
I1028 13:05:39.901700 29435 credentials.hpp:37] Loading credentials for authentication from '/tmp/Endpoint_SlaveEndpointTest_UnauthorizedRequest_2_3S9Vkb/http_credentials'
I1028 13:05:39.901942 29435 http.cpp:887] Using default 'basic' HTTP authenticator for realm 'mesos-agent-readonly'
I1028 13:05:39.902051 29435 http.cpp:887] Using default 'basic' HTTP authenticator for realm 'mesos-agent-readwrite'
I1028 13:05:39.903039 29435 slave.cpp:533] Agent resources: cpus(*):2; mem(*):1024; disk(*):1024; ports(*):[31000-32000]
I1028 13:05:39.903110 29435 slave.cpp:541] Agent attributes: [ ]
I1028 13:05:39.903121 29435 slave.cpp:546] Agent hostname: eae5d89ba751
I1028 13:05:39.904655 29449 state.cpp:57] Recovering state from '/tmp/Endpoint_SlaveEndpointTest_UnauthorizedRequest_2_flXWKS/meta'
I1028 13:05:39.904892 29437 status_update_manager.cpp:203] Recovering status update manager
I1028 13:05:39.905129 29439 containerizer.cpp:557] Recovering containerizer
I1028 13:05:39.906195 29435 provisioner.cpp:253] Provisioner recovery complete
I1028 13:05:39.906558 29448 slave.cpp:5399] Finished recovery
I1028 13:05:39.907021 29448 slave.cpp:5573] Querying resource estimator for oversubscribable resources
I1028 13:05:39.907240 29447 slave.cpp:5587] Received oversubscribable resources {} from the resource estimator
I1028 13:05:39.908617 29443 process.cpp:3570] Handling HTTP event for process 'slave(640)' with path: '/slave(640)/containers'
I1028 13:05:39.909375 29440 http.cpp:839] Authorizing principal 'test-principal' to GET the '/containers' endpoint
I1028 13:05:39.911489 29447 slave.cpp:787] Agent terminating
[ OK ] Endpoint/SlaveEndpointTest.UnauthorizedRequest/2 (24 ms)
[ RUN ] Endpoint/SlaveEndpointTest.NoAuthorizer/0
I1028 13:05:39.927812 29416 containerizer.cpp:201] Using isolation: posix/cpu,posix/mem,filesystem/posix,network/cni
W1028 13:05:39.928598 29416 backend.cpp:76] Failed to create 'aufs' backend: AufsBackend requires root privileges, but is running as user mesos
W1028 13:05:39.928767 29416 backend.cpp:76] Failed to create 'bind' backend: BindBackend requires root privileges
I1028 13:05:39.930335 29416 cluster.cpp:435] Creating default 'local' authorizer
I1028 13:05:39.932277 29443 slave.cpp:208] Mesos agent started on (641)@172.17.0.2:50703
I1028 13:05:39.932308 29443 slave.cpp:209] Flags at startup: --acls="" --appc_simple_discovery_uri_prefix="http://" --appc_store_dir="/tmp/mesos/store/appc" --authenticate_http_readonly="true" --authenticate_http_readwrite="true" --authenticatee="crammd5" --authentication_backoff_factor="1secs" --authorizer="local" --cgroups_cpu_enable_pids_and_tids_count="false" --cgroups_enable_cfs="false" --cgroups_hierarchy="/sys/fs/cgroup" --cgroups_limit_swap="false" --cgroups_root="mesos" --container_disk_watch_interval="15secs" --containerizers="mesos" --credential="/tmp/Endpoint_SlaveEndpointTest_NoAuthorizer_0_jBa7Un/credential" --default_role="*" --disk_watch_interval="1mins" --docker="docker" --docker_kill_orphans="true" --docker_registry="https://registry-1.docker.io" --docker_remove_delay="6hrs" --docker_socket="/var/run/docker.sock" --docker_stop_timeout="0ns" --docker_store_dir="/tmp/mesos/store/docker" --docker_volume_checkpoint_dir="/var/run/mesos/isolators/docker/volume" --enforce_container_disk_quota="false" --executor_registration_timeout="1mins" --executor_shutdown_grace_period="5secs" --fetcher_cache_dir="/tmp/Endpoint_SlaveEndpointTest_NoAuthorizer_0_jBa7Un/fetch" --fetcher_cache_size="2GB" --frameworks_home="" --gc_delay="1weeks" --gc_disk_headroom="0.1" --hadoop_home="" --help="false" --hostname_lookup="true" --http_authenticators="basic" --http_command_executor="false" --http_credentials="/tmp/Endpoint_SlaveEndpointTest_NoAuthorizer_0_jBa7Un/http_credentials" --image_provisioner_backend="copy" --initialize_driver_logging="true" --isolation="posix/cpu,posix/mem" --launcher="posix" --launcher_dir="/mesos/mesos-1.2.0/_build/src" --logbufsecs="0" --logging_level="INFO" --max_completed_executors_per_framework="150" --oversubscribed_resources_interval="15secs" --perf_duration="10secs" --perf_interval="1mins" --qos_correction_interval_min="0ns" --quiet="false" --recover="reconnect" --recovery_timeout="15mins" --registration_backoff_factor="10ms" --resources="cpus:2;gpus:0;mem:1024;disk:1024;ports:[31000-32000]" --revocable_cpu_low_priority="true" --runtime_dir="/tmp/Endpoint_SlaveEndpointTest_NoAuthorizer_0_jBa7Un" --sandbox_directory="/mnt/mesos/sandbox" --strict="true" --switch_user="true" --systemd_enable_support="true" --systemd_runtime_directory="/run/systemd/system" --version="false" --work_dir="/tmp/Endpoint_SlaveEndpointTest_NoAuthorizer_0_3RSfg5"
I1028 13:05:39.932996 29443 credentials.hpp:86] Loading credential for authentication from '/tmp/Endpoint_SlaveEndpointTest_NoAuthorizer_0_jBa7Un/credential'
I1028 13:05:39.933159 29443 slave.cpp:346] Agent using credential for: test-principal
I1028 13:05:39.933188 29443 credentials.hpp:37] Loading credentials for authentication from '/tmp/Endpoint_SlaveEndpointTest_NoAuthorizer_0_jBa7Un/http_credentials'
I1028 13:05:39.933490 29443 http.cpp:887] Using default 'basic' HTTP authenticator for realm 'mesos-agent-readonly'
I1028 13:05:39.933651 29443 http.cpp:887] Using default 'basic' HTTP authenticator for realm 'mesos-agent-readwrite'
I1028 13:05:39.934998 29443 slave.cpp:533] Agent resources: cpus(*):2; mem(*):1024; disk(*):1024; ports(*):[31000-32000]
I1028 13:05:39.935097 29443 slave.cpp:541] Agent attributes: [ ]
I1028 13:05:39.935114 29443 slave.cpp:546] Agent hostname: eae5d89ba751
I1028 13:05:39.936801 29437 state.cpp:57] Recovering state from '/tmp/Endpoint_SlaveEndpointTest_NoAuthorizer_0_3RSfg5/meta'
I1028 13:05:39.937363 29446 status_update_manager.cpp:203] Recovering status update manager
I1028 13:05:39.937644 29450 containerizer.cpp:557] Recovering containerizer
I1028 13:05:39.939208 29444 provisioner.cpp:253] Provisioner recovery complete
I1028 13:05:39.939735 29450 slave.cpp:5399] Finished recovery
I1028 13:05:39.940444 29450 slave.cpp:5573] Querying resource estimator for oversubscribable resources
I1028 13:05:39.940721 29444 slave.cpp:5587] Received oversubscribable resources {} from the resource estimator
I1028 13:05:39.942569 29448 process.cpp:3570] Handling HTTP event for process 'slave(641)' with path: '/slave(641)/monitor/statistics'
I1028 13:05:39.943922 29448 http.cpp:839] Authorizing principal 'test-principal' to GET the '/monitor/statistics' endpoint
I1028 13:05:39.948006 29447 slave.cpp:787] Agent terminating
[ OK ] Endpoint/SlaveEndpointTest.NoAuthorizer/0 (31 ms)
[ RUN ] Endpoint/SlaveEndpointTest.NoAuthorizer/1
I1028 13:05:39.961179 29416 containerizer.cpp:201] Using isolation: posix/cpu,posix/mem,filesystem/posix,network/cni
W1028 13:05:39.961899 29416 backend.cpp:76] Failed to create 'aufs' backend: AufsBackend requires root privileges, but is running as user mesos
W1028 13:05:39.962065 29416 backend.cpp:76] Failed to create 'bind' backend: BindBackend requires root privileges
I1028 13:05:39.963582 29416 cluster.cpp:435] Creating default 'local' authorizer
I1028 13:05:39.965531 29449 slave.cpp:208] Mesos agent started on (642)@172.17.0.2:50703
I1028 13:05:39.965562 29449 slave.cpp:209] Flags at startup: --acls="" --appc_simple_discovery_uri_prefix="http://" --appc_store_dir="/tmp/mesos/store/appc" --authenticate_http_readonly="true" --authenticate_http_readwrite="true" --authenticatee="crammd5" --authentication_backoff_factor="1secs" --authorizer="local" --cgroups_cpu_enable_pids_and_tids_count="false" --cgroups_enable_cfs="false" --cgroups_hierarchy="/sys/fs/cgroup" --cgroups_limit_swap="false" --cgroups_root="mesos" --container_disk_watch_interval="15secs" --containerizers="mesos" --credential="/tmp/Endpoint_SlaveEndpointTest_NoAuthorizer_1_1NIUQA/credential" --default_role="*" --disk_watch_interval="1mins" --docker="docker" --docker_kill_orphans="true" --docker_registry="https://registry-1.docker.io" --docker_remove_delay="6hrs" --docker_socket="/var/run/docker.sock" --docker_stop_timeout="0ns" --docker_store_dir="/tmp/mesos/store/docker" --docker_volume_checkpoint_dir="/var/run/mesos/isolators/docker/volume" --enforce_container_disk_quota="false" --executor_registration_timeout="1mins" --executor_shutdown_grace_period="5secs" --fetcher_cache_dir="/tmp/Endpoint_SlaveEndpointTest_NoAuthorizer_1_1NIUQA/fetch" --fetcher_cache_size="2GB" --frameworks_home="" --gc_delay="1weeks" --gc_disk_headroom="0.1" --hadoop_home="" --help="false" --hostname_lookup="true" --http_authenticators="basic" --http_command_executor="false" --http_credentials="/tmp/Endpoint_SlaveEndpointTest_NoAuthorizer_1_1NIUQA/http_credentials" --image_provisioner_backend="copy" --initialize_driver_logging="true" --isolation="posix/cpu,posix/mem" --launcher="posix" --launcher_dir="/mesos/mesos-1.2.0/_build/src" --logbufsecs="0" --logging_level="INFO" --max_completed_executors_per_framework="150" --oversubscribed_resources_interval="15secs" --perf_duration="10secs" --perf_interval="1mins" --qos_correction_interval_min="0ns" --quiet="false" --recover="reconnect" --recovery_timeout="15mins" --registration_backoff_factor="10ms" --resources="cpus:2;gpus:0;mem:1024;disk:1024;ports:[31000-32000]" --revocable_cpu_low_priority="true" --runtime_dir="/tmp/Endpoint_SlaveEndpointTest_NoAuthorizer_1_1NIUQA" --sandbox_directory="/mnt/mesos/sandbox" --strict="true" --switch_user="true" --systemd_enable_support="true" --systemd_runtime_directory="/run/systemd/system" --version="false" --work_dir="/tmp/Endpoint_SlaveEndpointTest_NoAuthorizer_1_1aiE6h"
I1028 13:05:39.966174 29449 credentials.hpp:86] Loading credential for authentication from '/tmp/Endpoint_SlaveEndpointTest_NoAuthorizer_1_1NIUQA/credential'
I1028 13:05:39.966333 29449 slave.cpp:346] Agent using credential for: test-principal
I1028 13:05:39.966359 29449 credentials.hpp:37] Loading credentials for authentication from '/tmp/Endpoint_SlaveEndpointTest_NoAuthorizer_1_1NIUQA/http_credentials'
I1028 13:05:39.966634 29449 http.cpp:887] Using default 'basic' HTTP authenticator for realm 'mesos-agent-readonly'
I1028 13:05:39.966810 29449 http.cpp:887] Using default 'basic' HTTP authenticator for realm 'mesos-agent-readwrite'
I1028 13:05:39.968188 29449 slave.cpp:533] Agent resources: cpus(*):2; mem(*):1024; disk(*):1024; ports(*):[31000-32000]
I1028 13:05:39.968287 29449 slave.cpp:541] Agent attributes: [ ]
I1028 13:05:39.968304 29449 slave.cpp:546] Agent hostname: eae5d89ba751
I1028 13:05:39.969738 29436 state.cpp:57] Recovering state from '/tmp/Endpoint_SlaveEndpointTest_NoAuthorizer_1_1aiE6h/meta'
I1028 13:05:39.970047 29445 status_update_manager.cpp:203] Recovering status update manager
I1028 13:05:39.970401 29450 containerizer.cpp:557] Recovering containerizer
I1028 13:05:39.971943 29438 provisioner.cpp:253] Provisioner recovery complete
I1028 13:05:39.972425 29450 slave.cpp:5399] Finished recovery
I1028 13:05:39.972980 29450 slave.cpp:5573] Querying resource estimator for oversubscribable resources
I1028 13:05:39.973304 29447 slave.cpp:5587] Received oversubscribable resources {} from the resource estimator
I1028 13:05:39.975221 29446 process.cpp:3570] Handling HTTP event for process 'slave(642)' with path: '/slave(642)/monitor/statistics.json'
I1028 13:05:39.976222 29444 http.cpp:839] Authorizing principal 'test-principal' to GET the '/monitor/statistics.json' endpoint
I1028 13:05:39.979799 29445 slave.cpp:787] Agent terminating
[ OK ] Endpoint/SlaveEndpointTest.NoAuthorizer/1 (30 ms)
[ RUN ] Endpoint/SlaveEndpointTest.NoAuthorizer/2
I1028 13:05:39.991436 29416 containerizer.cpp:201] Using isolation: posix/cpu,posix/mem,filesystem/posix,network/cni
W1028 13:05:39.992172 29416 backend.cpp:76] Failed to create 'aufs' backend: AufsBackend requires root privileges, but is running as user mesos
W1028 13:05:39.992333 29416 backend.cpp:76] Failed to create 'bind' backend: BindBackend requires root privileges
I1028 13:05:39.993841 29416 cluster.cpp:435] Creating default 'local' authorizer
I1028 13:05:39.995687 29448 slave.cpp:208] Mesos agent started on (643)@172.17.0.2:50703
I1028 13:05:39.995712 29448 slave.cpp:209] Flags at startup: --acls="" --appc_simple_discovery_uri_prefix="http://" --appc_store_dir="/tmp/mesos/store/appc" --authenticate_http_readonly="true" --authenticate_http_readwrite="true" --authenticatee="crammd5" --authentication_backoff_factor="1secs" --authorizer="local" --cgroups_cpu_enable_pids_and_tids_count="false" --cgroups_enable_cfs="false" --cgroups_hierarchy="/sys/fs/cgroup" --cgroups_limit_swap="false" --cgroups_root="mesos" --container_disk_watch_interval="15secs" --containerizers="mesos" --credential="/tmp/Endpoint_SlaveEndpointTest_NoAuthorizer_2_3d3T6N/credential" --default_role="*" --disk_watch_interval="1mins" --docker="docker" --docker_kill_orphans="true" --docker_registry="https://registry-1.docker.io" --docker_remove_delay="6hrs" --docker_socket="/var/run/docker.sock" --docker_stop_timeout="0ns" --docker_store_dir="/tmp/mesos/store/docker" --docker_volume_checkpoint_dir="/var/run/mesos/isolators/docker/volume" --enforce_container_disk_quota="false" --executor_registration_timeout="1mins" --executor_shutdown_grace_period="5secs" --fetcher_cache_dir="/tmp/Endpoint_SlaveEndpointTest_NoAuthorizer_2_3d3T6N/fetch" --fetcher_cache_size="2GB" --frameworks_home="" --gc_delay="1weeks" --gc_disk_headroom="0.1" --hadoop_home="" --help="false" --hostname_lookup="true" --http_authenticators="basic" --http_command_executor="false" --http_credentials="/tmp/Endpoint_SlaveEndpointTest_NoAuthorizer_2_3d3T6N/http_credentials" --image_provisioner_backend="copy" --initialize_driver_logging="true" --isolation="posix/cpu,posix/mem" --launcher="posix" --launcher_dir="/mesos/mesos-1.2.0/_build/src" --logbufsecs="0" --logging_level="INFO" --max_completed_executors_per_framework="150" --oversubscribed_resources_interval="15secs" --perf_duration="10secs" --perf_interval="1mins" --qos_correction_interval_min="0ns" --quiet="false" --recover="reconnect" --recovery_timeout="15mins" --registration_backoff_factor="10ms" --resources="cpus:2;gpus:0;mem:1024;disk:1024;ports:[31000-32000]" --revocable_cpu_low_priority="true" --runtime_dir="/tmp/Endpoint_SlaveEndpointTest_NoAuthorizer_2_3d3T6N" --sandbox_directory="/mnt/mesos/sandbox" --strict="true" --switch_user="true" --systemd_enable_support="true" --systemd_runtime_directory="/run/systemd/system" --version="false" --work_dir="/tmp/Endpoint_SlaveEndpointTest_NoAuthorizer_2_v4YFhv"
I1028 13:05:39.996374 29448 credentials.hpp:86] Loading credential for authentication from '/tmp/Endpoint_SlaveEndpointTest_NoAuthorizer_2_3d3T6N/credential'
I1028 13:05:39.996541 29448 slave.cpp:346] Agent using credential for: test-principal
I1028 13:05:39.996564 29448 credentials.hpp:37] Loading credentials for authentication from '/tmp/Endpoint_SlaveEndpointTest_NoAuthorizer_2_3d3T6N/http_credentials'
I1028 13:05:39.996829 29448 http.cpp:887] Using default 'basic' HTTP authenticator for realm 'mesos-agent-readonly'
I1028 13:05:39.996976 29448 http.cpp:887] Using default 'basic' HTTP authenticator for realm 'mesos-agent-readwrite'
I1028 13:05:39.998155 29448 slave.cpp:533] Agent resources: cpus(*):2; mem(*):1024; disk(*):1024; ports(*):[31000-32000]
I1028 13:05:39.998231 29448 slave.cpp:541] Agent attributes: [ ]
I1028 13:05:39.998250 29448 slave.cpp:546] Agent hostname: eae5d89ba751
I1028 13:05:39.999414 29437 state.cpp:57] Recovering state from '/tmp/Endpoint_SlaveEndpointTest_NoAuthorizer_2_v4YFhv/meta'
I1028 13:05:39.999696 29446 status_update_manager.cpp:203] Recovering status update manager
I1028 13:05:39.999929 29444 containerizer.cpp:557] Recovering containerizer
I1028 13:05:40.001054 29444 provisioner.cpp:253] Provisioner recovery complete
I1028 13:05:40.001430 29436 slave.cpp:5399] Finished recovery
I1028 13:05:40.001840 29436 slave.cpp:5573] Querying resource estimator for oversubscribable resources
I1028 13:05:40.002127 29442 slave.cpp:5587] Received oversubscribable resources {} from the resource estimator
I1028 13:05:40.003976 29436 process.cpp:3570] Handling HTTP event for process 'slave(643)' with path: '/slave(643)/containers'
I1028 13:05:40.004889 29439 http.cpp:839] Authorizing principal 'test-principal' to GET the '/containers' endpoint
I1028 13:05:40.008813 29447 slave.cpp:787] Agent terminating
[ OK ] Endpoint/SlaveEndpointTest.NoAuthorizer/2 (27 ms)
[----------] 9 tests from Endpoint/SlaveEndpointTest (268 ms total)
[----------] Global test environment tear-down
[==========] 1370 tests from 155 test cases ran. (1512540 ms total)
[ PASSED ] 1366 tests.
[ FAILED ] 4 tests, listed below:
[ FAILED ] GarbageCollectorIntegrationTest.DiskUsage
[ FAILED ] MasterAuthorizationTest.FrameworkRemoved
[ FAILED ] MasterTest.FrameworkMessage
[ FAILED ] PersistentVolumeEndpointsTest.VolumeExceedsReservedSize
4 FAILED TESTS
YOU HAVE 4 DISABLED TESTS
make[4]: *** [check-local] Error 1
make[4]: Leaving directory `/mesos/mesos-1.2.0/_build/src'
make[3]: *** [check-am] Error 2
make[3]: Leaving directory `/mesos/mesos-1.2.0/_build/src'
make[2]: *** [check] Error 2
make[2]: Leaving directory `/mesos/mesos-1.2.0/_build/src'
make[1]: *** [check-recursive] Error 1
make[1]: Leaving directory `/mesos/mesos-1.2.0/_build'
make: *** [distcheck] Error 1
+ docker rmi mesos-1477655583-25943
Untagged: mesos-1477655583-25943:latest
Deleted: sha256:0ae712fcd5d609b53b18bcf828c20f5d6c13dc7a873ff56e7ca6148cb7e85a58
Deleted: sha256:c036e21299c10caeb81fb9e4cf62498a1582eae37675e874b4d4a867610f3d3b
Deleted: sha256:dcd2d9d8560ee26eb39eda46b59efa5167c9d39d9d282292cc942b9fcf32390e
Deleted: sha256:3d20aea7b73b066ab8083b1bcc1fe7859a933a6a901f94e0b95e5bbede3dcf98
Deleted: sha256:317037d407d423cbb418d2e8c3a5e3661b37efe08505e22fa0edf8ad1429e4ff
Deleted: sha256:78a57ceeef47266dd3b175a3920e6c10b9bb5fe34a0be3de88d81431ec27816c
Deleted: sha256:6c1e47c862db063e0fa4bcebd0d92c1fc230519aacda8c9ba652c3f681ec1a75
Deleted: sha256:a07308c1604bf5248a6548c626c97a1aa2098844b25f548c27d115e0cc8d984e
Deleted: sha256:3865879454d25000c9e8395d61cc1ed6fcccf44bc956dac9a73141e08aa17428
Deleted: sha256:f5e35eedf819f66cb0a493c8b37a644e7b6ab477a69b12cdfd8c3c5def434507
Deleted: sha256:3942849a57e68465326ffaa4fb9d2c5a3801b5bbee14249fa55ec8451a4db445
Deleted: sha256:bc57a2526846c41cc8fc6f1272986a92b75c329ff09fb14a1101743836ba08e9
Deleted: sha256:dc8ceeece07c870a3d47806a115d26034ef41f4430c7dd6129878a70877f0db9
Deleted: sha256:1fb969c0c4da0091b01b4bd8ffda92926c202f0c780fcffd639dc16712897ba4
Deleted: sha256:6892e8ac72f0c8521a5ab84de09bd64c6521f33a66d2406dcf8dc6cbd1db0429
Deleted: sha256:37dc3275f49c08b6941d54d03d05231d754f7f865b746a2ba7436594254ebfe5
Deleted: sha256:5b027c971c9d1954673ffb63df78def1f4693ef636b1a7a29324c5c9043590df
Deleted: sha256:0fed49132ecebfc4ee8d3cb977556301a9707abf1091c5a057ecb7f243c285c8
Deleted: sha256:805316c005c7ff122ac7805a3c98169ad9ed5b6af2dcfce955fa5c59c7f86880
Deleted: sha256:fc6376b753299ad4c9cc2d24c23231809bba3821f65c370abe86c7aed3c8210a
Deleted: sha256:2b1c00b9844517fdd9d33631c7338748552ff5598a7f356b91d07db543fe2fb6
Deleted: sha256:06db92ad727e201b5f4b499bcaeb972146b33b3b0d9117ea324a8f7c5fd64fe1
Deleted: sha256:87f7b3ddb9dee7f1c84ff0c8b930b3a599d6b39d8787d57e560b3a74db8c86aa
Deleted: sha256:591860ffab86700b52cefdb8c4e3308859735627d908c901d2d0f51976c3d424
Build step 'Execute shell' marked build as failure
Jenkins build is back to normal : mesos-reviewbot #15855
Posted by Apache Jenkins Server <je...@builds.apache.org>.
See <https://builds.apache.org/job/mesos-reviewbot/15855/changes>