You are viewing a plain text version of this content. The canonical link for it is here.
Posted to java-dev@axis.apache.org by Apache Hudson Server <hu...@hudson.apache.org> on 2011/02/19 13:35:35 UTC

Build failed in Hudson: Rampart #306

See <https://hudson.apache.org/hudson/job/Rampart/306/changes>

Changes:

[veithen] Updated the MAR plugin to a more recent version and removed some unused plugin repositories.

[thilinamb] Improving logging in Rampart-Trust module.

[veithen] Replaced tabs by spaces.

[veithen] Changed the trunk version number to match the new conventions.

[veithen] RAMPART-322: Applied Dan Kulp's patch to update Rampart to Neethi 3.0.0-SNAPSHOT.

------------------------------------------
[...truncated 104 lines...]
Downloading: http://repo1.maven.org/maven2/org/apache/axis2/axis2-mar-maven-plugin/1.5.4/axis2-mar-maven-plugin-1.5.4.jar

Downloading: http://repo1.maven.org/maven2/org/apache/maven/maven-plugin-api/2.0.7/maven-plugin-api-2.0.7.pom

Downloading: http://repo1.maven.org/maven2/org/apache/maven/maven-project/2.0.7/maven-project-2.0.7.pom

Downloading: http://shibboleth.internet2.edu/downloads/maven2//org/apache/maven/maven-settings/2.0.7/maven-settings-2.0.7.pom
[INFO] Unable to find resource 'org.apache.maven:maven-settings:pom:2.0.7' in repository open-saml (http://shibboleth.internet2.edu/downloads/maven2/)
Downloading: http://repo1.maven.org/maven2/org/apache/maven/maven-settings/2.0.7/maven-settings-2.0.7.pom

Downloading: http://shibboleth.internet2.edu/downloads/maven2//junit/junit/4.4/junit-4.4.pom
[INFO] Unable to find resource 'junit:junit:pom:4.4' in repository open-saml (http://shibboleth.internet2.edu/downloads/maven2/)
Downloading: http://repo1.maven.org/maven2/junit/junit/4.4/junit-4.4.pom

Downloading: http://shibboleth.internet2.edu/downloads/maven2//org/apache/maven/maven-profile/2.0.7/maven-profile-2.0.7.pom
[INFO] Unable to find resource 'org.apache.maven:maven-profile:pom:2.0.7' in repository open-saml (http://shibboleth.internet2.edu/downloads/maven2/)
Downloading: http://repo1.maven.org/maven2/org/apache/maven/maven-profile/2.0.7/maven-profile-2.0.7.pom

Downloading: http://shibboleth.internet2.edu/downloads/maven2//org/apache/maven/maven-artifact-manager/2.0.7/maven-artifact-manager-2.0.7.pom
[INFO] Unable to find resource 'org.apache.maven:maven-artifact-manager:pom:2.0.7' in repository open-saml (http://shibboleth.internet2.edu/downloads/maven2/)
Downloading: http://repo1.maven.org/maven2/org/apache/maven/maven-artifact-manager/2.0.7/maven-artifact-manager-2.0.7.pom

Downloading: http://shibboleth.internet2.edu/downloads/maven2//org/apache/maven/maven-repository-metadata/2.0.7/maven-repository-metadata-2.0.7.pom
[INFO] Unable to find resource 'org.apache.maven:maven-repository-metadata:pom:2.0.7' in repository open-saml (http://shibboleth.internet2.edu/downloads/maven2/)
Downloading: http://repo1.maven.org/maven2/org/apache/maven/maven-repository-metadata/2.0.7/maven-repository-metadata-2.0.7.pom

Downloading: http://shibboleth.internet2.edu/downloads/maven2//org/apache/maven/maven-plugin-registry/2.0.7/maven-plugin-registry-2.0.7.pom
[INFO] Unable to find resource 'org.apache.maven:maven-plugin-registry:pom:2.0.7' in repository open-saml (http://shibboleth.internet2.edu/downloads/maven2/)
Downloading: http://repo1.maven.org/maven2/org/apache/maven/maven-plugin-registry/2.0.7/maven-plugin-registry-2.0.7.pom

[INFO] ------------------------------------------------------------------------
[INFO] Building Apache Rampart
[INFO]    task-segment: [clean, install]
[INFO] ------------------------------------------------------------------------
[INFO] [clean:clean {execution: default-clean}]
[INFO] Deleting <https://hudson.apache.org/hudson/job/Rampart/ws/trunk/target>
[INFO] Setting property: classpath.resource.loader.class => 'org.codehaus.plexus.velocity.ContextClassLoaderResourceLoader'.
[INFO] Setting property: velocimacro.messages.on => 'false'.
[INFO] Setting property: resource.loader => 'classpath'.
[INFO] Setting property: resource.manager.logwhenfound => 'false'.
[INFO] [remote-resources:process {execution: default}]
[INFO] snapshot org.apache.axis2:axis2-kernel:SNAPSHOT: checking for updates from open-saml
[INFO] snapshot org.apache.axis2:axis2-kernel:SNAPSHOT: checking for updates from apache.snapshots
[INFO] snapshot org.apache.ws.commons.axiom:axiom-api:1.2.12-SNAPSHOT: checking for updates from open-saml
[INFO] snapshot org.apache.ws.commons.axiom:axiom-api:1.2.12-SNAPSHOT: checking for updates from apache.snapshots
Downloading: http://repository.apache.org/snapshots/org/apache/ws/commons/axiom/axiom-api/1.2.12-SNAPSHOT/axiom-api-1.2.12-20110216.122310-8.pom
15K downloaded  (axiom-api-1.2.12-20110216.122310-8.pom)
[INFO] snapshot org.apache.ws.commons.axiom:axiom-parent:1.2.12-SNAPSHOT: checking for updates from open-saml
[INFO] snapshot org.apache.ws.commons.axiom:axiom-parent:1.2.12-SNAPSHOT: checking for updates from apache.snapshots
Downloading: http://repository.apache.org/snapshots/org/apache/ws/commons/axiom/axiom-parent/1.2.12-SNAPSHOT/axiom-parent-1.2.12-20110216.122310-8.pom
17K downloaded  (axiom-parent-1.2.12-20110216.122310-8.pom)
[INFO] snapshot org.apache.ws.commons.axiom:axiom-impl:1.2.12-SNAPSHOT: checking for updates from open-saml
[INFO] snapshot org.apache.ws.commons.axiom:axiom-impl:1.2.12-SNAPSHOT: checking for updates from apache.snapshots
Downloading: http://repository.apache.org/snapshots/org/apache/ws/commons/axiom/axiom-impl/1.2.12-SNAPSHOT/axiom-impl-1.2.12-20110216.122310-8.pom
5K downloaded  (axiom-impl-1.2.12-20110216.122310-8.pom)
[INFO] snapshot org.apache.woden:woden-api:1.0-SNAPSHOT: checking for updates from open-saml
[INFO] snapshot org.apache.woden:woden-api:1.0-SNAPSHOT: checking for updates from apache.snapshots
Downloading: http://repository.apache.org/snapshots/org/apache/woden/woden-api/1.0-SNAPSHOT/woden-api-1.0-SNAPSHOT.pom
2K downloaded  (woden-api-1.0-SNAPSHOT.pom)
[INFO] snapshot org.apache.woden:woden:1.0-SNAPSHOT: checking for updates from open-saml
[INFO] snapshot org.apache.woden:woden:1.0-SNAPSHOT: checking for updates from apache.snapshots
Downloading: http://repository.apache.org/snapshots/org/apache/woden/woden/1.0-SNAPSHOT/woden-1.0-SNAPSHOT.pom
13K downloaded  (woden-1.0-SNAPSHOT.pom)
[INFO] snapshot org.apache.woden:woden-impl-dom:1.0-SNAPSHOT: checking for updates from open-saml
[INFO] snapshot org.apache.woden:woden-impl-dom:1.0-SNAPSHOT: checking for updates from apache.snapshots
Downloading: http://repository.apache.org/snapshots/org/apache/woden/woden-impl-dom/1.0-SNAPSHOT/woden-impl-dom-1.0-SNAPSHOT.pom
4K downloaded  (woden-impl-dom-1.0-SNAPSHOT.pom)
[INFO] snapshot org.apache.woden:woden-impl-commons:1.0-SNAPSHOT: checking for updates from open-saml
[INFO] snapshot org.apache.woden:woden-impl-commons:1.0-SNAPSHOT: checking for updates from apache.snapshots
Downloading: http://repository.apache.org/snapshots/org/apache/woden/woden-impl-commons/1.0-SNAPSHOT/woden-impl-commons-1.0-SNAPSHOT.pom
4K downloaded  (woden-impl-commons-1.0-SNAPSHOT.pom)
[INFO] snapshot org.apache.axis2:mex:SNAPSHOT: checking for updates from open-saml
[INFO] snapshot org.apache.axis2:mex:SNAPSHOT: checking for updates from apache.snapshots
[INFO] snapshot org.apache.axis2:axis2-mtompolicy:SNAPSHOT: checking for updates from open-saml
[INFO] snapshot org.apache.axis2:axis2-mtompolicy:SNAPSHOT: checking for updates from apache.snapshots
[INFO] snapshot org.apache.axis2:addressing:SNAPSHOT: checking for updates from open-saml
[INFO] snapshot org.apache.axis2:addressing:SNAPSHOT: checking for updates from apache.snapshots
[INFO] snapshot org.apache.ws.commons.axiom:axiom-dom:1.2.12-SNAPSHOT: checking for updates from open-saml
[INFO] snapshot org.apache.ws.commons.axiom:axiom-dom:1.2.12-SNAPSHOT: checking for updates from apache.snapshots
Downloading: http://repository.apache.org/snapshots/org/apache/ws/commons/axiom/axiom-dom/1.2.12-SNAPSHOT/axiom-dom-1.2.12-20110216.122310-8.pom
6K downloaded  (axiom-dom-1.2.12-20110216.122310-8.pom)
[INFO] snapshot org.apache.ws.security:wss4j:1.5.12-SNAPSHOT: checking for updates from open-saml
[INFO] snapshot org.apache.ws.security:wss4j:1.5.12-SNAPSHOT: checking for updates from apache.snapshots
Downloading: http://repository.apache.org/snapshots/org/apache/ws/security/wss4j/1.5.12-SNAPSHOT/wss4j-1.5.12-SNAPSHOT.pom
20K downloaded  (wss4j-1.5.12-SNAPSHOT.pom)
Downloading: http://repository.apache.org/snapshots/org/apache/woden/woden-api/1.0-SNAPSHOT/woden-api-1.0-SNAPSHOT.jar
Downloading: http://repository.apache.org/snapshots/org/apache/ws/commons/axiom/axiom-api/1.2.12-SNAPSHOT/axiom-api-1.2.12-20110216.122310-8.jar
Downloading: http://repository.apache.org/snapshots/org/apache/ws/security/wss4j/1.5.12-SNAPSHOT/wss4j-1.5.12-SNAPSHOT.jar
146K downloaded  (woden-api-1.0-SNAPSHOT.jar)
Downloading: http://repository.apache.org/snapshots/org/apache/woden/woden-impl-dom/1.0-SNAPSHOT/woden-impl-dom-1.0-SNAPSHOT.jar
417K downloaded  (axiom-api-1.2.12-20110216.122310-8.jar)
325K downloaded  (wss4j-1.5.12-SNAPSHOT.jar)
47K downloaded  (woden-impl-dom-1.0-SNAPSHOT.jar)
Downloading: http://repository.apache.org/snapshots/org/apache/ws/commons/axiom/axiom-impl/1.2.12-SNAPSHOT/axiom-impl-1.2.12-20110216.122310-8.jar
Downloading: http://repository.apache.org/snapshots/org/apache/woden/woden-impl-commons/1.0-SNAPSHOT/woden-impl-commons-1.0-SNAPSHOT.jar
119K downloaded  (axiom-impl-1.2.12-20110216.122310-8.jar)
Downloading: http://repository.apache.org/snapshots/org/apache/ws/commons/axiom/axiom-dom/1.2.12-SNAPSHOT/axiom-dom-1.2.12-20110216.122310-8.jar
181K downloaded  (woden-impl-commons-1.0-SNAPSHOT.jar)
155K downloaded  (axiom-dom-1.2.12-20110216.122310-8.jar)
[INFO] [site:attach-descriptor {execution: default-attach-descriptor}]
[INFO] [install:install {execution: default-install}]
[INFO] Installing <https://hudson.apache.org/hudson/job/Rampart/ws/trunk/pom.xml> to <https://hudson.apache.org/hudson/job/Rampart/ws/.repository/org/apache/rampart/rampart-project/1.7.0-SNAPSHOT/rampart-project-1.7.0-SNAPSHOT.pom>
[HUDSON] Archiving <https://hudson.apache.org/hudson/job/Rampart/ws/trunk/pom.xml> to /home/hudson/hudson/jobs/Rampart/modules/org.apache.rampart$rampart-project/builds/2011-02-19_12-34-37/archive/org.apache.rampart/rampart-project/1.7.0-SNAPSHOT/pom.xml
[HUDSON] Archiving <https://hudson.apache.org/hudson/job/Rampart/ws/.repository/org/apache/rampart/rampart-project/1.7.0-SNAPSHOT/rampart-project-1.7.0-SNAPSHOT.pom> to /home/hudson/hudson/jobs/Rampart/modules/org.apache.rampart$rampart-project/builds/2011-02-19_12-34-37/archive/org.apache.rampart/rampart-project/1.7.0-SNAPSHOT/rampart-project-1.7.0-SNAPSHOT.pom
[INFO] ------------------------------------------------------------------------
[INFO] Building Rampart - Policy
[INFO]    task-segment: [clean, install]
[INFO] ------------------------------------------------------------------------
[INFO] [clean:clean {execution: default-clean}]
[INFO] Deleting <https://hudson.apache.org/hudson/job/Rampart/ws/trunk/modules/rampart-policy/target>
[INFO] [remote-resources:process {execution: default}]
[INFO] [resources:resources {execution: default-resources}]
[INFO] Using 'UTF-8' encoding to copy filtered resources.
[INFO] Copying 1 resource
[INFO] Copying 3 resources
[INFO] [compiler:compile {execution: default-compile}]
Compiling 89 source files to <https://hudson.apache.org/hudson/job/Rampart/ws/trunk/modules/rampart-policy/target/classes>
[HUDSON] Archiving <https://hudson.apache.org/hudson/job/Rampart/ws/trunk/modules/rampart-policy/pom.xml> to /home/hudson/hudson/jobs/Rampart/modules/org.apache.rampart$rampart-policy/builds/2011-02-19_12-34-37/archive/org.apache.rampart/rampart-policy/1.7.0-SNAPSHOT/pom.xml
[INFO] ------------------------------------------------------------------------
[ERROR] BUILD FAILURE
[INFO] ------------------------------------------------------------------------
[INFO] Compilation failure

<https://hudson.apache.org/hudson/job/Rampart/ws/trunk/modules/rampart-policy/src/main/java/org/apache/ws/secpolicy11/builders/SymmetricBindingBuilder.java>:[36,64] type org.apache.neethi.builders.AssertionBuilder does not take parameters

<https://hudson.apache.org/hudson/job/Rampart/ws/trunk/modules/rampart-policy/src/main/java/org/apache/ws/secpolicy12/builders/UsernameTokenBuilder.java>:[35,61] type org.apache.neethi.builders.AssertionBuilder does not take parameters

<https://hudson.apache.org/hudson/job/Rampart/ws/trunk/modules/rampart-policy/src/main/java/org/apache/ws/secpolicy12/builders/SupportingTokensBuilder.java>:[39,64] type org.apache.neethi.builders.AssertionBuilder does not take parameters

<https://hudson.apache.org/hudson/job/Rampart/ws/trunk/modules/rampart-policy/src/main/java/org/apache/ws/secpolicy11/builders/TransportBindingBuilder.java>:[37,64] type org.apache.neethi.builders.AssertionBuilder does not take parameters

<https://hudson.apache.org/hudson/job/Rampart/ws/trunk/modules/rampart-policy/src/main/java/org/apache/ws/secpolicy12/builders/SignedElementsBuilder.java>:[33,62] type org.apache.neethi.builders.AssertionBuilder does not take parameters

<https://hudson.apache.org/hudson/job/Rampart/ws/trunk/modules/rampart-policy/src/main/java/org/apache/ws/secpolicy11/builders/SecureConversationTokenBuilder.java>:[31,71] type org.apache.neethi.builders.AssertionBuilder does not take parameters

<https://hudson.apache.org/hudson/job/Rampart/ws/trunk/modules/rampart-policy/src/main/java/org/apache/ws/secpolicy12/builders/AsymmetricBindingBuilder.java>:[37,65] type org.apache.neethi.builders.AssertionBuilder does not take parameters

<https://hudson.apache.org/hudson/job/Rampart/ws/trunk/modules/rampart-policy/src/main/java/org/apache/ws/secpolicy11/builders/SecurityContextTokenBuilder.java>:[29,68] type org.apache.neethi.builders.AssertionBuilder does not take parameters

<https://hudson.apache.org/hudson/job/Rampart/ws/trunk/modules/rampart-policy/src/main/java/org/apache/ws/secpolicy11/builders/Trust10Builder.java>:[28,55] type org.apache.neethi.builders.AssertionBuilder does not take parameters

<https://hudson.apache.org/hudson/job/Rampart/ws/trunk/modules/rampart-policy/src/main/java/org/apache/ws/secpolicy12/builders/AlgorithmSuiteBuilder.java>:[34,62] type org.apache.neethi.builders.AssertionBuilder does not take parameters

<https://hudson.apache.org/hudson/job/Rampart/ws/trunk/modules/rampart-policy/src/main/java/org/apache/ws/secpolicy12/builders/TransportBindingBuilder.java>:[37,64] type org.apache.neethi.builders.AssertionBuilder does not take parameters

<https://hudson.apache.org/hudson/job/Rampart/ws/trunk/modules/rampart-policy/src/main/java/org/apache/ws/secpolicy11/builders/X509TokenBuilder.java>:[35,57] type org.apache.neethi.builders.AssertionBuilder does not take parameters

<https://hudson.apache.org/hudson/job/Rampart/ws/trunk/modules/rampart-policy/src/main/java/org/apache/ws/secpolicy12/builders/RequiredPartsBuilder.java>:[33,61] type org.apache.neethi.builders.AssertionBuilder does not take parameters

<https://hudson.apache.org/hudson/job/Rampart/ws/trunk/modules/rampart-policy/src/main/java/org/apache/ws/secpolicy12/builders/WSS10Builder.java>:[33,53] type org.apache.neethi.builders.AssertionBuilder does not take parameters

<https://hudson.apache.org/hudson/job/Rampart/ws/trunk/modules/rampart-policy/src/main/java/org/apache/ws/secpolicy11/builders/SupportingTokensBuilder.java>:[39,64] type org.apache.neethi.builders.AssertionBuilder does not take parameters

<https://hudson.apache.org/hudson/job/Rampart/ws/trunk/modules/rampart-policy/src/main/java/org/apache/ws/secpolicy12/builders/Trust13Builder.java>:[28,55] type org.apache.neethi.builders.AssertionBuilder does not take parameters

<https://hudson.apache.org/hudson/job/Rampart/ws/trunk/modules/rampart-policy/src/main/java/org/apache/ws/secpolicy11/builders/AsymmetricBindingBuilder.java>:[37,65] type org.apache.neethi.builders.AssertionBuilder does not take parameters

<https://hudson.apache.org/hudson/job/Rampart/ws/trunk/modules/rampart-policy/src/main/java/org/apache/ws/secpolicy11/builders/InitiatorTokenBuilder.java>:[34,62] type org.apache.neethi.builders.AssertionBuilder does not take parameters

<https://hudson.apache.org/hudson/job/Rampart/ws/trunk/modules/rampart-policy/src/main/java/org/apache/ws/secpolicy12/builders/IssuedTokenBuilder.java>:[35,59] type org.apache.neethi.builders.AssertionBuilder does not take parameters

<https://hudson.apache.org/hudson/job/Rampart/ws/trunk/modules/rampart-policy/src/main/java/org/apache/ws/secpolicy12/builders/SecurityContextTokenBuilder.java>:[29,68] type org.apache.neethi.builders.AssertionBuilder does not take parameters

<https://hudson.apache.org/hudson/job/Rampart/ws/trunk/modules/rampart-policy/src/main/java/org/apache/ws/secpolicy11/builders/EncryptedPartsBuilder.java>:[34,62] type org.apache.neethi.builders.AssertionBuilder does not take parameters

<https://hudson.apache.org/hudson/job/Rampart/ws/trunk/modules/rampart-policy/src/main/java/org/apache/ws/secpolicy11/builders/RecipientTokenBuilder.java>:[34,62] type org.apache.neethi.builders.AssertionBuilder does not take parameters

<https://hudson.apache.org/hudson/job/Rampart/ws/trunk/modules/rampart-policy/src/main/java/org/apache/ws/secpolicy11/builders/SignedPartsBuilder.java>:[33,59] type org.apache.neethi.builders.AssertionBuilder does not take parameters

<https://hudson.apache.org/hudson/job/Rampart/ws/trunk/modules/rampart-policy/src/main/java/org/apache/ws/secpolicy11/builders/AlgorithmSuiteBuilder.java>:[34,62] type org.apache.neethi.builders.AssertionBuilder does not take parameters

<https://hudson.apache.org/hudson/job/Rampart/ws/trunk/modules/rampart-policy/src/main/java/org/apache/ws/secpolicy12/builders/ProtectionTokenBuilder.java>:[34,63] type org.apache.neethi.builders.AssertionBuilder does not take parameters

<https://hudson.apache.org/hudson/job/Rampart/ws/trunk/modules/rampart-policy/src/main/java/org/apache/ws/secpolicy11/builders/WSS10Builder.java>:[33,53] type org.apache.neethi.builders.AssertionBuilder does not take parameters

<https://hudson.apache.org/hudson/job/Rampart/ws/trunk/modules/rampart-policy/src/main/java/org/apache/ws/secpolicy12/builders/EncryptedPartsBuilder.java>:[34,62] type org.apache.neethi.builders.AssertionBuilder does not take parameters

<https://hudson.apache.org/hudson/job/Rampart/ws/trunk/modules/rampart-policy/src/main/java/org/apache/ws/secpolicy12/builders/TransportTokenBuilder.java>:[27,24] cannot find symbol
symbol  : class PolicyContainingAssertion
location: package org.apache.neethi

<https://hudson.apache.org/hudson/job/Rampart/ws/trunk/modules/rampart-policy/src/main/java/org/apache/ws/secpolicy12/builders/TransportTokenBuilder.java>:[35,62] type org.apache.neethi.builders.AssertionBuilder does not take parameters

<https://hudson.apache.org/hudson/job/Rampart/ws/trunk/modules/rampart-policy/src/main/java/org/apache/ws/secpolicy12/builders/WSS11Builder.java>:[33,53] type org.apache.neethi.builders.AssertionBuilder does not take parameters

<https://hudson.apache.org/hudson/job/Rampart/ws/trunk/modules/rampart-policy/src/main/java/org/apache/ws/secpolicy12/builders/RecipientTokenBuilder.java>:[34,62] type org.apache.neethi.builders.AssertionBuilder does not take parameters

<https://hudson.apache.org/hudson/job/Rampart/ws/trunk/modules/rampart-policy/src/main/java/org/apache/ws/secpolicy11/builders/SignedElementsBuilder.java>:[33,62] type org.apache.neethi.builders.AssertionBuilder does not take parameters

<https://hudson.apache.org/hudson/job/Rampart/ws/trunk/modules/rampart-policy/src/main/java/org/apache/ws/secpolicy11/builders/LayoutBuilder.java>:[33,54] type org.apache.neethi.builders.AssertionBuilder does not take parameters

<https://hudson.apache.org/hudson/job/Rampart/ws/trunk/modules/rampart-policy/src/main/java/org/apache/ws/secpolicy11/builders/ProtectionTokenBuilder.java>:[34,63] type org.apache.neethi.builders.AssertionBuilder does not take parameters

<https://hudson.apache.org/hudson/job/Rampart/ws/trunk/modules/rampart-policy/src/main/java/org/apache/ws/secpolicy12/builders/ContentEncryptedElementsBuilder.java>:[32,72] type org.apache.neethi.builders.AssertionBuilder does not take parameters

<https://hudson.apache.org/hudson/job/Rampart/ws/trunk/modules/rampart-policy/src/main/java/org/apache/ws/secpolicy12/builders/EncryptedElementsBuilder.java>:[33,65] type org.apache.neethi.builders.AssertionBuilder does not take parameters

<https://hudson.apache.org/hudson/job/Rampart/ws/trunk/modules/rampart-policy/src/main/java/org/apache/ws/secpolicy11/builders/EncryptedElementsBuilder.java>:[33,65] type org.apache.neethi.builders.AssertionBuilder does not take parameters

<https://hudson.apache.org/hudson/job/Rampart/ws/trunk/modules/rampart-policy/src/main/java/org/apache/ws/secpolicy11/builders/RequiredElementsBuilder.java>:[32,64] type org.apache.neethi.builders.AssertionBuilder does not take parameters

<https://hudson.apache.org/hudson/job/Rampart/ws/trunk/modules/rampart-policy/src/main/java/org/apache/ws/secpolicy11/builders/UsernameTokenBuilder.java>:[35,61] type org.apache.neethi.builders.AssertionBuilder does not take parameters

<https://hudson.apache.org/hudson/job/Rampart/ws/trunk/modules/rampart-policy/src/main/java/org/apache/ws/secpolicy12/builders/X509TokenBuilder.java>:[35,57] type org.apache.neethi.builders.AssertionBuilder does not take parameters

<https://hudson.apache.org/hudson/job/Rampart/ws/trunk/modules/rampart-policy/src/main/java/org/apache/ws/secpolicy11/builders/WSS11Builder.java>:[33,53] type org.apache.neethi.builders.AssertionBuilder does not take parameters

<https://hudson.apache.org/hudson/job/Rampart/ws/trunk/modules/rampart-policy/src/main/java/org/apache/ws/secpolicy12/builders/SecureConversationTokenBuilder.java>:[31,71] type org.apache.neethi.builders.AssertionBuilder does not take parameters

<https://hudson.apache.org/hudson/job/Rampart/ws/trunk/modules/rampart-policy/src/main/java/org/apache/ws/secpolicy12/builders/RequiredElementsBuilder.java>:[33,64] type org.apache.neethi.builders.AssertionBuilder does not take parameters

<https://hudson.apache.org/hudson/job/Rampart/ws/trunk/modules/rampart-policy/src/main/java/org/apache/ws/secpolicy12/builders/HttpsTokenBuilder.java>:[46,58] type org.apache.neethi.builders.AssertionBuilder does not take parameters

<https://hudson.apache.org/hudson/job/Rampart/ws/trunk/modules/rampart-policy/src/main/java/org/apache/ws/secpolicy11/builders/IssuedTokenBuilder.java>:[35,59] type org.apache.neethi.builders.AssertionBuilder does not take parameters

<https://hudson.apache.org/hudson/job/Rampart/ws/trunk/modules/rampart-policy/src/main/java/org/apache/ws/secpolicy12/builders/InitiatorTokenBuilder.java>:[34,62] type org.apache.neethi.builders.AssertionBuilder does not take parameters

<https://hudson.apache.org/hudson/job/Rampart/ws/trunk/modules/rampart-policy/src/main/java/org/apache/ws/secpolicy12/builders/SymmetricBindingBuilder.java>:[36,64] type org.apache.neethi.builders.AssertionBuilder does not take parameters

<https://hudson.apache.org/hudson/job/Rampart/ws/trunk/modules/rampart-policy/src/main/java/org/apache/ws/secpolicy12/builders/LayoutBuilder.java>:[33,54] type org.apache.neethi.builders.AssertionBuilder does not take parameters

<https://hudson.apache.org/hudson/job/Rampart/ws/trunk/modules/rampart-policy/src/main/java/org/apache/ws/secpolicy11/builders/TransportTokenBuilder.java>:[30,33] cannot find symbol
symbol  : class PrimitiveAssertion
location: package org.apache.neethi.builders

<https://hudson.apache.org/hudson/job/Rampart/ws/trunk/modules/rampart-policy/src/main/java/org/apache/ws/secpolicy11/builders/TransportTokenBuilder.java>:[36,62] type org.apache.neethi.builders.AssertionBuilder does not take parameters

<https://hudson.apache.org/hudson/job/Rampart/ws/trunk/modules/rampart-policy/src/main/java/org/apache/ws/secpolicy12/builders/SignedPartsBuilder.java>:[33,59] type org.apache.neethi.builders.AssertionBuilder does not take parameters

<https://hudson.apache.org/hudson/job/Rampart/ws/trunk/modules/rampart-policy/src/main/java/org/apache/ws/secpolicy12/builders/TransportTokenBuilder.java>:[65,33] cannot find symbol
symbol  : class PolicyContainingAssertion
location: class org.apache.ws.secpolicy12.builders.TransportTokenBuilder

<https://hudson.apache.org/hudson/job/Rampart/ws/trunk/modules/rampart-policy/src/main/java/org/apache/ws/secpolicy11/builders/TransportTokenBuilder.java>:[66,32] cannot find symbol
symbol  : class PrimitiveAssertion
location: class org.apache.ws.secpolicy11.builders.TransportTokenBuilder


[INFO] ------------------------------------------------------------------------
[INFO] For more information, run Maven with the -e switch
[INFO] ------------------------------------------------------------------------
[INFO] Total time: 30 seconds
[INFO] Finished at: Sat Feb 19 04:35:34 PST 2011
[INFO] Final Memory: 34M/252M
[INFO] ------------------------------------------------------------------------
Sending e-mails to: java-dev@axis.apache.org
channel stopped
[locks-and-latches] Releasing all the locks
[locks-and-latches] All the locks released


---------------------------------------------------------------------
To unsubscribe, e-mail: java-dev-unsubscribe@axis.apache.org
For additional commands, e-mail: java-dev-help@axis.apache.org


Hudson build is back to normal : Rampart #308

Posted by Apache Hudson Server <hu...@hudson.apache.org>.
See <https://hudson.apache.org/hudson/job/Rampart/308/changes>



---------------------------------------------------------------------
To unsubscribe, e-mail: java-dev-unsubscribe@axis.apache.org
For additional commands, e-mail: java-dev-help@axis.apache.org


Build failed in Hudson: Rampart #307

Posted by Apache Hudson Server <hu...@hudson.apache.org>.
See <https://hudson.apache.org/hudson/job/Rampart/307/changes>

Changes:

[thilinamb] Applying patch for RAMPART-305 provided by AmilaJ

[thilinamb] Removing unnecessary isDebugEnabled checks and using isDebugEnabled() instead of the static variable.

------------------------------------------
[...truncated 2 lines...]
Updating http://svn.apache.org/repos/asf/axis/axis2/java/rampart/trunk
U         modules/rampart-trust/src/main/java/org/apache/rahas/TokenRequestDispatcher.java
U         modules/rampart-trust/src/main/java/org/apache/rahas/impl/SAML2TokenIssuer.java
U         modules/rampart-trust/src/main/java/org/apache/rahas/impl/util/SAML2Utils.java
U         modules/rampart-trust/src/main/java/org/apache/rahas/client/STSClient.java
U         modules/rampart-core/src/main/java/org/apache/rampart/builder/AsymmetricBindingBuilder.java
U         modules/rampart-core/src/main/java/org/apache/rampart/builder/BindingBuilder.java
U         modules/rampart-core/src/main/java/org/apache/rampart/builder/SymmetricBindingBuilder.java
U         modules/rampart-core/src/main/java/org/apache/rampart/builder/TransportBindingBuilder.java
U         modules/rampart-core/src/main/java/org/apache/rampart/policy/RampartPolicyBuilder.java
U         modules/rampart-core/src/main/java/org/apache/rampart/MessageBuilder.java
U         modules/rampart-core/src/main/java/org/apache/rampart/RampartEngine.java
U         modules/rampart-core/src/main/java/org/apache/rampart/handler/RampartSender.java
U         modules/rampart-core/src/main/java/org/apache/rampart/util/RampartUtil.java
At revision 1072333
Found mavenVersion 2.2.1 from file jar:file:/home/hudson/tools/maven/apache-maven-2.2.1/lib/maven-2.2.1-uber.jar!/META-INF/maven/org.apache.maven/maven-core/pom.properties
[Rampart] $ /bin/bash -xe /tmp/hudson5285166581947068323.sh
+ '[' -d <https://hudson.apache.org/hudson/job/Rampart/ws/.repository> ']'
++ find <https://hudson.apache.org/hudson/job/Rampart/ws/.repository> -type d -and -name '*-SNAPSHOT'
+ rm -rf <https://hudson.apache.org/hudson/job/Rampart/ws/.repository/org/apache/ws/commons/axiom/axiom-parent/1.2.12-SNAPSHOT> <https://hudson.apache.org/hudson/job/Rampart/ws/.repository/org/apache/ws/commons/axiom/axiom-api/1.2.12-SNAPSHOT> <https://hudson.apache.org/hudson/job/Rampart/ws/.repository/org/apache/ws/commons/axiom/axiom-dom/1.2.12-SNAPSHOT> <https://hudson.apache.org/hudson/job/Rampart/ws/.repository/org/apache/ws/commons/axiom/axiom-impl/1.2.12-SNAPSHOT> <https://hudson.apache.org/hudson/job/Rampart/ws/.repository/org/apache/ws/security/wss4j/1.5.12-SNAPSHOT> <https://hudson.apache.org/hudson/job/Rampart/ws/.repository/org/apache/rampart/rampart-project/1.7.0-SNAPSHOT> <https://hudson.apache.org/hudson/job/Rampart/ws/.repository/org/apache/woden/woden-impl-dom/1.0-SNAPSHOT> <https://hudson.apache.org/hudson/job/Rampart/ws/.repository/org/apache/woden/woden-impl-commons/1.0-SNAPSHOT> <https://hudson.apache.org/hudson/job/Rampart/ws/.repository/org/apache/woden/woden/1.0-SNAPSHOT> <https://hudson.apache.org/hudson/job/Rampart/ws/.repository/org/apache/woden/woden-api/1.0-SNAPSHOT>
[locks-and-latches] Checking to see if we really have the locks
[locks-and-latches] Have all the locks, build can start
Parsing POMs
[trunk] $ /home/hudson/tools/java/latest1.6/bin/java -cp /home/hudson/hudson-slave/maven-agent.jar:/home/hudson/hudson-slave/classworlds.jar hudson.maven.agent.Main /home/hudson/tools/maven/apache-maven-2.2.1 /home/hudson/hudson-slave/slave.jar /home/hudson/hudson-slave/maven-interceptor.jar 44407 /home/hudson/hudson-slave/maven2.1-interceptor.jar
<===[HUDSONchannel started
 REMOTING CAPACITY]===>   Executing Maven:  -B -f <https://hudson.apache.org/hudson/job/Rampart/ws/trunk/pom.xml> -Dmaven.repo.local=<https://hudson.apache.org/hudson/job/Rampart/ws/.repository> clean install -Drelease
[INFO] Scanning for projects...
[INFO] Reactor build order: 
[INFO]   Apache Rampart
[INFO]   Rampart - Policy
[INFO]   Rampart - Trust
[INFO]   Rampart - Core
[INFO]   Rampart - Test Suite
[INFO]   Rampart - Mar
[INFO]   Rampart - Trust-Mar
[INFO]   Rampart - Integration
[INFO]   Rampart - Documentation
[INFO]   Rampart - Distribution
[INFO] ------------------------------------------------------------------------
[INFO] Building Apache Rampart
[INFO]    task-segment: [clean, install]
[INFO] ------------------------------------------------------------------------
[INFO] [clean:clean {execution: default-clean}]
[INFO] Deleting <https://hudson.apache.org/hudson/job/Rampart/ws/trunk/target>
[INFO] Setting property: classpath.resource.loader.class => 'org.codehaus.plexus.velocity.ContextClassLoaderResourceLoader'.
[INFO] Setting property: velocimacro.messages.on => 'false'.
[INFO] Setting property: resource.loader => 'classpath'.
[INFO] Setting property: resource.manager.logwhenfound => 'false'.
[INFO] [remote-resources:process {execution: default}]
[INFO] snapshot org.apache.ws.commons.axiom:axiom-api:1.2.12-SNAPSHOT: checking for updates from open-saml
[INFO] snapshot org.apache.ws.commons.axiom:axiom-api:1.2.12-SNAPSHOT: checking for updates from apache.snapshots
Downloading: http://repository.apache.org/snapshots/org/apache/ws/commons/axiom/axiom-api/1.2.12-SNAPSHOT/axiom-api-1.2.12-20110216.122310-8.pom
15K downloaded  (axiom-api-1.2.12-20110216.122310-8.pom)
[INFO] snapshot org.apache.ws.commons.axiom:axiom-parent:1.2.12-SNAPSHOT: checking for updates from open-saml
[INFO] snapshot org.apache.ws.commons.axiom:axiom-parent:1.2.12-SNAPSHOT: checking for updates from apache.snapshots
Downloading: http://repository.apache.org/snapshots/org/apache/ws/commons/axiom/axiom-parent/1.2.12-SNAPSHOT/axiom-parent-1.2.12-20110216.122310-8.pom
17K downloaded  (axiom-parent-1.2.12-20110216.122310-8.pom)
[INFO] snapshot org.apache.ws.commons.axiom:axiom-impl:1.2.12-SNAPSHOT: checking for updates from open-saml
[INFO] snapshot org.apache.ws.commons.axiom:axiom-impl:1.2.12-SNAPSHOT: checking for updates from apache.snapshots
Downloading: http://repository.apache.org/snapshots/org/apache/ws/commons/axiom/axiom-impl/1.2.12-SNAPSHOT/axiom-impl-1.2.12-20110216.122310-8.pom
5K downloaded  (axiom-impl-1.2.12-20110216.122310-8.pom)
[INFO] snapshot org.apache.woden:woden-api:1.0-SNAPSHOT: checking for updates from open-saml
[INFO] snapshot org.apache.woden:woden-api:1.0-SNAPSHOT: checking for updates from apache.snapshots
Downloading: http://repository.apache.org/snapshots/org/apache/woden/woden-api/1.0-SNAPSHOT/woden-api-1.0-SNAPSHOT.pom
2K downloaded  (woden-api-1.0-SNAPSHOT.pom)
[INFO] snapshot org.apache.woden:woden:1.0-SNAPSHOT: checking for updates from open-saml
[INFO] snapshot org.apache.woden:woden:1.0-SNAPSHOT: checking for updates from apache.snapshots
Downloading: http://repository.apache.org/snapshots/org/apache/woden/woden/1.0-SNAPSHOT/woden-1.0-SNAPSHOT.pom
13K downloaded  (woden-1.0-SNAPSHOT.pom)
[INFO] snapshot org.apache.woden:woden-impl-dom:1.0-SNAPSHOT: checking for updates from open-saml
[INFO] snapshot org.apache.woden:woden-impl-dom:1.0-SNAPSHOT: checking for updates from apache.snapshots
Downloading: http://repository.apache.org/snapshots/org/apache/woden/woden-impl-dom/1.0-SNAPSHOT/woden-impl-dom-1.0-SNAPSHOT.pom
4K downloaded  (woden-impl-dom-1.0-SNAPSHOT.pom)
[INFO] snapshot org.apache.woden:woden-impl-commons:1.0-SNAPSHOT: checking for updates from open-saml
[INFO] snapshot org.apache.woden:woden-impl-commons:1.0-SNAPSHOT: checking for updates from apache.snapshots
Downloading: http://repository.apache.org/snapshots/org/apache/woden/woden-impl-commons/1.0-SNAPSHOT/woden-impl-commons-1.0-SNAPSHOT.pom
4K downloaded  (woden-impl-commons-1.0-SNAPSHOT.pom)
[INFO] snapshot org.apache.ws.commons.axiom:axiom-dom:1.2.12-SNAPSHOT: checking for updates from open-saml
[INFO] snapshot org.apache.ws.commons.axiom:axiom-dom:1.2.12-SNAPSHOT: checking for updates from apache.snapshots
Downloading: http://repository.apache.org/snapshots/org/apache/ws/commons/axiom/axiom-dom/1.2.12-SNAPSHOT/axiom-dom-1.2.12-20110216.122310-8.pom
6K downloaded  (axiom-dom-1.2.12-20110216.122310-8.pom)
[INFO] snapshot org.apache.ws.security:wss4j:1.5.12-SNAPSHOT: checking for updates from open-saml
[INFO] snapshot org.apache.ws.security:wss4j:1.5.12-SNAPSHOT: checking for updates from apache.snapshots
Downloading: http://repository.apache.org/snapshots/org/apache/ws/security/wss4j/1.5.12-SNAPSHOT/wss4j-1.5.12-SNAPSHOT.pom
20K downloaded  (wss4j-1.5.12-SNAPSHOT.pom)
Downloading: http://repository.apache.org/snapshots/org/apache/ws/security/wss4j/1.5.12-SNAPSHOT/wss4j-1.5.12-SNAPSHOT.jar
Downloading: http://repository.apache.org/snapshots/org/apache/woden/woden-api/1.0-SNAPSHOT/woden-api-1.0-SNAPSHOT.jar
Downloading: http://repository.apache.org/snapshots/org/apache/ws/commons/axiom/axiom-api/1.2.12-SNAPSHOT/axiom-api-1.2.12-20110216.122310-8.jar
146K downloaded  (woden-api-1.0-SNAPSHOT.jar)
325K downloaded  (wss4j-1.5.12-SNAPSHOT.jar)
Downloading: http://repository.apache.org/snapshots/org/apache/woden/woden-impl-dom/1.0-SNAPSHOT/woden-impl-dom-1.0-SNAPSHOT.jar
47K downloaded  (woden-impl-dom-1.0-SNAPSHOT.jar)
Downloading: http://repository.apache.org/snapshots/org/apache/woden/woden-impl-commons/1.0-SNAPSHOT/woden-impl-commons-1.0-SNAPSHOT.jar
417K downloaded  (axiom-api-1.2.12-20110216.122310-8.jar)
181K downloaded  (woden-impl-commons-1.0-SNAPSHOT.jar)
Downloading: http://repository.apache.org/snapshots/org/apache/ws/commons/axiom/axiom-impl/1.2.12-SNAPSHOT/axiom-impl-1.2.12-20110216.122310-8.jar
119K downloaded  (axiom-impl-1.2.12-20110216.122310-8.jar)
Downloading: http://repository.apache.org/snapshots/org/apache/ws/commons/axiom/axiom-dom/1.2.12-SNAPSHOT/axiom-dom-1.2.12-20110216.122310-8.jar
155K downloaded  (axiom-dom-1.2.12-20110216.122310-8.jar)
[INFO] [site:attach-descriptor {execution: default-attach-descriptor}]
[INFO] [install:install {execution: default-install}]
[INFO] Installing <https://hudson.apache.org/hudson/job/Rampart/ws/trunk/pom.xml> to <https://hudson.apache.org/hudson/job/Rampart/ws/.repository/org/apache/rampart/rampart-project/1.7.0-SNAPSHOT/rampart-project-1.7.0-SNAPSHOT.pom>
[HUDSON] Archiving <https://hudson.apache.org/hudson/job/Rampart/ws/trunk/pom.xml> to /home/hudson/hudson/jobs/Rampart/modules/org.apache.rampart$rampart-project/builds/2011-02-19_15-53-46/archive/org.apache.rampart/rampart-project/1.7.0-SNAPSHOT/pom.xml
[HUDSON] Archiving <https://hudson.apache.org/hudson/job/Rampart/ws/.repository/org/apache/rampart/rampart-project/1.7.0-SNAPSHOT/rampart-project-1.7.0-SNAPSHOT.pom> to /home/hudson/hudson/jobs/Rampart/modules/org.apache.rampart$rampart-project/builds/2011-02-19_15-53-46/archive/org.apache.rampart/rampart-project/1.7.0-SNAPSHOT/rampart-project-1.7.0-SNAPSHOT.pom
[INFO] ------------------------------------------------------------------------
[INFO] Building Rampart - Policy
[INFO]    task-segment: [clean, install]
[INFO] ------------------------------------------------------------------------
[INFO] [clean:clean {execution: default-clean}]
[INFO] Deleting <https://hudson.apache.org/hudson/job/Rampart/ws/trunk/modules/rampart-policy/target>
[INFO] [remote-resources:process {execution: default}]
[INFO] [resources:resources {execution: default-resources}]
[INFO] Using 'UTF-8' encoding to copy filtered resources.
[INFO] Copying 1 resource
[INFO] Copying 3 resources
[INFO] [compiler:compile {execution: default-compile}]
Compiling 89 source files to <https://hudson.apache.org/hudson/job/Rampart/ws/trunk/modules/rampart-policy/target/classes>
[HUDSON] Archiving <https://hudson.apache.org/hudson/job/Rampart/ws/trunk/modules/rampart-policy/pom.xml> to /home/hudson/hudson/jobs/Rampart/modules/org.apache.rampart$rampart-policy/builds/2011-02-19_15-53-46/archive/org.apache.rampart/rampart-policy/1.7.0-SNAPSHOT/pom.xml
[INFO] ------------------------------------------------------------------------
[ERROR] BUILD FAILURE
[INFO] ------------------------------------------------------------------------
[INFO] Compilation failure

<https://hudson.apache.org/hudson/job/Rampart/ws/trunk/modules/rampart-policy/src/main/java/org/apache/ws/secpolicy11/builders/SymmetricBindingBuilder.java>:[36,64] type org.apache.neethi.builders.AssertionBuilder does not take parameters

<https://hudson.apache.org/hudson/job/Rampart/ws/trunk/modules/rampart-policy/src/main/java/org/apache/ws/secpolicy12/builders/UsernameTokenBuilder.java>:[35,61] type org.apache.neethi.builders.AssertionBuilder does not take parameters

<https://hudson.apache.org/hudson/job/Rampart/ws/trunk/modules/rampart-policy/src/main/java/org/apache/ws/secpolicy12/builders/SupportingTokensBuilder.java>:[39,64] type org.apache.neethi.builders.AssertionBuilder does not take parameters

<https://hudson.apache.org/hudson/job/Rampart/ws/trunk/modules/rampart-policy/src/main/java/org/apache/ws/secpolicy11/builders/TransportBindingBuilder.java>:[37,64] type org.apache.neethi.builders.AssertionBuilder does not take parameters

<https://hudson.apache.org/hudson/job/Rampart/ws/trunk/modules/rampart-policy/src/main/java/org/apache/ws/secpolicy12/builders/SignedElementsBuilder.java>:[33,62] type org.apache.neethi.builders.AssertionBuilder does not take parameters

<https://hudson.apache.org/hudson/job/Rampart/ws/trunk/modules/rampart-policy/src/main/java/org/apache/ws/secpolicy11/builders/SecureConversationTokenBuilder.java>:[31,71] type org.apache.neethi.builders.AssertionBuilder does not take parameters

<https://hudson.apache.org/hudson/job/Rampart/ws/trunk/modules/rampart-policy/src/main/java/org/apache/ws/secpolicy12/builders/AsymmetricBindingBuilder.java>:[37,65] type org.apache.neethi.builders.AssertionBuilder does not take parameters

<https://hudson.apache.org/hudson/job/Rampart/ws/trunk/modules/rampart-policy/src/main/java/org/apache/ws/secpolicy11/builders/SecurityContextTokenBuilder.java>:[29,68] type org.apache.neethi.builders.AssertionBuilder does not take parameters

<https://hudson.apache.org/hudson/job/Rampart/ws/trunk/modules/rampart-policy/src/main/java/org/apache/ws/secpolicy11/builders/Trust10Builder.java>:[28,55] type org.apache.neethi.builders.AssertionBuilder does not take parameters

<https://hudson.apache.org/hudson/job/Rampart/ws/trunk/modules/rampart-policy/src/main/java/org/apache/ws/secpolicy12/builders/AlgorithmSuiteBuilder.java>:[34,62] type org.apache.neethi.builders.AssertionBuilder does not take parameters

<https://hudson.apache.org/hudson/job/Rampart/ws/trunk/modules/rampart-policy/src/main/java/org/apache/ws/secpolicy12/builders/TransportBindingBuilder.java>:[37,64] type org.apache.neethi.builders.AssertionBuilder does not take parameters

<https://hudson.apache.org/hudson/job/Rampart/ws/trunk/modules/rampart-policy/src/main/java/org/apache/ws/secpolicy11/builders/X509TokenBuilder.java>:[35,57] type org.apache.neethi.builders.AssertionBuilder does not take parameters

<https://hudson.apache.org/hudson/job/Rampart/ws/trunk/modules/rampart-policy/src/main/java/org/apache/ws/secpolicy12/builders/RequiredPartsBuilder.java>:[33,61] type org.apache.neethi.builders.AssertionBuilder does not take parameters

<https://hudson.apache.org/hudson/job/Rampart/ws/trunk/modules/rampart-policy/src/main/java/org/apache/ws/secpolicy12/builders/WSS10Builder.java>:[33,53] type org.apache.neethi.builders.AssertionBuilder does not take parameters

<https://hudson.apache.org/hudson/job/Rampart/ws/trunk/modules/rampart-policy/src/main/java/org/apache/ws/secpolicy11/builders/SupportingTokensBuilder.java>:[39,64] type org.apache.neethi.builders.AssertionBuilder does not take parameters

<https://hudson.apache.org/hudson/job/Rampart/ws/trunk/modules/rampart-policy/src/main/java/org/apache/ws/secpolicy12/builders/Trust13Builder.java>:[28,55] type org.apache.neethi.builders.AssertionBuilder does not take parameters

<https://hudson.apache.org/hudson/job/Rampart/ws/trunk/modules/rampart-policy/src/main/java/org/apache/ws/secpolicy11/builders/AsymmetricBindingBuilder.java>:[37,65] type org.apache.neethi.builders.AssertionBuilder does not take parameters

<https://hudson.apache.org/hudson/job/Rampart/ws/trunk/modules/rampart-policy/src/main/java/org/apache/ws/secpolicy11/builders/InitiatorTokenBuilder.java>:[34,62] type org.apache.neethi.builders.AssertionBuilder does not take parameters

<https://hudson.apache.org/hudson/job/Rampart/ws/trunk/modules/rampart-policy/src/main/java/org/apache/ws/secpolicy12/builders/IssuedTokenBuilder.java>:[35,59] type org.apache.neethi.builders.AssertionBuilder does not take parameters

<https://hudson.apache.org/hudson/job/Rampart/ws/trunk/modules/rampart-policy/src/main/java/org/apache/ws/secpolicy12/builders/SecurityContextTokenBuilder.java>:[29,68] type org.apache.neethi.builders.AssertionBuilder does not take parameters

<https://hudson.apache.org/hudson/job/Rampart/ws/trunk/modules/rampart-policy/src/main/java/org/apache/ws/secpolicy11/builders/EncryptedPartsBuilder.java>:[34,62] type org.apache.neethi.builders.AssertionBuilder does not take parameters

<https://hudson.apache.org/hudson/job/Rampart/ws/trunk/modules/rampart-policy/src/main/java/org/apache/ws/secpolicy11/builders/RecipientTokenBuilder.java>:[34,62] type org.apache.neethi.builders.AssertionBuilder does not take parameters

<https://hudson.apache.org/hudson/job/Rampart/ws/trunk/modules/rampart-policy/src/main/java/org/apache/ws/secpolicy11/builders/SignedPartsBuilder.java>:[33,59] type org.apache.neethi.builders.AssertionBuilder does not take parameters

<https://hudson.apache.org/hudson/job/Rampart/ws/trunk/modules/rampart-policy/src/main/java/org/apache/ws/secpolicy11/builders/AlgorithmSuiteBuilder.java>:[34,62] type org.apache.neethi.builders.AssertionBuilder does not take parameters

<https://hudson.apache.org/hudson/job/Rampart/ws/trunk/modules/rampart-policy/src/main/java/org/apache/ws/secpolicy12/builders/ProtectionTokenBuilder.java>:[34,63] type org.apache.neethi.builders.AssertionBuilder does not take parameters

<https://hudson.apache.org/hudson/job/Rampart/ws/trunk/modules/rampart-policy/src/main/java/org/apache/ws/secpolicy11/builders/WSS10Builder.java>:[33,53] type org.apache.neethi.builders.AssertionBuilder does not take parameters

<https://hudson.apache.org/hudson/job/Rampart/ws/trunk/modules/rampart-policy/src/main/java/org/apache/ws/secpolicy12/builders/EncryptedPartsBuilder.java>:[34,62] type org.apache.neethi.builders.AssertionBuilder does not take parameters

<https://hudson.apache.org/hudson/job/Rampart/ws/trunk/modules/rampart-policy/src/main/java/org/apache/ws/secpolicy12/builders/TransportTokenBuilder.java>:[27,24] cannot find symbol
symbol  : class PolicyContainingAssertion
location: package org.apache.neethi

<https://hudson.apache.org/hudson/job/Rampart/ws/trunk/modules/rampart-policy/src/main/java/org/apache/ws/secpolicy12/builders/TransportTokenBuilder.java>:[35,62] type org.apache.neethi.builders.AssertionBuilder does not take parameters

<https://hudson.apache.org/hudson/job/Rampart/ws/trunk/modules/rampart-policy/src/main/java/org/apache/ws/secpolicy12/builders/WSS11Builder.java>:[33,53] type org.apache.neethi.builders.AssertionBuilder does not take parameters

<https://hudson.apache.org/hudson/job/Rampart/ws/trunk/modules/rampart-policy/src/main/java/org/apache/ws/secpolicy12/builders/RecipientTokenBuilder.java>:[34,62] type org.apache.neethi.builders.AssertionBuilder does not take parameters

<https://hudson.apache.org/hudson/job/Rampart/ws/trunk/modules/rampart-policy/src/main/java/org/apache/ws/secpolicy11/builders/SignedElementsBuilder.java>:[33,62] type org.apache.neethi.builders.AssertionBuilder does not take parameters

<https://hudson.apache.org/hudson/job/Rampart/ws/trunk/modules/rampart-policy/src/main/java/org/apache/ws/secpolicy11/builders/LayoutBuilder.java>:[33,54] type org.apache.neethi.builders.AssertionBuilder does not take parameters

<https://hudson.apache.org/hudson/job/Rampart/ws/trunk/modules/rampart-policy/src/main/java/org/apache/ws/secpolicy11/builders/ProtectionTokenBuilder.java>:[34,63] type org.apache.neethi.builders.AssertionBuilder does not take parameters

<https://hudson.apache.org/hudson/job/Rampart/ws/trunk/modules/rampart-policy/src/main/java/org/apache/ws/secpolicy12/builders/ContentEncryptedElementsBuilder.java>:[32,72] type org.apache.neethi.builders.AssertionBuilder does not take parameters

<https://hudson.apache.org/hudson/job/Rampart/ws/trunk/modules/rampart-policy/src/main/java/org/apache/ws/secpolicy12/builders/EncryptedElementsBuilder.java>:[33,65] type org.apache.neethi.builders.AssertionBuilder does not take parameters

<https://hudson.apache.org/hudson/job/Rampart/ws/trunk/modules/rampart-policy/src/main/java/org/apache/ws/secpolicy11/builders/EncryptedElementsBuilder.java>:[33,65] type org.apache.neethi.builders.AssertionBuilder does not take parameters

<https://hudson.apache.org/hudson/job/Rampart/ws/trunk/modules/rampart-policy/src/main/java/org/apache/ws/secpolicy11/builders/RequiredElementsBuilder.java>:[32,64] type org.apache.neethi.builders.AssertionBuilder does not take parameters

<https://hudson.apache.org/hudson/job/Rampart/ws/trunk/modules/rampart-policy/src/main/java/org/apache/ws/secpolicy11/builders/UsernameTokenBuilder.java>:[35,61] type org.apache.neethi.builders.AssertionBuilder does not take parameters

<https://hudson.apache.org/hudson/job/Rampart/ws/trunk/modules/rampart-policy/src/main/java/org/apache/ws/secpolicy12/builders/X509TokenBuilder.java>:[35,57] type org.apache.neethi.builders.AssertionBuilder does not take parameters

<https://hudson.apache.org/hudson/job/Rampart/ws/trunk/modules/rampart-policy/src/main/java/org/apache/ws/secpolicy11/builders/WSS11Builder.java>:[33,53] type org.apache.neethi.builders.AssertionBuilder does not take parameters

<https://hudson.apache.org/hudson/job/Rampart/ws/trunk/modules/rampart-policy/src/main/java/org/apache/ws/secpolicy12/builders/SecureConversationTokenBuilder.java>:[31,71] type org.apache.neethi.builders.AssertionBuilder does not take parameters

<https://hudson.apache.org/hudson/job/Rampart/ws/trunk/modules/rampart-policy/src/main/java/org/apache/ws/secpolicy12/builders/RequiredElementsBuilder.java>:[33,64] type org.apache.neethi.builders.AssertionBuilder does not take parameters

<https://hudson.apache.org/hudson/job/Rampart/ws/trunk/modules/rampart-policy/src/main/java/org/apache/ws/secpolicy12/builders/HttpsTokenBuilder.java>:[46,58] type org.apache.neethi.builders.AssertionBuilder does not take parameters

<https://hudson.apache.org/hudson/job/Rampart/ws/trunk/modules/rampart-policy/src/main/java/org/apache/ws/secpolicy11/builders/IssuedTokenBuilder.java>:[35,59] type org.apache.neethi.builders.AssertionBuilder does not take parameters

<https://hudson.apache.org/hudson/job/Rampart/ws/trunk/modules/rampart-policy/src/main/java/org/apache/ws/secpolicy12/builders/InitiatorTokenBuilder.java>:[34,62] type org.apache.neethi.builders.AssertionBuilder does not take parameters

<https://hudson.apache.org/hudson/job/Rampart/ws/trunk/modules/rampart-policy/src/main/java/org/apache/ws/secpolicy12/builders/SymmetricBindingBuilder.java>:[36,64] type org.apache.neethi.builders.AssertionBuilder does not take parameters

<https://hudson.apache.org/hudson/job/Rampart/ws/trunk/modules/rampart-policy/src/main/java/org/apache/ws/secpolicy12/builders/LayoutBuilder.java>:[33,54] type org.apache.neethi.builders.AssertionBuilder does not take parameters

<https://hudson.apache.org/hudson/job/Rampart/ws/trunk/modules/rampart-policy/src/main/java/org/apache/ws/secpolicy11/builders/TransportTokenBuilder.java>:[30,33] cannot find symbol
symbol  : class PrimitiveAssertion
location: package org.apache.neethi.builders

<https://hudson.apache.org/hudson/job/Rampart/ws/trunk/modules/rampart-policy/src/main/java/org/apache/ws/secpolicy11/builders/TransportTokenBuilder.java>:[36,62] type org.apache.neethi.builders.AssertionBuilder does not take parameters

<https://hudson.apache.org/hudson/job/Rampart/ws/trunk/modules/rampart-policy/src/main/java/org/apache/ws/secpolicy12/builders/SignedPartsBuilder.java>:[33,59] type org.apache.neethi.builders.AssertionBuilder does not take parameters

<https://hudson.apache.org/hudson/job/Rampart/ws/trunk/modules/rampart-policy/src/main/java/org/apache/ws/secpolicy12/builders/TransportTokenBuilder.java>:[65,33] cannot find symbol
symbol  : class PolicyContainingAssertion
location: class org.apache.ws.secpolicy12.builders.TransportTokenBuilder

<https://hudson.apache.org/hudson/job/Rampart/ws/trunk/modules/rampart-policy/src/main/java/org/apache/ws/secpolicy11/builders/TransportTokenBuilder.java>:[66,32] cannot find symbol
symbol  : class PrimitiveAssertion
location: class org.apache.ws.secpolicy11.builders.TransportTokenBuilder


[INFO] ------------------------------------------------------------------------
[INFO] For more information, run Maven with the -e switch
[INFO] ------------------------------------------------------------------------
[INFO] Total time: 20 seconds
[INFO] Finished at: Sat Feb 19 07:54:35 PST 2011
[INFO] Final Memory: 35M/211M
[INFO] ------------------------------------------------------------------------
Sending e-mails to: java-dev@axis.apache.org
channel stopped
[locks-and-latches] Releasing all the locks
[locks-and-latches] All the locks released


---------------------------------------------------------------------
To unsubscribe, e-mail: java-dev-unsubscribe@axis.apache.org
For additional commands, e-mail: java-dev-help@axis.apache.org