You are viewing a plain text version of this content. The canonical link for it is here.
Posted to commits@activemq.apache.org by Apache Jenkins Server <je...@builds.apache.org> on 2024/06/12 04:43:25 UTC

Build failed in Jenkins: ActiveMQ » ActiveMQ-Artemis-JDK8 #725

See <https://ci-builds.apache.org/job/ActiveMQ/job/ActiveMQ-Artemis-JDK8/725/display/redirect?page=changes>

Changes:

[Clebert Suconic] ARTEMIS-4813 Large Message in replication / sync could lose part of the body


------------------------------------------
Started by an SCM change
Running as SYSTEM
[EnvInject] - Loading node environment variables.
Building remotely on builds40 (ubuntu) in workspace <https://ci-builds.apache.org/job/ActiveMQ/job/ActiveMQ-Artemis-JDK8/ws/>
The recommended git tool is: NONE
No credentials specified
 > git rev-parse --resolve-git-dir <https://ci-builds.apache.org/job/ActiveMQ/job/ActiveMQ-Artemis-JDK8/ws/.git> # timeout=10
Fetching changes from the remote Git repository
 > git config remote.origin.url https://gitbox.apache.org/repos/asf/activemq-artemis.git # timeout=10
Fetching upstream changes from https://gitbox.apache.org/repos/asf/activemq-artemis.git
 > git --version # timeout=10
 > git --version # 'git version 2.34.1'
 > git fetch --tags --force --progress -- https://gitbox.apache.org/repos/asf/activemq-artemis.git +refs/heads/*:refs/remotes/origin/* # timeout=10
 > git rev-parse refs/remotes/origin/main^{commit} # timeout=10
Checking out Revision 4eb90765a7f2a6ca49664097cad7651cbc3e5439 (refs/remotes/origin/main)
 > git config core.sparsecheckout # timeout=10
 > git checkout -f 4eb90765a7f2a6ca49664097cad7651cbc3e5439 # timeout=10
Commit message: "ARTEMIS-4813 Large Message in replication / sync could lose part of the body"
 > git rev-list --no-walk 43e8009fb0cabcf2edbd462f0edc09d55540899f # timeout=10
[ActiveMQ-Artemis-JDK8] $ /bin/sh -xe /tmp/jenkins11053113851669492724.sh
+ echo ===== Env Details =====
===== Env Details =====
+ java -version
openjdk version "1.8.0_362"
OpenJDK Runtime Environment (Temurin)(build 1.8.0_362-b09)
OpenJDK 64-Bit Server VM (Temurin)(build 25.362-b09, mixed mode)
+ javac -version
javac 1.8.0_362
+ echo JAVA_HOME=/home/jenkins/tools/java/latest1.8
JAVA_HOME=/home/jenkins/tools/java/latest1.8
+ echo PATH=/home/jenkins/tools/maven/latest3/bin:/home/jenkins/tools/java/latest1.8/bin:/usr/local/sbin:/usr/local/bin:/usr/sbin:/usr/bin:/sbin:/bin:/snap/bin
PATH=/home/jenkins/tools/maven/latest3/bin:/home/jenkins/tools/java/latest1.8/bin:/usr/local/sbin:/usr/local/bin:/usr/sbin:/usr/bin:/sbin:/bin:/snap/bin
+ echo =======================
=======================
Parsing POMs
Modules changed, recalculating dependency graph
Established TCP socket on 37725
maven35-agent.jar already up to date
maven35-interceptor.jar already up to date
maven3-interceptor-commons.jar already up to date
[ActiveMQ-Artemis-JDK8] $ /home/jenkins/tools/java/latest1.8/bin/java -cp /home/jenkins/jenkins-agent/maven35-agent.jar:/home/jenkins/tools/maven/latest3/boot/plexus-classworlds-2.7.0.jar:/home/jenkins/tools/maven/latest3/conf/logging jenkins.maven3.agent.Maven35Main /home/jenkins/tools/maven/latest3 /home/jenkins/jenkins-agent/agent.jar /home/jenkins/jenkins-agent/maven35-interceptor.jar /home/jenkins/jenkins-agent/maven3-interceptor-commons.jar 37725
Exception in thread "main" java.lang.UnsupportedClassVersionError: hudson/remoting/Launcher has been compiled by a more recent version of the Java Runtime (class file version 55.0), this version of the Java Runtime only recognizes class file versions up to 52.0
	at java.lang.ClassLoader.defineClass1(Native Method)
	at java.lang.ClassLoader.defineClass(ClassLoader.java:756)
	at java.security.SecureClassLoader.defineClass(SecureClassLoader.java:142)
	at java.net.URLClassLoader.defineClass(URLClassLoader.java:473)
	at java.net.URLClassLoader.access$100(URLClassLoader.java:74)
	at java.net.URLClassLoader$1.run(URLClassLoader.java:369)
	at java.net.URLClassLoader$1.run(URLClassLoader.java:363)
	at java.security.AccessController.doPrivileged(Native Method)
	at java.net.URLClassLoader.findClass(URLClassLoader.java:362)
	at org.codehaus.plexus.classworlds.realm.ClassRealm.findClassInternal(ClassRealm.java:313)
	at org.codehaus.plexus.classworlds.realm.ClassRealm.loadClassFromSelf(ClassRealm.java:432)
	at org.codehaus.plexus.classworlds.strategy.SelfFirstStrategy.loadClass(SelfFirstStrategy.java:42)
	at org.codehaus.plexus.classworlds.realm.ClassRealm.unsynchronizedLoadClass(ClassRealm.java:271)
	at org.codehaus.plexus.classworlds.realm.ClassRealm.loadClass(ClassRealm.java:247)
	at org.codehaus.plexus.classworlds.realm.ClassRealm.loadClass(ClassRealm.java:239)
	at jenkins.maven3.agent.Maven35Main.main(Maven35Main.java:136)
	at jenkins.maven3.agent.Maven35Main.main(Maven35Main.java:66)
ERROR: Failed to parse POMs
java.io.EOFException: unexpected stream termination
	at hudson.remoting.ChannelBuilder.negotiate(ChannelBuilder.java:459)
	at hudson.remoting.ChannelBuilder.build(ChannelBuilder.java:404)
	at hudson.slaves.Channels.forProcess(Channels.java:121)
	at hudson.maven.AbstractMavenProcessFactory.newProcess(AbstractMavenProcessFactory.java:298)
	at hudson.maven.ProcessCache.get(ProcessCache.java:237)
	at hudson.maven.MavenModuleSetBuild$MavenModuleSetBuildExecution.doRun(MavenModuleSetBuild.java:802)
	at hudson.model.AbstractBuild$AbstractBuildExecution.run(AbstractBuild.java:526)
	at hudson.model.Run.execute(Run.java:1841)
	at hudson.maven.MavenModuleSetBuild.run(MavenModuleSetBuild.java:543)
	at hudson.model.ResourceController.execute(ResourceController.java:101)
	at hudson.model.Executor.run(Executor.java:442)

---------------------------------------------------------------------
To unsubscribe, e-mail: commits-unsubscribe@activemq.apache.org
For additional commands, e-mail: commits-help@activemq.apache.org
For further information, visit: https://activemq.apache.org/contact



Build failed in Jenkins: ActiveMQ » ActiveMQ-Artemis-JDK8 #728

Posted by Apache Jenkins Server <je...@builds.apache.org>.
See <https://ci-builds.apache.org/job/ActiveMQ/job/ActiveMQ-Artemis-JDK8/728/display/redirect?page=changes>

Changes:

[Clebert Suconic] ARTEMIS-4667 ReplayManager does not work with replication


------------------------------------------
Started by an SCM change
Started by an SCM change
Running as SYSTEM
[EnvInject] - Loading node environment variables.
Building remotely on builds32 (ubuntu) in workspace <https://ci-builds.apache.org/job/ActiveMQ/job/ActiveMQ-Artemis-JDK8/ws/>
The recommended git tool is: NONE
No credentials specified
Cloning the remote Git repository
Cloning repository https://gitbox.apache.org/repos/asf/activemq-artemis.git
 > git init <https://ci-builds.apache.org/job/ActiveMQ/job/ActiveMQ-Artemis-JDK8/ws/> # timeout=10
Fetching upstream changes from https://gitbox.apache.org/repos/asf/activemq-artemis.git
 > git --version # timeout=10
 > git --version # 'git version 2.34.1'
 > git fetch --tags --force --progress -- https://gitbox.apache.org/repos/asf/activemq-artemis.git +refs/heads/*:refs/remotes/origin/* # timeout=10
 > git config remote.origin.url https://gitbox.apache.org/repos/asf/activemq-artemis.git # timeout=10
 > git config --add remote.origin.fetch +refs/heads/*:refs/remotes/origin/* # timeout=10
Avoid second fetch
 > git rev-parse refs/remotes/origin/main^{commit} # timeout=10
Checking out Revision dd6c74fc1c862aeb69def42ed8a8bfecc3447f50 (refs/remotes/origin/main)
 > git config core.sparsecheckout # timeout=10
 > git checkout -f dd6c74fc1c862aeb69def42ed8a8bfecc3447f50 # timeout=10
Commit message: "ARTEMIS-4667 ReplayManager does not work with replication"
 > git rev-list --no-walk f4fd259f0745412496d9e2c14af75b6e832814ee # timeout=10
[ActiveMQ-Artemis-JDK8] $ /bin/sh -xe /tmp/jenkins3291529914005194509.sh
+ echo ===== Env Details =====
===== Env Details =====
+ java -version
openjdk version "1.8.0_362"
OpenJDK Runtime Environment (Temurin)(build 1.8.0_362-b09)
OpenJDK 64-Bit Server VM (Temurin)(build 25.362-b09, mixed mode)
+ javac -version
javac 1.8.0_362
+ echo JAVA_HOME=/home/jenkins/tools/java/latest1.8
JAVA_HOME=/home/jenkins/tools/java/latest1.8
+ echo PATH=/home/jenkins/tools/maven/latest3/bin:/home/jenkins/tools/java/latest1.8/bin:/usr/local/sbin:/usr/local/bin:/usr/sbin:/usr/bin:/sbin:/bin:/snap/bin
PATH=/home/jenkins/tools/maven/latest3/bin:/home/jenkins/tools/java/latest1.8/bin:/usr/local/sbin:/usr/local/bin:/usr/sbin:/usr/bin:/sbin:/bin:/snap/bin
+ echo =======================
=======================
Parsing POMs
Modules changed, recalculating dependency graph
Established TCP socket on 36261
maven35-agent.jar already up to date
maven35-interceptor.jar already up to date
maven3-interceptor-commons.jar already up to date
[ActiveMQ-Artemis-JDK8] $ /home/jenkins/tools/java/latest1.8/bin/java -cp /home/jenkins/jenkins-agent/maven35-agent.jar:/home/jenkins/tools/maven/latest3/boot/plexus-classworlds-2.7.0.jar:/home/jenkins/tools/maven/latest3/conf/logging jenkins.maven3.agent.Maven35Main /home/jenkins/tools/maven/latest3 /home/jenkins/jenkins-agent/agent.jar /home/jenkins/jenkins-agent/maven35-interceptor.jar /home/jenkins/jenkins-agent/maven3-interceptor-commons.jar 36261
Exception in thread "main" java.lang.UnsupportedClassVersionError: hudson/remoting/Launcher has been compiled by a more recent version of the Java Runtime (class file version 55.0), this version of the Java Runtime only recognizes class file versions up to 52.0
	at java.lang.ClassLoader.defineClass1(Native Method)
	at java.lang.ClassLoader.defineClass(ClassLoader.java:756)
	at java.security.SecureClassLoader.defineClass(SecureClassLoader.java:142)
	at java.net.URLClassLoader.defineClass(URLClassLoader.java:473)
	at java.net.URLClassLoader.access$100(URLClassLoader.java:74)
	at java.net.URLClassLoader$1.run(URLClassLoader.java:369)
	at java.net.URLClassLoader$1.run(URLClassLoader.java:363)
	at java.security.AccessController.doPrivileged(Native Method)
	at java.net.URLClassLoader.findClass(URLClassLoader.java:362)
	at org.codehaus.plexus.classworlds.realm.ClassRealm.findClassInternal(ClassRealm.java:313)
	at org.codehaus.plexus.classworlds.realm.ClassRealm.loadClassFromSelf(ClassRealm.java:432)
	at org.codehaus.plexus.classworlds.strategy.SelfFirstStrategy.loadClass(SelfFirstStrategy.java:42)
	at org.codehaus.plexus.classworlds.realm.ClassRealm.unsynchronizedLoadClass(ClassRealm.java:271)
	at org.codehaus.plexus.classworlds.realm.ClassRealm.loadClass(ClassRealm.java:247)
	at org.codehaus.plexus.classworlds.realm.ClassRealm.loadClass(ClassRealm.java:239)
	at jenkins.maven3.agent.Maven35Main.main(Maven35Main.java:136)
	at jenkins.maven3.agent.Maven35Main.main(Maven35Main.java:66)
ERROR: Failed to parse POMs
java.io.EOFException: unexpected stream termination
	at hudson.remoting.ChannelBuilder.negotiate(ChannelBuilder.java:459)
	at hudson.remoting.ChannelBuilder.build(ChannelBuilder.java:404)
	at hudson.slaves.Channels.forProcess(Channels.java:121)
	at hudson.maven.AbstractMavenProcessFactory.newProcess(AbstractMavenProcessFactory.java:298)
	at hudson.maven.ProcessCache.get(ProcessCache.java:237)
	at hudson.maven.MavenModuleSetBuild$MavenModuleSetBuildExecution.doRun(MavenModuleSetBuild.java:802)
	at hudson.model.AbstractBuild$AbstractBuildExecution.run(AbstractBuild.java:526)
	at hudson.model.Run.execute(Run.java:1841)
	at hudson.maven.MavenModuleSetBuild.run(MavenModuleSetBuild.java:543)
	at hudson.model.ResourceController.execute(ResourceController.java:101)
	at hudson.model.Executor.run(Executor.java:442)

---------------------------------------------------------------------
To unsubscribe, e-mail: commits-unsubscribe@activemq.apache.org
For additional commands, e-mail: commits-help@activemq.apache.org
For further information, visit: https://activemq.apache.org/contact



Build failed in Jenkins: ActiveMQ » ActiveMQ-Artemis-JDK8 #727

Posted by Apache Jenkins Server <je...@builds.apache.org>.
See <https://ci-builds.apache.org/job/ActiveMQ/job/ActiveMQ-Artemis-JDK8/727/display/redirect?page=changes>

Changes:

[Clebert Suconic] ARTEMIS-4815 json output into ./artemis queue stat

[Clebert Suconic] Version upgrade

[Clebert Suconic] [maven-release-plugin] prepare release 2.35.0

[Clebert Suconic] [maven-release-plugin] prepare for next development iteration


------------------------------------------
Started by an SCM change
Started by an SCM change
Started by an SCM change
Started by an SCM change
Started by an SCM change
Running as SYSTEM
[EnvInject] - Loading node environment variables.
Building remotely on EC2 (ec2-Jenkins Ephemeral Node User-CLI) - Jenkins Ephemeral Node - ubuntu label (i-04abb1f516e0e463e) (ubuntu ephemeral) in workspace <https://ci-builds.apache.org/job/ActiveMQ/job/ActiveMQ-Artemis-JDK8/ws/>
The recommended git tool is: NONE
No credentials specified
Cloning the remote Git repository
Cloning repository https://gitbox.apache.org/repos/asf/activemq-artemis.git
 > git init <https://ci-builds.apache.org/job/ActiveMQ/job/ActiveMQ-Artemis-JDK8/ws/> # timeout=10
Fetching upstream changes from https://gitbox.apache.org/repos/asf/activemq-artemis.git
 > git --version # timeout=10
 > git --version # 'git version 2.34.1'
 > git fetch --tags --force --progress -- https://gitbox.apache.org/repos/asf/activemq-artemis.git +refs/heads/*:refs/remotes/origin/* # timeout=10
 > git config remote.origin.url https://gitbox.apache.org/repos/asf/activemq-artemis.git # timeout=10
 > git config --add remote.origin.fetch +refs/heads/*:refs/remotes/origin/* # timeout=10
Avoid second fetch
 > git rev-parse refs/remotes/origin/main^{commit} # timeout=10
Checking out Revision f4fd259f0745412496d9e2c14af75b6e832814ee (refs/remotes/origin/main)
 > git config core.sparsecheckout # timeout=10
 > git checkout -f f4fd259f0745412496d9e2c14af75b6e832814ee # timeout=10
Commit message: "[maven-release-plugin] prepare for next development iteration"
 > git rev-list --no-walk e3805bd05adeca495f8cf0ec8b83571cbdff9a9e # timeout=10
[ActiveMQ-Artemis-JDK8] $ /bin/sh -xe /tmp/jenkins13096123499329887902.sh
+ echo ===== Env Details =====
===== Env Details =====
+ java -version
openjdk version "1.8.0_362"
OpenJDK Runtime Environment (Temurin)(build 1.8.0_362-b09)
OpenJDK 64-Bit Server VM (Temurin)(build 25.362-b09, mixed mode)
+ javac -version
javac 1.8.0_362
+ echo JAVA_HOME=/home/jenkins/tools/java/latest1.8
JAVA_HOME=/home/jenkins/tools/java/latest1.8
+ echo PATH=/home/jenkins/tools/maven/latest3/bin:/home/jenkins/tools/java/latest1.8/bin:/usr/local/sbin:/usr/local/bin:/usr/sbin:/usr/bin:/sbin:/bin:/usr/games:/usr/local/games:/snap/bin
PATH=/home/jenkins/tools/maven/latest3/bin:/home/jenkins/tools/java/latest1.8/bin:/usr/local/sbin:/usr/local/bin:/usr/sbin:/usr/bin:/sbin:/bin:/usr/games:/usr/local/games:/snap/bin
+ echo =======================
=======================
Parsing POMs
Downloaded artifact https://repo.maven.apache.org/maven2/org/apache/apache/32/apache-32.pom
Downloaded artifact https://repo.maven.apache.org/maven2/org/eclipse/jetty/jetty-bom/10.0.20/jetty-bom-10.0.20.pom
Modules changed, recalculating dependency graph
Established TCP socket on 34301
maven35-agent.jar already up to date
maven35-interceptor.jar already up to date
maven3-interceptor-commons.jar already up to date
[ActiveMQ-Artemis-JDK8] $ /home/jenkins/tools/java/latest1.8/bin/java -cp /home/jenkins/maven35-agent.jar:/home/jenkins/tools/maven/latest3/boot/plexus-classworlds-2.7.0.jar:/home/jenkins/tools/maven/latest3/conf/logging jenkins.maven3.agent.Maven35Main /home/jenkins/tools/maven/latest3 /tmp/remoting.jar /home/jenkins/maven35-interceptor.jar /home/jenkins/maven3-interceptor-commons.jar 34301
Exception in thread "main" java.lang.UnsupportedClassVersionError: hudson/remoting/Launcher has been compiled by a more recent version of the Java Runtime (class file version 55.0), this version of the Java Runtime only recognizes class file versions up to 52.0
	at java.lang.ClassLoader.defineClass1(Native Method)
	at java.lang.ClassLoader.defineClass(ClassLoader.java:756)
	at java.security.SecureClassLoader.defineClass(SecureClassLoader.java:142)
	at java.net.URLClassLoader.defineClass(URLClassLoader.java:473)
	at java.net.URLClassLoader.access$100(URLClassLoader.java:74)
	at java.net.URLClassLoader$1.run(URLClassLoader.java:369)
	at java.net.URLClassLoader$1.run(URLClassLoader.java:363)
	at java.security.AccessController.doPrivileged(Native Method)
	at java.net.URLClassLoader.findClass(URLClassLoader.java:362)
	at org.codehaus.plexus.classworlds.realm.ClassRealm.findClassInternal(ClassRealm.java:313)
	at org.codehaus.plexus.classworlds.realm.ClassRealm.loadClassFromSelf(ClassRealm.java:432)
	at org.codehaus.plexus.classworlds.strategy.SelfFirstStrategy.loadClass(SelfFirstStrategy.java:42)
	at org.codehaus.plexus.classworlds.realm.ClassRealm.unsynchronizedLoadClass(ClassRealm.java:271)
	at org.codehaus.plexus.classworlds.realm.ClassRealm.loadClass(ClassRealm.java:247)
	at org.codehaus.plexus.classworlds.realm.ClassRealm.loadClass(ClassRealm.java:239)
	at jenkins.maven3.agent.Maven35Main.main(Maven35Main.java:136)
	at jenkins.maven3.agent.Maven35Main.main(Maven35Main.java:66)
ERROR: Failed to parse POMs
java.io.EOFException: unexpected stream termination
	at hudson.remoting.ChannelBuilder.negotiate(ChannelBuilder.java:459)
	at hudson.remoting.ChannelBuilder.build(ChannelBuilder.java:404)
	at hudson.slaves.Channels.forProcess(Channels.java:121)
	at hudson.maven.AbstractMavenProcessFactory.newProcess(AbstractMavenProcessFactory.java:298)
	at hudson.maven.ProcessCache.get(ProcessCache.java:237)
	at hudson.maven.MavenModuleSetBuild$MavenModuleSetBuildExecution.doRun(MavenModuleSetBuild.java:802)
	at hudson.model.AbstractBuild$AbstractBuildExecution.run(AbstractBuild.java:526)
	at hudson.model.Run.execute(Run.java:1841)
	at hudson.maven.MavenModuleSetBuild.run(MavenModuleSetBuild.java:543)
	at hudson.model.ResourceController.execute(ResourceController.java:101)
	at hudson.model.Executor.run(Executor.java:442)

---------------------------------------------------------------------
To unsubscribe, e-mail: commits-unsubscribe@activemq.apache.org
For additional commands, e-mail: commits-help@activemq.apache.org
For further information, visit: https://activemq.apache.org/contact



Build failed in Jenkins: ActiveMQ » ActiveMQ-Artemis-JDK8 #726

Posted by Apache Jenkins Server <je...@builds.apache.org>.
See <https://ci-builds.apache.org/job/ActiveMQ/job/ActiveMQ-Artemis-JDK8/726/display/redirect?page=changes>

Changes:

[Clebert Suconic] ARTEMIS-4795 enforce queue filter when sending to FQQN


------------------------------------------
Started by an SCM change
Running as SYSTEM
[EnvInject] - Loading node environment variables.
Building remotely on builds60 (ubuntu ubuntu-avx) in workspace <https://ci-builds.apache.org/job/ActiveMQ/job/ActiveMQ-Artemis-JDK8/ws/>
The recommended git tool is: NONE
No credentials specified
 > git rev-parse --resolve-git-dir <https://ci-builds.apache.org/job/ActiveMQ/job/ActiveMQ-Artemis-JDK8/ws/.git> # timeout=10
Fetching changes from the remote Git repository
 > git config remote.origin.url https://gitbox.apache.org/repos/asf/activemq-artemis.git # timeout=10
Fetching upstream changes from https://gitbox.apache.org/repos/asf/activemq-artemis.git
 > git --version # timeout=10
 > git --version # 'git version 2.34.1'
 > git fetch --tags --force --progress -- https://gitbox.apache.org/repos/asf/activemq-artemis.git +refs/heads/*:refs/remotes/origin/* # timeout=10
 > git rev-parse refs/remotes/origin/main^{commit} # timeout=10
Checking out Revision e3805bd05adeca495f8cf0ec8b83571cbdff9a9e (refs/remotes/origin/main)
 > git config core.sparsecheckout # timeout=10
 > git checkout -f e3805bd05adeca495f8cf0ec8b83571cbdff9a9e # timeout=10
Commit message: "ARTEMIS-4795 enforce queue filter when sending to FQQN"
 > git rev-list --no-walk 4eb90765a7f2a6ca49664097cad7651cbc3e5439 # timeout=10
[ActiveMQ-Artemis-JDK8] $ /bin/sh -xe /tmp/jenkins8462715139955943943.sh
+ echo ===== Env Details =====
===== Env Details =====
+ java -version
openjdk version "1.8.0_362"
OpenJDK Runtime Environment (Temurin)(build 1.8.0_362-b09)
OpenJDK 64-Bit Server VM (Temurin)(build 25.362-b09, mixed mode)
+ javac -version
javac 1.8.0_362
+ echo JAVA_HOME=/home/jenkins/tools/java/latest1.8
JAVA_HOME=/home/jenkins/tools/java/latest1.8
+ echo PATH=/home/jenkins/tools/maven/latest3/bin:/home/jenkins/tools/java/latest1.8/bin:/usr/local/sbin:/usr/local/bin:/usr/sbin:/usr/bin:/sbin:/bin:/snap/bin
PATH=/home/jenkins/tools/maven/latest3/bin:/home/jenkins/tools/java/latest1.8/bin:/usr/local/sbin:/usr/local/bin:/usr/sbin:/usr/bin:/sbin:/bin:/snap/bin
+ echo =======================
=======================
Parsing POMs
Modules changed, recalculating dependency graph
Established TCP socket on 37563
maven35-agent.jar already up to date
maven35-interceptor.jar already up to date
maven3-interceptor-commons.jar already up to date
[ActiveMQ-Artemis-JDK8] $ /home/jenkins/tools/java/latest1.8/bin/java -cp /home/jenkins/jenkins-agent/maven35-agent.jar:/home/jenkins/tools/maven/latest3/boot/plexus-classworlds-2.7.0.jar:/home/jenkins/tools/maven/latest3/conf/logging jenkins.maven3.agent.Maven35Main /home/jenkins/tools/maven/latest3 /home/jenkins/jenkins-agent/agent.jar /home/jenkins/jenkins-agent/maven35-interceptor.jar /home/jenkins/jenkins-agent/maven3-interceptor-commons.jar 37563
Exception in thread "main" java.lang.UnsupportedClassVersionError: hudson/remoting/Launcher has been compiled by a more recent version of the Java Runtime (class file version 55.0), this version of the Java Runtime only recognizes class file versions up to 52.0
	at java.lang.ClassLoader.defineClass1(Native Method)
	at java.lang.ClassLoader.defineClass(ClassLoader.java:756)
	at java.security.SecureClassLoader.defineClass(SecureClassLoader.java:142)
	at java.net.URLClassLoader.defineClass(URLClassLoader.java:473)
	at java.net.URLClassLoader.access$100(URLClassLoader.java:74)
	at java.net.URLClassLoader$1.run(URLClassLoader.java:369)
	at java.net.URLClassLoader$1.run(URLClassLoader.java:363)
	at java.security.AccessController.doPrivileged(Native Method)
	at java.net.URLClassLoader.findClass(URLClassLoader.java:362)
	at org.codehaus.plexus.classworlds.realm.ClassRealm.findClassInternal(ClassRealm.java:313)
	at org.codehaus.plexus.classworlds.realm.ClassRealm.loadClassFromSelf(ClassRealm.java:432)
	at org.codehaus.plexus.classworlds.strategy.SelfFirstStrategy.loadClass(SelfFirstStrategy.java:42)
	at org.codehaus.plexus.classworlds.realm.ClassRealm.unsynchronizedLoadClass(ClassRealm.java:271)
	at org.codehaus.plexus.classworlds.realm.ClassRealm.loadClass(ClassRealm.java:247)
	at org.codehaus.plexus.classworlds.realm.ClassRealm.loadClass(ClassRealm.java:239)
	at jenkins.maven3.agent.Maven35Main.main(Maven35Main.java:136)
	at jenkins.maven3.agent.Maven35Main.main(Maven35Main.java:66)
ERROR: Failed to parse POMs
java.io.EOFException: unexpected stream termination
	at hudson.remoting.ChannelBuilder.negotiate(ChannelBuilder.java:459)
	at hudson.remoting.ChannelBuilder.build(ChannelBuilder.java:404)
	at hudson.slaves.Channels.forProcess(Channels.java:121)
	at hudson.maven.AbstractMavenProcessFactory.newProcess(AbstractMavenProcessFactory.java:298)
	at hudson.maven.ProcessCache.get(ProcessCache.java:237)
	at hudson.maven.MavenModuleSetBuild$MavenModuleSetBuildExecution.doRun(MavenModuleSetBuild.java:802)
	at hudson.model.AbstractBuild$AbstractBuildExecution.run(AbstractBuild.java:526)
	at hudson.model.Run.execute(Run.java:1841)
	at hudson.maven.MavenModuleSetBuild.run(MavenModuleSetBuild.java:543)
	at hudson.model.ResourceController.execute(ResourceController.java:101)
	at hudson.model.Executor.run(Executor.java:442)

---------------------------------------------------------------------
To unsubscribe, e-mail: commits-unsubscribe@activemq.apache.org
For additional commands, e-mail: commits-help@activemq.apache.org
For further information, visit: https://activemq.apache.org/contact