You are viewing a plain text version of this content. The canonical link for it is here.
Posted to dev@geode.apache.org by Apache Jenkins Server <je...@builds.apache.org> on 2017/06/11 15:29:30 UTC
Build failed in Jenkins: Geode-nightly #863
See <https://builds.apache.org/job/Geode-nightly/863/display/redirect?page=changes>
Changes:
[ukohlmeyer] GEODE-3023: removing incorrect assertion
[ukohlmeyer] GEODE-3065: Making RedisServerTest Flaky, bind exceptions
------------------------------------------
[...truncated 100.92 KB...]
:geode-cq:check
:geode-cq:build
:geode-cq:distributedTest
:geode-cq:integrationTest
:geode-json:assemble
:geode-json:compileTestJava UP-TO-DATE
:geode-json:processTestResources
:geode-json:testClasses
:geode-json:checkMissedTests UP-TO-DATE
:geode-json:spotlessJavaCheck
:geode-json:spotlessCheck
:geode-json:test UP-TO-DATE
:geode-json:check
:geode-json:build
:geode-json:distributedTest UP-TO-DATE
:geode-json:integrationTest UP-TO-DATE
:geode-junit:javadoc
:geode-junit:javadocJar
:geode-junit:sourcesJar
:geode-junit:signArchives SKIPPED
:geode-junit:assemble
:geode-junit:compileTestJava
:geode-junit:processTestResources UP-TO-DATE
:geode-junit:testClasses
:geode-junit:checkMissedTests
:geode-junit:spotlessJavaCheck
:geode-junit:spotlessCheck
:geode-junit:test
:geode-junit:check
:geode-junit:build
:geode-junit:distributedTest
:geode-junit:integrationTest
:geode-lucene:assemble
:geode-lucene:compileTestJavaNote: Some input files use or override a deprecated API.
Note: Recompile with -Xlint:deprecation for details.
Note: Some input files use unchecked or unsafe operations.
Note: Recompile with -Xlint:unchecked for details.
:geode-lucene:processTestResources
:geode-lucene:testClasses
:geode-lucene:checkMissedTests
:geode-lucene:spotlessJavaCheck
:geode-lucene:spotlessCheck
:geode-lucene:test
:geode-lucene:check
:geode-lucene:build
:geode-lucene:distributedTest
:geode-lucene:integrationTest
:geode-old-client-support:assemble
:geode-old-client-support:compileTestJavaNote: <https://builds.apache.org/job/Geode-nightly/ws/geode-old-client-support/src/test/java/com/gemstone/gemfire/cache/execute/FunctionExceptionTest.java> uses or overrides a deprecated API.
Note: Recompile with -Xlint:deprecation for details.
:geode-old-client-support:processTestResources UP-TO-DATE
:geode-old-client-support:testClasses
:geode-old-client-support:checkMissedTests
:geode-old-client-support:spotlessJavaCheck
:geode-old-client-support:spotlessCheck
:geode-old-client-support:test
:geode-old-client-support:check
:geode-old-client-support:build
:geode-old-client-support:distributedTest
:geode-old-client-support:integrationTest
:geode-old-versions:javadoc UP-TO-DATE
:geode-old-versions:javadocJar
:geode-old-versions:sourcesJar
:geode-old-versions:signArchives SKIPPED
:geode-old-versions:assemble
:geode-old-versions:compileTestJava UP-TO-DATE
:geode-old-versions:processTestResources UP-TO-DATE
:geode-old-versions:testClasses UP-TO-DATE
:geode-old-versions:checkMissedTests UP-TO-DATE
:geode-old-versions:spotlessJavaCheck
:geode-old-versions:spotlessCheck
:geode-old-versions:test UP-TO-DATE
:geode-old-versions:check
:geode-old-versions:build
:geode-old-versions:distributedTest UP-TO-DATE
:geode-old-versions:integrationTest UP-TO-DATE
:geode-pulse:assemble
:geode-pulse:compileTestJavaNote: <https://builds.apache.org/job/Geode-nightly/ws/geode-pulse/src/test/java/org/apache/geode/tools/pulse/tests/ui/PulseBase.java> uses or overrides a deprecated API.
Note: Recompile with -Xlint:deprecation for details.
Note: <https://builds.apache.org/job/Geode-nightly/ws/geode-pulse/src/test/java/org/apache/geode/tools/pulse/controllers/PulseControllerJUnitTest.java> uses unchecked or unsafe operations.
Note: Recompile with -Xlint:unchecked for details.
:geode-pulse:processTestResources
:geode-pulse:testClasses
:geode-pulse:checkMissedTests
:geode-pulse:spotlessJavaCheck
:geode-pulse:spotlessCheck
:geode-pulse:test
:geode-pulse:check
:geode-pulse:build
:geode-pulse:distributedTest
:geode-pulse:integrationTest
:geode-rebalancer:assemble
:geode-rebalancer:compileTestJava
:geode-rebalancer:processTestResources UP-TO-DATE
:geode-rebalancer:testClasses
:geode-rebalancer:checkMissedTests
:geode-rebalancer:spotlessJavaCheck
:geode-rebalancer:spotlessCheck
:geode-rebalancer:test
:geode-rebalancer:check
:geode-rebalancer:build
:geode-rebalancer:distributedTest
:geode-rebalancer:integrationTest
:geode-wan:assemble
:geode-wan:compileTestJavaNote: Some input files use or override a deprecated API.
Note: Recompile with -Xlint:deprecation for details.
Note: Some input files use unchecked or unsafe operations.
Note: Recompile with -Xlint:unchecked for details.
:geode-wan:processTestResources
:geode-wan:testClasses
:geode-wan:checkMissedTests
:geode-wan:spotlessJavaCheck
:geode-wan:spotlessCheck
:geode-wan:test
:geode-wan:check
:geode-wan:build
:geode-wan:distributedTest
org.apache.geode.internal.cache.wan.serial.SerialWANPropagationDUnitTest > testReplicatedSerialPropagationWithRemoteRegionDestroy FAILED
org.apache.geode.test.dunit.RMIException: While invoking org.apache.geode.internal.cache.wan.serial.SerialWANPropagationDUnitTest$$Lambda$2298/1215983234.run in VM 4 running on Host asf902.gq1.ygridcore.net with 8 VMs
at org.apache.geode.test.dunit.VM.invoke(VM.java:377)
at org.apache.geode.test.dunit.VM.invoke(VM.java:347)
at org.apache.geode.test.dunit.VM.invoke(VM.java:292)
at org.apache.geode.internal.cache.wan.serial.SerialWANPropagationDUnitTest.testReplicatedSerialPropagationWithRemoteRegionDestroy(SerialWANPropagationDUnitTest.java:408)
Caused by:
java.lang.AssertionError
at org.junit.Assert.fail(Assert.java:86)
at org.junit.Assert.assertTrue(Assert.java:41)
at org.junit.Assert.assertTrue(Assert.java:52)
at org.apache.geode.internal.cache.wan.WANTestBase.verifyRegionQueueNotEmpty(WANTestBase.java:3364)
at org.apache.geode.internal.cache.wan.serial.SerialWANPropagationDUnitTest.lambda$testReplicatedSerialPropagationWithRemoteRegionDestroy$bb17a952$11(SerialWANPropagationDUnitTest.java:408)
585 tests completed, 1 failed, 59 skipped
:geode-wan:distributedTest FAILED
:geode-wan:integrationTest
:geode-web:assemble
:geode-web:compileTestJavaNote: Some input files use or override a deprecated API.
Note: Recompile with -Xlint:deprecation for details.
Note: <https://builds.apache.org/job/Geode-nightly/ws/geode-web/src/test/java/org/apache/geode/management/internal/web/AbstractWebTestCase.java> uses unchecked or unsafe operations.
Note: Recompile with -Xlint:unchecked for details.
:geode-web:processTestResources UP-TO-DATE
:geode-web:testClasses
:geode-web:checkMissedTests
:geode-web:spotlessJavaCheck
:geode-web:spotlessCheck
:geode-web:test
:geode-web:check
:geode-web:build
:geode-web:distributedTest
:geode-web:integrationTest
:geode-web-api:assemble
:geode-web-api:compileTestJava
:geode-web-api:processTestResources UP-TO-DATE
:geode-web-api:testClasses
:geode-web-api:checkMissedTests
:geode-web-api:spotlessJavaCheck
:geode-web-api:spotlessCheck
:geode-web-api:test
:geode-web-api:check
:geode-web-api:build
:geode-web-api:distributedTest
:geode-web-api:integrationTest
:combineReports
All test reports at <https://builds.apache.org/job/Geode-nightly/ws/build/reports/combined>
:extensions/geode-modules:precheckin
:extensions/geode-modules-assembly:precheckin
:extensions/geode-modules-session:precheckin
:extensions/geode-modules-session-internal:precheckin
:extensions/geode-modules-tomcat7:precheckin
:extensions/geode-modules-tomcat8:precheckin
:geode-assembly:precheckin
:geode-benchmarks:precheckin
:geode-common:precheckin
:geode-cq:precheckin
:geode-json:precheckin
:geode-junit:precheckin
:geode-lucene:precheckin
:geode-old-client-support:precheckin
:geode-old-versions:precheckin
:geode-pulse:precheckin
:geode-rebalancer:precheckin
:geode-web:precheckin
:geode-web-api:precheckin
:compileJava UP-TO-DATE
:processResources UP-TO-DATE
:classes UP-TO-DATE
:jar
:uploadArchives
:extensions/geode-modules:uploadArchives
:extensions/geode-modules-assembly:uploadArchives SKIPPED
:extensions/geode-modules-session:uploadArchives
:extensions/geode-modules-session-internal:uploadArchives
:extensions/geode-modules-tomcat7:uploadArchives
:extensions/geode-modules-tomcat8:uploadArchives
:geode-assembly:uploadArchives SKIPPED
:geode-benchmarks:uploadArchives SKIPPED
:geode-common:uploadArchives
:geode-core:uploadArchives
:geode-cq:uploadArchives
:geode-json:uploadArchives
:geode-junit:uploadArchives
:geode-lucene:uploadArchives
:geode-old-client-support:uploadArchives
:geode-old-versions:uploadArchives SKIPPED
:geode-pulse:uploadArchives
:geode-rebalancer:uploadArchives
:geode-wan:uploadArchives
:geode-web:uploadArchives
:geode-web-api:uploadArchives
FAILURE: Build completed with 2 failures.
1: Task failed with an exception.
-----------
* What went wrong:
Execution failed for task ':geode-core:distributedTest'.
> There were failing tests. See the report at: file://<https://builds.apache.org/job/Geode-nightly/ws/geode-core/build/reports/distributedTest/index.html>
* Try:
Run with --stacktrace option to get the stack trace. Run with --info or --debug option to get more log output.
==============================================================================
2: Task failed with an exception.
-----------
* What went wrong:
Execution failed for task ':geode-wan:distributedTest'.
> There were failing tests. See the report at: file://<https://builds.apache.org/job/Geode-nightly/ws/geode-wan/build/reports/distributedTest/index.html>
* Try:
Run with --stacktrace option to get the stack trace. Run with --info or --debug option to get more log output.
==============================================================================
BUILD FAILED
Total time: 11 hrs 44 mins 40.24 secs
Build step 'Invoke Gradle script' changed build result to FAILURE
Build step 'Invoke Gradle script' marked build as failure
Archiving artifacts
Compressed 327.52 MB of artifacts by 43.4% relative to #861
Recording test results
Not sending mail to unregistered user ukohlmeyer@pivotal.io
Not sending mail to unregistered user huynhja@gmail.com
Not sending mail to unregistered user jiliao@pivotal.io
Build failed in Jenkins: Geode-nightly #866
Posted by Apache Jenkins Server <je...@builds.apache.org>.
See <https://builds.apache.org/job/Geode-nightly/866/display/redirect?page=changes>
Changes:
[jiliao] GEODE-2294: revert to avoid rest protocol change
[jiliao] Resolve Eclipse/IntelliJ import order disagreement in style files.
------------------------------------------
[...truncated 134.84 KB...]
at java.net.Socket.connect(Socket.java:538)
at java.net.Socket.<init>(Socket.java:434)
at java.net.Socket.<init>(Socket.java:211)
at sun.rmi.transport.proxy.RMIDirectSocketFactory.createSocket(RMIDirectSocketFactory.java:40)
at sun.rmi.transport.proxy.RMIMasterSocketFactory.createSocket(RMIMasterSocketFactory.java:148)
at sun.rmi.transport.tcp.TCPEndpoint.newSocket(TCPEndpoint.java:613)
... 13 more
org.apache.geode.test.dunit.RMIException: While invoking org.apache.geode.cache.client.internal.LocatorTestBase$1.run in VM 1 running on Host asf912.gq1.ygridcore.net with 4 VMs
Caused by:
java.rmi.ConnectException: Connection refused to host: 67.195.81.156; nested exception is:
java.net.ConnectException: Connection refused (Connection refused)
Caused by:
java.net.ConnectException: Connection refused (Connection refused)
org.apache.geode.rest.internal.web.controllers.RestAPIsWithSSLDUnitTest > testSSLWithoutKeyStoreTypeLegacy[1] FAILED
org.apache.geode.test.dunit.RMIException: While invoking org.apache.geode.test.dunit.NamedRunnable.run in VM 1 running on Host asf912.gq1.ygridcore.net with 4 VMs
at org.apache.geode.test.dunit.VM.execute(VM.java:453)
at org.apache.geode.test.dunit.VM.invoke(VM.java:370)
at org.apache.geode.test.dunit.VM.invoke(VM.java:347)
at org.apache.geode.test.dunit.VM.invoke(VM.java:280)
at org.apache.geode.test.dunit.Invoke.invokeInEveryVM(Invoke.java:57)
at org.apache.geode.test.dunit.internal.JUnit4DistributedTestCase.disconnectAllFromDS(JUnit4DistributedTestCase.java:308)
at org.apache.geode.rest.internal.web.controllers.RestAPIsWithSSLDUnitTest.preSetUp(RestAPIsWithSSLDUnitTest.java:108)
Caused by:
java.rmi.ConnectException: Connection refused to host: 67.195.81.156; nested exception is:
java.net.ConnectException: Connection refused (Connection refused)
at sun.rmi.transport.tcp.TCPEndpoint.newSocket(TCPEndpoint.java:619)
at sun.rmi.transport.tcp.TCPChannel.createConnection(TCPChannel.java:216)
at sun.rmi.transport.tcp.TCPChannel.newConnection(TCPChannel.java:202)
at sun.rmi.server.UnicastRef.invoke(UnicastRef.java:130)
at java.rmi.server.RemoteObjectInvocationHandler.invokeRemoteMethod(RemoteObjectInvocationHandler.java:227)
at java.rmi.server.RemoteObjectInvocationHandler.invoke(RemoteObjectInvocationHandler.java:179)
at com.sun.proxy.$Proxy51.executeMethodOnObject(Unknown Source)
at org.apache.geode.test.dunit.VM.execute(VM.java:450)
... 6 more
Caused by:
java.net.ConnectException: Connection refused (Connection refused)
at java.net.PlainSocketImpl.socketConnect(Native Method)
at java.net.AbstractPlainSocketImpl.doConnect(AbstractPlainSocketImpl.java:350)
at java.net.AbstractPlainSocketImpl.connectToAddress(AbstractPlainSocketImpl.java:206)
at java.net.AbstractPlainSocketImpl.connect(AbstractPlainSocketImpl.java:188)
at java.net.SocksSocketImpl.connect(SocksSocketImpl.java:392)
at java.net.Socket.connect(Socket.java:589)
at java.net.Socket.connect(Socket.java:538)
at java.net.Socket.<init>(Socket.java:434)
at java.net.Socket.<init>(Socket.java:211)
at sun.rmi.transport.proxy.RMIDirectSocketFactory.createSocket(RMIDirectSocketFactory.java:40)
at sun.rmi.transport.proxy.RMIMasterSocketFactory.createSocket(RMIMasterSocketFactory.java:148)
at sun.rmi.transport.tcp.TCPEndpoint.newSocket(TCPEndpoint.java:613)
... 13 more
org.apache.geode.test.dunit.RMIException: While invoking org.apache.geode.cache.client.internal.LocatorTestBase$1.run in VM 1 running on Host asf912.gq1.ygridcore.net with 4 VMs
Caused by:
java.rmi.ConnectException: Connection refused to host: 67.195.81.156; nested exception is:
java.net.ConnectException: Connection refused (Connection refused)
Caused by:
java.net.ConnectException: Connection refused (Connection refused)
org.apache.geode.rest.internal.web.controllers.RestAPIsWithSSLDUnitTest > testMutualAuthentication[1] FAILED
org.apache.geode.test.dunit.RMIException: While invoking org.apache.geode.test.dunit.NamedRunnable.run in VM 1 running on Host asf912.gq1.ygridcore.net with 4 VMs
at org.apache.geode.test.dunit.VM.execute(VM.java:453)
at org.apache.geode.test.dunit.VM.invoke(VM.java:370)
at org.apache.geode.test.dunit.VM.invoke(VM.java:347)
at org.apache.geode.test.dunit.VM.invoke(VM.java:280)
at org.apache.geode.test.dunit.Invoke.invokeInEveryVM(Invoke.java:57)
at org.apache.geode.test.dunit.internal.JUnit4DistributedTestCase.disconnectAllFromDS(JUnit4DistributedTestCase.java:308)
at org.apache.geode.rest.internal.web.controllers.RestAPIsWithSSLDUnitTest.preSetUp(RestAPIsWithSSLDUnitTest.java:108)
Caused by:
java.rmi.ConnectException: Connection refused to host: 67.195.81.156; nested exception is:
java.net.ConnectException: Connection refused (Connection refused)
at sun.rmi.transport.tcp.TCPEndpoint.newSocket(TCPEndpoint.java:619)
at sun.rmi.transport.tcp.TCPChannel.createConnection(TCPChannel.java:216)
at sun.rmi.transport.tcp.TCPChannel.newConnection(TCPChannel.java:202)
at sun.rmi.server.UnicastRef.invoke(UnicastRef.java:130)
at java.rmi.server.RemoteObjectInvocationHandler.invokeRemoteMethod(RemoteObjectInvocationHandler.java:227)
at java.rmi.server.RemoteObjectInvocationHandler.invoke(RemoteObjectInvocationHandler.java:179)
at com.sun.proxy.$Proxy51.executeMethodOnObject(Unknown Source)
at org.apache.geode.test.dunit.VM.execute(VM.java:450)
... 6 more
Caused by:
java.net.ConnectException: Connection refused (Connection refused)
at java.net.PlainSocketImpl.socketConnect(Native Method)
at java.net.AbstractPlainSocketImpl.doConnect(AbstractPlainSocketImpl.java:350)
at java.net.AbstractPlainSocketImpl.connectToAddress(AbstractPlainSocketImpl.java:206)
at java.net.AbstractPlainSocketImpl.connect(AbstractPlainSocketImpl.java:188)
at java.net.SocksSocketImpl.connect(SocksSocketImpl.java:392)
at java.net.Socket.connect(Socket.java:589)
at java.net.Socket.connect(Socket.java:538)
at java.net.Socket.<init>(Socket.java:434)
at java.net.Socket.<init>(Socket.java:211)
at sun.rmi.transport.proxy.RMIDirectSocketFactory.createSocket(RMIDirectSocketFactory.java:40)
at sun.rmi.transport.proxy.RMIMasterSocketFactory.createSocket(RMIMasterSocketFactory.java:148)
at sun.rmi.transport.tcp.TCPEndpoint.newSocket(TCPEndpoint.java:613)
... 13 more
org.apache.geode.test.dunit.RMIException: While invoking org.apache.geode.cache.client.internal.LocatorTestBase$1.run in VM 1 running on Host asf912.gq1.ygridcore.net with 4 VMs
Caused by:
java.rmi.ConnectException: Connection refused to host: 67.195.81.156; nested exception is:
java.net.ConnectException: Connection refused (Connection refused)
Caused by:
java.net.ConnectException: Connection refused (Connection refused)
org.apache.geode.rest.internal.web.controllers.RestAPIsAndInterOpsDUnitTest > testInterOpsWithReplicatedRegion[0] FAILED
org.apache.geode.test.dunit.RMIException: While invoking org.apache.geode.test.dunit.NamedRunnable.run in VM 1 running on Host asf912.gq1.ygridcore.net with 4 VMs
Caused by:
java.rmi.ConnectException: Connection refused to host: 67.195.81.156; nested exception is:
java.net.ConnectException: Connection refused (Connection refused)
Caused by:
java.net.ConnectException: Connection refused (Connection refused)
org.apache.geode.test.dunit.RMIException: While invoking org.apache.geode.cache.client.internal.LocatorTestBase$1.run in VM 1 running on Host asf912.gq1.ygridcore.net with 4 VMs
Caused by:
java.rmi.ConnectException: Connection refused to host: 67.195.81.156; nested exception is:
java.net.ConnectException: Connection refused (Connection refused)
Caused by:
java.net.ConnectException: Connection refused (Connection refused)
org.apache.geode.rest.internal.web.controllers.RestAPIsAndInterOpsDUnitTest > testInterOpsWithReplicatedRegion[1] FAILED
org.apache.geode.test.dunit.RMIException: While invoking org.apache.geode.test.dunit.NamedRunnable.run in VM 1 running on Host asf912.gq1.ygridcore.net with 4 VMs
Caused by:
java.rmi.ConnectException: Connection refused to host: 67.195.81.156; nested exception is:
java.net.ConnectException: Connection refused (Connection refused)
Caused by:
java.net.ConnectException: Connection refused (Connection refused)
org.apache.geode.test.dunit.RMIException: While invoking org.apache.geode.cache.client.internal.LocatorTestBase$1.run in VM 1 running on Host asf912.gq1.ygridcore.net with 4 VMs
Caused by:
java.rmi.ConnectException: Connection refused to host: 67.195.81.156; nested exception is:
java.net.ConnectException: Connection refused (Connection refused)
Caused by:
java.net.ConnectException: Connection refused (Connection refused)
org.apache.geode.rest.internal.web.controllers.RestAPIsOnGroupsFunctionExecutionDUnitTest > testBasicP2PFunctionSelectedGroup[0] FAILED
org.apache.geode.test.dunit.RMIException: While invoking org.apache.geode.test.dunit.NamedRunnable.run in VM 1 running on Host asf912.gq1.ygridcore.net with 4 VMs
Caused by:
java.rmi.ConnectException: Connection refused to host: 67.195.81.156; nested exception is:
java.net.ConnectException: Connection refused (Connection refused)
Caused by:
java.net.ConnectException: Connection refused (Connection refused)
java.lang.NullPointerException
org.apache.geode.rest.internal.web.controllers.RestAPIsOnGroupsFunctionExecutionDUnitTest > testonGroupsExecutionOnAllMembers[0] FAILED
org.apache.geode.test.dunit.RMIException: While invoking org.apache.geode.test.dunit.NamedRunnable.run in VM 1 running on Host asf912.gq1.ygridcore.net with 4 VMs
Caused by:
java.rmi.ConnectException: Connection refused to host: 67.195.81.156; nested exception is:
java.net.ConnectException: Connection refused (Connection refused)
Caused by:
java.net.ConnectException: Connection refused (Connection refused)
java.lang.NullPointerException
org.apache.geode.rest.internal.web.controllers.RestAPIsOnGroupsFunctionExecutionDUnitTest > testBasicP2PFunctionSelectedGroup[1] FAILED
org.apache.geode.test.dunit.RMIException: While invoking org.apache.geode.test.dunit.NamedRunnable.run in VM 1 running on Host asf912.gq1.ygridcore.net with 4 VMs
Caused by:
java.rmi.ConnectException: Connection refused to host: 67.195.81.156; nested exception is:
java.net.ConnectException: Connection refused (Connection refused)
Caused by:
java.net.ConnectException: Connection refused (Connection refused)
java.lang.NullPointerException
org.apache.geode.rest.internal.web.controllers.RestAPIsOnGroupsFunctionExecutionDUnitTest > testonGroupsExecutionOnAllMembers[1] FAILED
org.apache.geode.test.dunit.RMIException: While invoking org.apache.geode.test.dunit.NamedRunnable.run in VM 1 running on Host asf912.gq1.ygridcore.net with 4 VMs
Caused by:
java.rmi.ConnectException: Connection refused to host: 67.195.81.156; nested exception is:
java.net.ConnectException: Connection refused (Connection refused)
Caused by:
java.net.ConnectException: Connection refused (Connection refused)
java.lang.NullPointerException
82 tests completed, 10 failed
:geode-assembly:distributedTest FAILED
:geode-assembly:integrationTest
:geode-benchmarks:jar
:geode-benchmarks:javadoc UP-TO-DATE
:geode-benchmarks:javadocJar
:geode-benchmarks:sourcesJar
:geode-benchmarks:signArchives SKIPPED
:geode-benchmarks:assemble
:geode-benchmarks:compileTestJava UP-TO-DATE
:geode-benchmarks:processTestResources UP-TO-DATE
:geode-benchmarks:testClasses UP-TO-DATE
:geode-benchmarks:checkMissedTests UP-TO-DATE
:geode-benchmarks:spotlessJavaCheck
:geode-benchmarks:spotlessCheck
:geode-benchmarks:test UP-TO-DATE
:geode-benchmarks:check
:geode-benchmarks:build
:geode-benchmarks:distributedTest UP-TO-DATE
:geode-benchmarks:integrationTest UP-TO-DATE
:geode-common:assemble
:geode-common:compileTestJava
:geode-common:processTestResources UP-TO-DATE
:geode-common:testClasses
:geode-common:checkMissedTests
:geode-common:spotlessJavaCheck
:geode-common:spotlessCheck
:geode-common:test
:geode-common:check
:geode-common:build
:geode-common:distributedTest
:geode-common:integrationTest
:geode-core:assemble
:geode-core:checkMissedTests
Download https://repo1.maven.org/maven2/org/apache/derby/derby/10.13.1.1/derby-10.13.1.1.pom
Download https://repo1.maven.org/maven2/org/apache/derby/derby-project/10.13.1.1/derby-project-10.13.1.1.pom
Download https://repo1.maven.org/maven2/org/apache/derby/derby/10.13.1.1/derby-10.13.1.1.jar
:geode-core:spotlessJavaCheck
:geode-core:spotlessCheck
:geode-core:test
:geode-core:check
:geode-core:build
Build timed out (after 1,440 minutes). Marking the build as failed.
:geode-core:distributedTestBuild was aborted
Archiving artifacts
Compressed 324.96 MB of artifacts by 37.7% relative to #861
Recording test results
Not sending mail to unregistered user ukohlmeyer@pivotal.io
Not sending mail to unregistered user huynhja@gmail.com
Not sending mail to unregistered user jiliao@pivotal.io
Re: Build failed in Jenkins: Geode-nightly #865
Posted by Kirk Lund <kl...@apache.org>.
Thanks Mark!
On Tue, Jun 13, 2017 at 10:11 AM, Mark Bretl <as...@gmail.com> wrote:
> Done
>
> --Mark
>
> On Tue, Jun 13, 2017 at 9:58 AM, Kirk Lund <kl...@apache.org> wrote:
>
> > Can someone with Jenkins permissions please excluded mesos2 from being
> used
> > for our nightly builds?
> >
> > ERROR: JAVA_HOME is set to an invalid directory:
> /home/jenkins/tools/java/
> > latest1.8
> >
> > ---------- Forwarded message ----------
> > From: Apache Jenkins Server <je...@builds.apache.org>
> > Date: Mon, Jun 12, 2017 at 8:42 PM
> > Subject: Build failed in Jenkins: Geode-nightly #865
> > To: dev@geode.apache.org, kmiller@pivotal.io, jstewart@pivotal.io,
> > dbarnes@pivotal.io, klund@pivotal.io, khowe@apache.org, nnag@pivotal.io,
> > bschuchardt@pivotal.io
> >
> >
> > See <https://builds.apache.org/job/Geode-nightly/865/display/
> > redirect?page=changes>
> >
> > Changes:
> >
> > [jiliao] GEODE-2925: add target for resource operation for finer grained
> > security
> >
> > [dbarnes] Update geode-book README instructions
> >
> > [klund] GEODE-290: Remove deprecated methods from launcher classes
> >
> > [jiliao] GEODE-2928: get rid of the isGfshVM static variable
> >
> > [jiliao] GEODE-2928: get rid of the isGfshVM static variable - fix merge
> > issues
> >
> > [nnag] GEODE-3066: Test tweaks to stabilize it.
> >
> > [jstewart] GEODE-3048: Introduce a rule to identify tests that require
> > GEODE_HOME
> >
> > [klund] GEODE-3068: fix alphabetic ordering
> >
> > ------------------------------------------
> > Started by timer
> > [EnvInject] - Loading node environment variables.
> > Building remotely on mesos2 (mesos s390x) in workspace <
> > https://builds.apache.org/job/Geode-nightly/ws/>
> > > git rev-parse --is-inside-work-tree # timeout=10
> > Fetching changes from the remote Git repository
> > > git config remote.origin.url https://git-wip-us.apache.org/
> > repos/asf/geode.git # timeout=10
> > Fetching upstream changes from https://git-wip-us.apache.org/
> > repos/asf/geode.git
> > > git --version # timeout=10
> > > git fetch --tags --progress https://git-wip-us.apache.org/
> > repos/asf/geode.git +refs/heads/*:refs/remotes/origin/*
> > > git rev-parse refs/remotes/origin/develop^{commit} # timeout=10
> > > git rev-parse refs/remotes/origin/origin/develop^{commit} #
> timeout=10
> > Checking out Revision 65471c1174df161c46237f87145d81d27a1663a9
> > (refs/remotes/origin/develop)
> > > git config core.sparsecheckout # timeout=10
> > > git checkout -f 65471c1174df161c46237f87145d81d27a1663a9
> > > git branch -a -v --no-abbrev # timeout=10
> > > git branch -D develop # timeout=10
> > > git checkout -b develop 65471c1174df161c46237f87145d81d27a1663a9
> > > git rev-list 122b07afde7cd56898fae354fadc78fdd5dc721d # timeout=10
> > [Geode-nightly] $ /bin/bash -xe /tmp/hudson4018735290081826255.sh
> > + git clean -d -f gemfire-pulse/src/main/resources/
> > [Gradle] - Launching build.
> > [Geode-nightly] $ <https://builds.apache.org/
> job/Geode-nightly/ws/gradlew>
> > --no-daemon clean precheckin distTar distZip uploadArchives -xflakyTest
> >
> > ERROR: JAVA_HOME is set to an invalid directory:
> /home/jenkins/tools/java/
> > latest1.8
> >
> > Please set the JAVA_HOME variable in your environment to match the
> > location of your Java installation.
> >
> > Build step 'Invoke Gradle script' changed build result to FAILURE
> > Build step 'Invoke Gradle script' marked build as failure
> > Archiving artifacts
> > Recording test results
> > ERROR: Step ?Publish JUnit test result report? failed: No test report
> files
> > were found. Configuration error?
> > Not sending mail to unregistered user ukohlmeyer@pivotal.io
> > Not sending mail to unregistered user huynhja@gmail.com
> > Not sending mail to unregistered user jiliao@pivotal.io
> >
>
Re: Build failed in Jenkins: Geode-nightly #865
Posted by Mark Bretl <as...@gmail.com>.
Done
--Mark
On Tue, Jun 13, 2017 at 9:58 AM, Kirk Lund <kl...@apache.org> wrote:
> Can someone with Jenkins permissions please excluded mesos2 from being used
> for our nightly builds?
>
> ERROR: JAVA_HOME is set to an invalid directory: /home/jenkins/tools/java/
> latest1.8
>
> ---------- Forwarded message ----------
> From: Apache Jenkins Server <je...@builds.apache.org>
> Date: Mon, Jun 12, 2017 at 8:42 PM
> Subject: Build failed in Jenkins: Geode-nightly #865
> To: dev@geode.apache.org, kmiller@pivotal.io, jstewart@pivotal.io,
> dbarnes@pivotal.io, klund@pivotal.io, khowe@apache.org, nnag@pivotal.io,
> bschuchardt@pivotal.io
>
>
> See <https://builds.apache.org/job/Geode-nightly/865/display/
> redirect?page=changes>
>
> Changes:
>
> [jiliao] GEODE-2925: add target for resource operation for finer grained
> security
>
> [dbarnes] Update geode-book README instructions
>
> [klund] GEODE-290: Remove deprecated methods from launcher classes
>
> [jiliao] GEODE-2928: get rid of the isGfshVM static variable
>
> [jiliao] GEODE-2928: get rid of the isGfshVM static variable - fix merge
> issues
>
> [nnag] GEODE-3066: Test tweaks to stabilize it.
>
> [jstewart] GEODE-3048: Introduce a rule to identify tests that require
> GEODE_HOME
>
> [klund] GEODE-3068: fix alphabetic ordering
>
> ------------------------------------------
> Started by timer
> [EnvInject] - Loading node environment variables.
> Building remotely on mesos2 (mesos s390x) in workspace <
> https://builds.apache.org/job/Geode-nightly/ws/>
> > git rev-parse --is-inside-work-tree # timeout=10
> Fetching changes from the remote Git repository
> > git config remote.origin.url https://git-wip-us.apache.org/
> repos/asf/geode.git # timeout=10
> Fetching upstream changes from https://git-wip-us.apache.org/
> repos/asf/geode.git
> > git --version # timeout=10
> > git fetch --tags --progress https://git-wip-us.apache.org/
> repos/asf/geode.git +refs/heads/*:refs/remotes/origin/*
> > git rev-parse refs/remotes/origin/develop^{commit} # timeout=10
> > git rev-parse refs/remotes/origin/origin/develop^{commit} # timeout=10
> Checking out Revision 65471c1174df161c46237f87145d81d27a1663a9
> (refs/remotes/origin/develop)
> > git config core.sparsecheckout # timeout=10
> > git checkout -f 65471c1174df161c46237f87145d81d27a1663a9
> > git branch -a -v --no-abbrev # timeout=10
> > git branch -D develop # timeout=10
> > git checkout -b develop 65471c1174df161c46237f87145d81d27a1663a9
> > git rev-list 122b07afde7cd56898fae354fadc78fdd5dc721d # timeout=10
> [Geode-nightly] $ /bin/bash -xe /tmp/hudson4018735290081826255.sh
> + git clean -d -f gemfire-pulse/src/main/resources/
> [Gradle] - Launching build.
> [Geode-nightly] $ <https://builds.apache.org/job/Geode-nightly/ws/gradlew>
> --no-daemon clean precheckin distTar distZip uploadArchives -xflakyTest
>
> ERROR: JAVA_HOME is set to an invalid directory: /home/jenkins/tools/java/
> latest1.8
>
> Please set the JAVA_HOME variable in your environment to match the
> location of your Java installation.
>
> Build step 'Invoke Gradle script' changed build result to FAILURE
> Build step 'Invoke Gradle script' marked build as failure
> Archiving artifacts
> Recording test results
> ERROR: Step ?Publish JUnit test result report? failed: No test report files
> were found. Configuration error?
> Not sending mail to unregistered user ukohlmeyer@pivotal.io
> Not sending mail to unregistered user huynhja@gmail.com
> Not sending mail to unregistered user jiliao@pivotal.io
>
Fwd: Build failed in Jenkins: Geode-nightly #865
Posted by Kirk Lund <kl...@apache.org>.
Can someone with Jenkins permissions please excluded mesos2 from being used
for our nightly builds?
ERROR: JAVA_HOME is set to an invalid directory: /home/jenkins/tools/java/
latest1.8
---------- Forwarded message ----------
From: Apache Jenkins Server <je...@builds.apache.org>
Date: Mon, Jun 12, 2017 at 8:42 PM
Subject: Build failed in Jenkins: Geode-nightly #865
To: dev@geode.apache.org, kmiller@pivotal.io, jstewart@pivotal.io,
dbarnes@pivotal.io, klund@pivotal.io, khowe@apache.org, nnag@pivotal.io,
bschuchardt@pivotal.io
See <https://builds.apache.org/job/Geode-nightly/865/display/
redirect?page=changes>
Changes:
[jiliao] GEODE-2925: add target for resource operation for finer grained
security
[dbarnes] Update geode-book README instructions
[klund] GEODE-290: Remove deprecated methods from launcher classes
[jiliao] GEODE-2928: get rid of the isGfshVM static variable
[jiliao] GEODE-2928: get rid of the isGfshVM static variable - fix merge
issues
[nnag] GEODE-3066: Test tweaks to stabilize it.
[jstewart] GEODE-3048: Introduce a rule to identify tests that require
GEODE_HOME
[klund] GEODE-3068: fix alphabetic ordering
------------------------------------------
Started by timer
[EnvInject] - Loading node environment variables.
Building remotely on mesos2 (mesos s390x) in workspace <
https://builds.apache.org/job/Geode-nightly/ws/>
> git rev-parse --is-inside-work-tree # timeout=10
Fetching changes from the remote Git repository
> git config remote.origin.url https://git-wip-us.apache.org/
repos/asf/geode.git # timeout=10
Fetching upstream changes from https://git-wip-us.apache.org/
repos/asf/geode.git
> git --version # timeout=10
> git fetch --tags --progress https://git-wip-us.apache.org/
repos/asf/geode.git +refs/heads/*:refs/remotes/origin/*
> git rev-parse refs/remotes/origin/develop^{commit} # timeout=10
> git rev-parse refs/remotes/origin/origin/develop^{commit} # timeout=10
Checking out Revision 65471c1174df161c46237f87145d81d27a1663a9
(refs/remotes/origin/develop)
> git config core.sparsecheckout # timeout=10
> git checkout -f 65471c1174df161c46237f87145d81d27a1663a9
> git branch -a -v --no-abbrev # timeout=10
> git branch -D develop # timeout=10
> git checkout -b develop 65471c1174df161c46237f87145d81d27a1663a9
> git rev-list 122b07afde7cd56898fae354fadc78fdd5dc721d # timeout=10
[Geode-nightly] $ /bin/bash -xe /tmp/hudson4018735290081826255.sh
+ git clean -d -f gemfire-pulse/src/main/resources/
[Gradle] - Launching build.
[Geode-nightly] $ <https://builds.apache.org/job/Geode-nightly/ws/gradlew>
--no-daemon clean precheckin distTar distZip uploadArchives -xflakyTest
ERROR: JAVA_HOME is set to an invalid directory: /home/jenkins/tools/java/
latest1.8
Please set the JAVA_HOME variable in your environment to match the
location of your Java installation.
Build step 'Invoke Gradle script' changed build result to FAILURE
Build step 'Invoke Gradle script' marked build as failure
Archiving artifacts
Recording test results
ERROR: Step ?Publish JUnit test result report? failed: No test report files
were found. Configuration error?
Not sending mail to unregistered user ukohlmeyer@pivotal.io
Not sending mail to unregistered user huynhja@gmail.com
Not sending mail to unregistered user jiliao@pivotal.io
Build failed in Jenkins: Geode-nightly #865
Posted by Apache Jenkins Server <je...@builds.apache.org>.
See <https://builds.apache.org/job/Geode-nightly/865/display/redirect?page=changes>
Changes:
[jiliao] GEODE-2925: add target for resource operation for finer grained security
[dbarnes] Update geode-book README instructions
[klund] GEODE-290: Remove deprecated methods from launcher classes
[jiliao] GEODE-2928: get rid of the isGfshVM static variable
[jiliao] GEODE-2928: get rid of the isGfshVM static variable - fix merge issues
[nnag] GEODE-3066: Test tweaks to stabilize it.
[jstewart] GEODE-3048: Introduce a rule to identify tests that require GEODE_HOME
[klund] GEODE-3068: fix alphabetic ordering
------------------------------------------
Started by timer
[EnvInject] - Loading node environment variables.
Building remotely on mesos2 (mesos s390x) in workspace <https://builds.apache.org/job/Geode-nightly/ws/>
> git rev-parse --is-inside-work-tree # timeout=10
Fetching changes from the remote Git repository
> git config remote.origin.url https://git-wip-us.apache.org/repos/asf/geode.git # timeout=10
Fetching upstream changes from https://git-wip-us.apache.org/repos/asf/geode.git
> git --version # timeout=10
> git fetch --tags --progress https://git-wip-us.apache.org/repos/asf/geode.git +refs/heads/*:refs/remotes/origin/*
> git rev-parse refs/remotes/origin/develop^{commit} # timeout=10
> git rev-parse refs/remotes/origin/origin/develop^{commit} # timeout=10
Checking out Revision 65471c1174df161c46237f87145d81d27a1663a9 (refs/remotes/origin/develop)
> git config core.sparsecheckout # timeout=10
> git checkout -f 65471c1174df161c46237f87145d81d27a1663a9
> git branch -a -v --no-abbrev # timeout=10
> git branch -D develop # timeout=10
> git checkout -b develop 65471c1174df161c46237f87145d81d27a1663a9
> git rev-list 122b07afde7cd56898fae354fadc78fdd5dc721d # timeout=10
[Geode-nightly] $ /bin/bash -xe /tmp/hudson4018735290081826255.sh
+ git clean -d -f gemfire-pulse/src/main/resources/
[Gradle] - Launching build.
[Geode-nightly] $ <https://builds.apache.org/job/Geode-nightly/ws/gradlew> --no-daemon clean precheckin distTar distZip uploadArchives -xflakyTest
ERROR: JAVA_HOME is set to an invalid directory: /home/jenkins/tools/java/latest1.8
Please set the JAVA_HOME variable in your environment to match the
location of your Java installation.
Build step 'Invoke Gradle script' changed build result to FAILURE
Build step 'Invoke Gradle script' marked build as failure
Archiving artifacts
Recording test results
ERROR: Step ?Publish JUnit test result report? failed: No test report files were found. Configuration error?
Not sending mail to unregistered user ukohlmeyer@pivotal.io
Not sending mail to unregistered user huynhja@gmail.com
Not sending mail to unregistered user jiliao@pivotal.io
Re: Build failed in Jenkins: Geode-nightly #864
Posted by Jason Huynh <jh...@pivotal.io>.
I've created a ticket for the failing wan test: GEODE-3066
<https://issues.apache.org/jira/browse/GEODE-3066>
On Mon, Jun 12, 2017 at 8:34 AM Apache Jenkins Server <
jenkins@builds.apache.org> wrote:
> See <https://builds.apache.org/job/Geode-nightly/864/display/redirect>
>
> ------------------------------------------
> [...truncated 96.86 KB...]
> :geode-cq:assemble
> :geode-cq:compileTestJavaNote: Some input files use or override a
> deprecated API.
> Note: Recompile with -Xlint:deprecation for details.
> Note: Some input files use unchecked or unsafe operations.
> Note: Recompile with -Xlint:unchecked for details.
>
> :geode-cq:processTestResources
> :geode-cq:testClasses
> :geode-cq:checkMissedTests
> :geode-cq:spotlessJavaCheck
> :geode-cq:spotlessCheck
> :geode-cq:test
> :geode-cq:check
> :geode-cq:build
> :geode-cq:distributedTest
> :geode-cq:integrationTest
> :geode-json:assemble
> :geode-json:compileTestJava UP-TO-DATE
> :geode-json:processTestResources
> :geode-json:testClasses
> :geode-json:checkMissedTests UP-TO-DATE
> :geode-json:spotlessJavaCheck
> :geode-json:spotlessCheck
> :geode-json:test UP-TO-DATE
> :geode-json:check
> :geode-json:build
> :geode-json:distributedTest UP-TO-DATE
> :geode-json:integrationTest UP-TO-DATE
> :geode-junit:javadoc
> :geode-junit:javadocJar
> :geode-junit:sourcesJar
> :geode-junit:signArchives SKIPPED
> :geode-junit:assemble
> :geode-junit:compileTestJava
> :geode-junit:processTestResources UP-TO-DATE
> :geode-junit:testClasses
> :geode-junit:checkMissedTests
> :geode-junit:spotlessJavaCheck
> :geode-junit:spotlessCheck
> :geode-junit:test
> :geode-junit:check
> :geode-junit:build
> :geode-junit:distributedTest
> :geode-junit:integrationTest
> :geode-lucene:assemble
> :geode-lucene:compileTestJavaNote: Some input files use or override a
> deprecated API.
> Note: Recompile with -Xlint:deprecation for details.
> Note: Some input files use unchecked or unsafe operations.
> Note: Recompile with -Xlint:unchecked for details.
>
> :geode-lucene:processTestResources
> :geode-lucene:testClasses
> :geode-lucene:checkMissedTests
> :geode-lucene:spotlessJavaCheck
> :geode-lucene:spotlessCheck
> :geode-lucene:test
> :geode-lucene:check
> :geode-lucene:build
> :geode-lucene:distributedTest
> :geode-lucene:integrationTest
> :geode-old-client-support:assemble
> :geode-old-client-support:compileTestJavaNote: <
> https://builds.apache.org/job/Geode-nightly/ws/geode-old-client-support/src/test/java/com/gemstone/gemfire/cache/execute/FunctionExceptionTest.java>
> uses or overrides a deprecated API.
> Note: Recompile with -Xlint:deprecation for details.
>
> :geode-old-client-support:processTestResources UP-TO-DATE
> :geode-old-client-support:testClasses
> :geode-old-client-support:checkMissedTests
> :geode-old-client-support:spotlessJavaCheck
> :geode-old-client-support:spotlessCheck
> :geode-old-client-support:test
> :geode-old-client-support:check
> :geode-old-client-support:build
> :geode-old-client-support:distributedTest
> :geode-old-client-support:integrationTest
> :geode-old-versions:javadoc UP-TO-DATE
> :geode-old-versions:javadocJar
> :geode-old-versions:sourcesJar
> :geode-old-versions:signArchives SKIPPED
> :geode-old-versions:assemble
> :geode-old-versions:compileTestJava UP-TO-DATE
> :geode-old-versions:processTestResources UP-TO-DATE
> :geode-old-versions:testClasses UP-TO-DATE
> :geode-old-versions:checkMissedTests UP-TO-DATE
> :geode-old-versions:spotlessJavaCheck
> :geode-old-versions:spotlessCheck
> :geode-old-versions:test UP-TO-DATE
> :geode-old-versions:check
> :geode-old-versions:build
> :geode-old-versions:distributedTest UP-TO-DATE
> :geode-old-versions:integrationTest UP-TO-DATE
> :geode-pulse:assemble
> :geode-pulse:compileTestJavaNote: <
> https://builds.apache.org/job/Geode-nightly/ws/geode-pulse/src/test/java/org/apache/geode/tools/pulse/tests/ui/PulseBase.java>
> uses or overrides a deprecated API.
> Note: Recompile with -Xlint:deprecation for details.
> Note: <
> https://builds.apache.org/job/Geode-nightly/ws/geode-pulse/src/test/java/org/apache/geode/tools/pulse/controllers/PulseControllerJUnitTest.java>
> uses unchecked or unsafe operations.
> Note: Recompile with -Xlint:unchecked for details.
>
> :geode-pulse:processTestResources
> :geode-pulse:testClasses
> :geode-pulse:checkMissedTests
> :geode-pulse:spotlessJavaCheck
> :geode-pulse:spotlessCheck
> :geode-pulse:test
> :geode-pulse:check
> :geode-pulse:build
> :geode-pulse:distributedTest
> :geode-pulse:integrationTest
> :geode-rebalancer:assemble
> :geode-rebalancer:compileTestJava
> :geode-rebalancer:processTestResources UP-TO-DATE
> :geode-rebalancer:testClasses
> :geode-rebalancer:checkMissedTests
> :geode-rebalancer:spotlessJavaCheck
> :geode-rebalancer:spotlessCheck
> :geode-rebalancer:test
> :geode-rebalancer:check
> :geode-rebalancer:build
> :geode-rebalancer:distributedTest
> :geode-rebalancer:integrationTest
> :geode-wan:assemble
> :geode-wan:compileTestJavaNote: Some input files use or override a
> deprecated API.
> Note: Recompile with -Xlint:deprecation for details.
> Note: Some input files use unchecked or unsafe operations.
> Note: Recompile with -Xlint:unchecked for details.
>
> :geode-wan:processTestResources
> :geode-wan:testClasses
> :geode-wan:checkMissedTests
> :geode-wan:spotlessJavaCheck
> :geode-wan:spotlessCheck
> :geode-wan:test
> :geode-wan:check
> :geode-wan:build
> :geode-wan:distributedTest
>
> org.apache.geode.internal.cache.wan.serial.SerialWANPropagationDUnitTest >
> testReplicatedSerialPropagationWithRemoteRegionDestroy FAILED
> org.apache.geode.test.dunit.RMIException: While invoking
> org.apache.geode.internal.cache.wan.serial.SerialWANPropagationDUnitTest$$Lambda$2298/1990164334.run
> in VM 4 running on Host asf902.gq1.ygridcore.net with 8 VMs
> at org.apache.geode.test.dunit.VM.invoke(VM.java:377)
> at org.apache.geode.test.dunit.VM.invoke(VM.java:347)
> at org.apache.geode.test.dunit.VM.invoke(VM.java:292)
> at
> org.apache.geode.internal.cache.wan.serial.SerialWANPropagationDUnitTest.testReplicatedSerialPropagationWithRemoteRegionDestroy(SerialWANPropagationDUnitTest.java:408)
>
> Caused by:
> java.lang.AssertionError
> at org.junit.Assert.fail(Assert.java:86)
> at org.junit.Assert.assertTrue(Assert.java:41)
> at org.junit.Assert.assertTrue(Assert.java:52)
> at
> org.apache.geode.internal.cache.wan.WANTestBase.verifyRegionQueueNotEmpty(WANTestBase.java:3364)
> at
> org.apache.geode.internal.cache.wan.serial.SerialWANPropagationDUnitTest.lambda$testReplicatedSerialPropagationWithRemoteRegionDestroy$bb17a952$11(SerialWANPropagationDUnitTest.java:408)
>
> 585 tests completed, 1 failed, 59 skipped
> :geode-wan:distributedTest FAILED
> :geode-wan:integrationTest
> :geode-web:assemble
> :geode-web:compileTestJavaNote: Some input files use or override a
> deprecated API.
> Note: Recompile with -Xlint:deprecation for details.
> Note: <
> https://builds.apache.org/job/Geode-nightly/ws/geode-web/src/test/java/org/apache/geode/management/internal/web/AbstractWebTestCase.java>
> uses unchecked or unsafe operations.
> Note: Recompile with -Xlint:unchecked for details.
>
> :geode-web:processTestResources UP-TO-DATE
> :geode-web:testClasses
> :geode-web:checkMissedTests
> :geode-web:spotlessJavaCheck
> :geode-web:spotlessCheck
> :geode-web:test
> :geode-web:check
> :geode-web:build
> :geode-web:distributedTest
> :geode-web:integrationTest
> :geode-web-api:assemble
> :geode-web-api:compileTestJava
> :geode-web-api:processTestResources UP-TO-DATE
> :geode-web-api:testClasses
> :geode-web-api:checkMissedTests
> :geode-web-api:spotlessJavaCheck
> :geode-web-api:spotlessCheck
> :geode-web-api:test
> :geode-web-api:check
> :geode-web-api:build
> :geode-web-api:distributedTest
> :geode-web-api:integrationTest
> :combineReports
> All test reports at <
> https://builds.apache.org/job/Geode-nightly/ws/build/reports/combined>
> :extensions/geode-modules:precheckin
> :extensions/geode-modules-assembly:precheckin
> :extensions/geode-modules-session:precheckin
> :extensions/geode-modules-session-internal:precheckin
> :extensions/geode-modules-tomcat7:precheckin
> :extensions/geode-modules-tomcat8:precheckin
> :geode-assembly:precheckin
> :geode-benchmarks:precheckin
> :geode-common:precheckin
> :geode-core:precheckin
> :geode-cq:precheckin
> :geode-json:precheckin
> :geode-junit:precheckin
> :geode-lucene:precheckin
> :geode-old-client-support:precheckin
> :geode-old-versions:precheckin
> :geode-pulse:precheckin
> :geode-rebalancer:precheckin
> :geode-web:precheckin
> :geode-web-api:precheckin
> :compileJava UP-TO-DATE
> :processResources UP-TO-DATE
> :classes UP-TO-DATE
> :jar
> :uploadArchives
> :extensions/geode-modules:uploadArchives
> :extensions/geode-modules-assembly:uploadArchives SKIPPED
> :extensions/geode-modules-session:uploadArchives
> :extensions/geode-modules-session-internal:uploadArchives
> :extensions/geode-modules-tomcat7:uploadArchives
> :extensions/geode-modules-tomcat8:uploadArchives
> :geode-assembly:uploadArchives SKIPPED
> :geode-benchmarks:uploadArchives SKIPPED
> :geode-common:uploadArchives
> :geode-core:uploadArchives
> :geode-cq:uploadArchives
> :geode-json:uploadArchives
> :geode-junit:uploadArchives
> :geode-lucene:uploadArchives
> :geode-old-client-support:uploadArchives
> :geode-old-versions:uploadArchives SKIPPED
> :geode-pulse:uploadArchives
> :geode-rebalancer:uploadArchives
> :geode-wan:uploadArchives
> :geode-web:uploadArchives
> :geode-web-api:uploadArchives
>
> FAILURE: Build failed with an exception.
>
> * What went wrong:
> Execution failed for task ':geode-wan:distributedTest'.
> > There were failing tests. See the report at: file://<
> https://builds.apache.org/job/Geode-nightly/ws/geode-wan/build/reports/distributedTest/index.html
> >
>
> * Try:
> Run with --stacktrace option to get the stack trace. Run with --info or
> --debug option to get more log output.
>
> BUILD FAILED
>
> Total time: 11 hrs 42 mins 23.402 secs
> Build step 'Invoke Gradle script' changed build result to FAILURE
> Build step 'Invoke Gradle script' marked build as failure
> Archiving artifacts
> Compressed 327.51 MB of artifacts by 46.5% relative to #861
> Recording test results
> Not sending mail to unregistered user ukohlmeyer@pivotal.io
> Not sending mail to unregistered user huynhja@gmail.com
> Not sending mail to unregistered user jiliao@pivotal.io
>
Build failed in Jenkins: Geode-nightly #864
Posted by Apache Jenkins Server <je...@builds.apache.org>.
See <https://builds.apache.org/job/Geode-nightly/864/display/redirect>
------------------------------------------
[...truncated 96.86 KB...]
:geode-cq:assemble
:geode-cq:compileTestJavaNote: Some input files use or override a deprecated API.
Note: Recompile with -Xlint:deprecation for details.
Note: Some input files use unchecked or unsafe operations.
Note: Recompile with -Xlint:unchecked for details.
:geode-cq:processTestResources
:geode-cq:testClasses
:geode-cq:checkMissedTests
:geode-cq:spotlessJavaCheck
:geode-cq:spotlessCheck
:geode-cq:test
:geode-cq:check
:geode-cq:build
:geode-cq:distributedTest
:geode-cq:integrationTest
:geode-json:assemble
:geode-json:compileTestJava UP-TO-DATE
:geode-json:processTestResources
:geode-json:testClasses
:geode-json:checkMissedTests UP-TO-DATE
:geode-json:spotlessJavaCheck
:geode-json:spotlessCheck
:geode-json:test UP-TO-DATE
:geode-json:check
:geode-json:build
:geode-json:distributedTest UP-TO-DATE
:geode-json:integrationTest UP-TO-DATE
:geode-junit:javadoc
:geode-junit:javadocJar
:geode-junit:sourcesJar
:geode-junit:signArchives SKIPPED
:geode-junit:assemble
:geode-junit:compileTestJava
:geode-junit:processTestResources UP-TO-DATE
:geode-junit:testClasses
:geode-junit:checkMissedTests
:geode-junit:spotlessJavaCheck
:geode-junit:spotlessCheck
:geode-junit:test
:geode-junit:check
:geode-junit:build
:geode-junit:distributedTest
:geode-junit:integrationTest
:geode-lucene:assemble
:geode-lucene:compileTestJavaNote: Some input files use or override a deprecated API.
Note: Recompile with -Xlint:deprecation for details.
Note: Some input files use unchecked or unsafe operations.
Note: Recompile with -Xlint:unchecked for details.
:geode-lucene:processTestResources
:geode-lucene:testClasses
:geode-lucene:checkMissedTests
:geode-lucene:spotlessJavaCheck
:geode-lucene:spotlessCheck
:geode-lucene:test
:geode-lucene:check
:geode-lucene:build
:geode-lucene:distributedTest
:geode-lucene:integrationTest
:geode-old-client-support:assemble
:geode-old-client-support:compileTestJavaNote: <https://builds.apache.org/job/Geode-nightly/ws/geode-old-client-support/src/test/java/com/gemstone/gemfire/cache/execute/FunctionExceptionTest.java> uses or overrides a deprecated API.
Note: Recompile with -Xlint:deprecation for details.
:geode-old-client-support:processTestResources UP-TO-DATE
:geode-old-client-support:testClasses
:geode-old-client-support:checkMissedTests
:geode-old-client-support:spotlessJavaCheck
:geode-old-client-support:spotlessCheck
:geode-old-client-support:test
:geode-old-client-support:check
:geode-old-client-support:build
:geode-old-client-support:distributedTest
:geode-old-client-support:integrationTest
:geode-old-versions:javadoc UP-TO-DATE
:geode-old-versions:javadocJar
:geode-old-versions:sourcesJar
:geode-old-versions:signArchives SKIPPED
:geode-old-versions:assemble
:geode-old-versions:compileTestJava UP-TO-DATE
:geode-old-versions:processTestResources UP-TO-DATE
:geode-old-versions:testClasses UP-TO-DATE
:geode-old-versions:checkMissedTests UP-TO-DATE
:geode-old-versions:spotlessJavaCheck
:geode-old-versions:spotlessCheck
:geode-old-versions:test UP-TO-DATE
:geode-old-versions:check
:geode-old-versions:build
:geode-old-versions:distributedTest UP-TO-DATE
:geode-old-versions:integrationTest UP-TO-DATE
:geode-pulse:assemble
:geode-pulse:compileTestJavaNote: <https://builds.apache.org/job/Geode-nightly/ws/geode-pulse/src/test/java/org/apache/geode/tools/pulse/tests/ui/PulseBase.java> uses or overrides a deprecated API.
Note: Recompile with -Xlint:deprecation for details.
Note: <https://builds.apache.org/job/Geode-nightly/ws/geode-pulse/src/test/java/org/apache/geode/tools/pulse/controllers/PulseControllerJUnitTest.java> uses unchecked or unsafe operations.
Note: Recompile with -Xlint:unchecked for details.
:geode-pulse:processTestResources
:geode-pulse:testClasses
:geode-pulse:checkMissedTests
:geode-pulse:spotlessJavaCheck
:geode-pulse:spotlessCheck
:geode-pulse:test
:geode-pulse:check
:geode-pulse:build
:geode-pulse:distributedTest
:geode-pulse:integrationTest
:geode-rebalancer:assemble
:geode-rebalancer:compileTestJava
:geode-rebalancer:processTestResources UP-TO-DATE
:geode-rebalancer:testClasses
:geode-rebalancer:checkMissedTests
:geode-rebalancer:spotlessJavaCheck
:geode-rebalancer:spotlessCheck
:geode-rebalancer:test
:geode-rebalancer:check
:geode-rebalancer:build
:geode-rebalancer:distributedTest
:geode-rebalancer:integrationTest
:geode-wan:assemble
:geode-wan:compileTestJavaNote: Some input files use or override a deprecated API.
Note: Recompile with -Xlint:deprecation for details.
Note: Some input files use unchecked or unsafe operations.
Note: Recompile with -Xlint:unchecked for details.
:geode-wan:processTestResources
:geode-wan:testClasses
:geode-wan:checkMissedTests
:geode-wan:spotlessJavaCheck
:geode-wan:spotlessCheck
:geode-wan:test
:geode-wan:check
:geode-wan:build
:geode-wan:distributedTest
org.apache.geode.internal.cache.wan.serial.SerialWANPropagationDUnitTest > testReplicatedSerialPropagationWithRemoteRegionDestroy FAILED
org.apache.geode.test.dunit.RMIException: While invoking org.apache.geode.internal.cache.wan.serial.SerialWANPropagationDUnitTest$$Lambda$2298/1990164334.run in VM 4 running on Host asf902.gq1.ygridcore.net with 8 VMs
at org.apache.geode.test.dunit.VM.invoke(VM.java:377)
at org.apache.geode.test.dunit.VM.invoke(VM.java:347)
at org.apache.geode.test.dunit.VM.invoke(VM.java:292)
at org.apache.geode.internal.cache.wan.serial.SerialWANPropagationDUnitTest.testReplicatedSerialPropagationWithRemoteRegionDestroy(SerialWANPropagationDUnitTest.java:408)
Caused by:
java.lang.AssertionError
at org.junit.Assert.fail(Assert.java:86)
at org.junit.Assert.assertTrue(Assert.java:41)
at org.junit.Assert.assertTrue(Assert.java:52)
at org.apache.geode.internal.cache.wan.WANTestBase.verifyRegionQueueNotEmpty(WANTestBase.java:3364)
at org.apache.geode.internal.cache.wan.serial.SerialWANPropagationDUnitTest.lambda$testReplicatedSerialPropagationWithRemoteRegionDestroy$bb17a952$11(SerialWANPropagationDUnitTest.java:408)
585 tests completed, 1 failed, 59 skipped
:geode-wan:distributedTest FAILED
:geode-wan:integrationTest
:geode-web:assemble
:geode-web:compileTestJavaNote: Some input files use or override a deprecated API.
Note: Recompile with -Xlint:deprecation for details.
Note: <https://builds.apache.org/job/Geode-nightly/ws/geode-web/src/test/java/org/apache/geode/management/internal/web/AbstractWebTestCase.java> uses unchecked or unsafe operations.
Note: Recompile with -Xlint:unchecked for details.
:geode-web:processTestResources UP-TO-DATE
:geode-web:testClasses
:geode-web:checkMissedTests
:geode-web:spotlessJavaCheck
:geode-web:spotlessCheck
:geode-web:test
:geode-web:check
:geode-web:build
:geode-web:distributedTest
:geode-web:integrationTest
:geode-web-api:assemble
:geode-web-api:compileTestJava
:geode-web-api:processTestResources UP-TO-DATE
:geode-web-api:testClasses
:geode-web-api:checkMissedTests
:geode-web-api:spotlessJavaCheck
:geode-web-api:spotlessCheck
:geode-web-api:test
:geode-web-api:check
:geode-web-api:build
:geode-web-api:distributedTest
:geode-web-api:integrationTest
:combineReports
All test reports at <https://builds.apache.org/job/Geode-nightly/ws/build/reports/combined>
:extensions/geode-modules:precheckin
:extensions/geode-modules-assembly:precheckin
:extensions/geode-modules-session:precheckin
:extensions/geode-modules-session-internal:precheckin
:extensions/geode-modules-tomcat7:precheckin
:extensions/geode-modules-tomcat8:precheckin
:geode-assembly:precheckin
:geode-benchmarks:precheckin
:geode-common:precheckin
:geode-core:precheckin
:geode-cq:precheckin
:geode-json:precheckin
:geode-junit:precheckin
:geode-lucene:precheckin
:geode-old-client-support:precheckin
:geode-old-versions:precheckin
:geode-pulse:precheckin
:geode-rebalancer:precheckin
:geode-web:precheckin
:geode-web-api:precheckin
:compileJava UP-TO-DATE
:processResources UP-TO-DATE
:classes UP-TO-DATE
:jar
:uploadArchives
:extensions/geode-modules:uploadArchives
:extensions/geode-modules-assembly:uploadArchives SKIPPED
:extensions/geode-modules-session:uploadArchives
:extensions/geode-modules-session-internal:uploadArchives
:extensions/geode-modules-tomcat7:uploadArchives
:extensions/geode-modules-tomcat8:uploadArchives
:geode-assembly:uploadArchives SKIPPED
:geode-benchmarks:uploadArchives SKIPPED
:geode-common:uploadArchives
:geode-core:uploadArchives
:geode-cq:uploadArchives
:geode-json:uploadArchives
:geode-junit:uploadArchives
:geode-lucene:uploadArchives
:geode-old-client-support:uploadArchives
:geode-old-versions:uploadArchives SKIPPED
:geode-pulse:uploadArchives
:geode-rebalancer:uploadArchives
:geode-wan:uploadArchives
:geode-web:uploadArchives
:geode-web-api:uploadArchives
FAILURE: Build failed with an exception.
* What went wrong:
Execution failed for task ':geode-wan:distributedTest'.
> There were failing tests. See the report at: file://<https://builds.apache.org/job/Geode-nightly/ws/geode-wan/build/reports/distributedTest/index.html>
* Try:
Run with --stacktrace option to get the stack trace. Run with --info or --debug option to get more log output.
BUILD FAILED
Total time: 11 hrs 42 mins 23.402 secs
Build step 'Invoke Gradle script' changed build result to FAILURE
Build step 'Invoke Gradle script' marked build as failure
Archiving artifacts
Compressed 327.51 MB of artifacts by 46.5% relative to #861
Recording test results
Not sending mail to unregistered user ukohlmeyer@pivotal.io
Not sending mail to unregistered user huynhja@gmail.com
Not sending mail to unregistered user jiliao@pivotal.io