You are viewing a plain text version of this content. The canonical link for it is here.
Posted to builds@solr.apache.org by Apache Jenkins Server <je...@builds.apache.org> on 2023/10/26 07:45:13 UTC
[JENKINS] Solr ยป Solr-Docker-Nightly-main - Build # 742 - Still Failing!
Build: https://ci-builds.apache.org/job/Solr/job/Solr-Docker-Nightly-main/742/
Log:
Started by timer
Running as SYSTEM
[EnvInject] - Loading node environment variables.
Building remotely on lucene-solr-2 (solr lucene) in workspace /home/jenkins/jenkins-slave/workspace/Solr/Solr-Docker-Nightly-main
The recommended git tool is: NONE
No credentials specified
> git rev-parse --resolve-git-dir /home/jenkins/jenkins-slave/workspace/Solr/Solr-Docker-Nightly-main/.git # timeout=10
Fetching changes from the remote Git repository
> git config remote.origin.url https://gitbox.apache.org/repos/asf/solr.git # timeout=10
Cleaning workspace
> git rev-parse --verify HEAD # timeout=10
Resetting working tree
> git reset --hard # timeout=10
> git clean -fdx # timeout=10
Fetching upstream changes from https://gitbox.apache.org/repos/asf/solr.git
> git --version # timeout=10
> git --version # 'git version 2.25.1'
> git fetch --tags --force --progress -- https://gitbox.apache.org/repos/asf/solr.git +refs/heads/*:refs/remotes/origin/* # timeout=10
> git rev-parse refs/remotes/origin/main^{commit} # timeout=10
Checking out Revision 7e492564e4a2344fc613e97f5f22efa60b125190 (refs/remotes/origin/main)
> git config core.sparsecheckout # timeout=10
> git checkout -f 7e492564e4a2344fc613e97f5f22efa60b125190 # timeout=10
Commit message: "SOLR-17011 Add tracing spans to internal collection commands (#1979)"
> git rev-list --no-walk 7e492564e4a2344fc613e97f5f22efa60b125190 # timeout=10
No emails were triggered.
provisioning config files...
copy managed file [gradle.properties] to file:/home/jenkins/jenkins-slave/workspace/Solr/Solr-Docker-Nightly-main/gradle.properties
[Solr-Docker-Nightly-main] $ /bin/sh -xe /tmp/jenkins12282478386185988169.sh
+ echo ****
+ docker login -u **** --password-stdin
WARNING! Your password will be stored unencrypted in /home/jenkins/.docker/config.json.
Configure a credential helper to remove this warning. See
https://docs.docker.com/engine/reference/commandline/login/#credentials-store
Login Succeeded
[Gradle] - Launching build.
[Solr-Docker-Nightly-main] $ /home/jenkins/jenkins-slave/workspace/Solr/Solr-Docker-Nightly-main/gradlew -Psolr.docker.imageRepo=apache/solr-nightly -Psolr.docker.dist=full testDocker dockerPush
Downloading gradle-wrapper.jar from https://raw.githubusercontent.com/gradle/gradle/v8.4.0/gradle/wrapper/gradle-wrapper.jar
To honour the JVM settings for this build a single-use Daemon process will be forked. For more on this, please refer to https://docs.gradle.org/8.4/userguide/gradle_daemon.html#sec:disabling_the_daemon in the Gradle documentation.
Daemon will be stopped at the end of the build
Gradle Enterprise plugins resolution: https://plugins.gradle.org/m2
Applying com.gradle.enterprise.gradleplugin.GradleEnterprisePlugin via init script
Connection to Gradle Enterprise: https://ge.apache.org, allowUntrustedServer: false
Enforcing Gradle Enterprise: https://ge.apache.org, allowUntrustedServer: false
Applying com.gradle.CommonCustomUserDataGradlePlugin via init script
> Task :buildSrc:compileJava
Note: /home/jenkins/jenkins-slave/workspace/Solr/Solr-Docker-Nightly-main/buildSrc/src/main/java/org/apache/lucene/gradle/Checksum.java uses or overrides a deprecated API.
Note: Recompile with -Xlint:deprecation for details.
> Task :buildSrc:compileGroovy NO-SOURCE
> Task :buildSrc:processResources NO-SOURCE
> Task :buildSrc:classes
> Task :buildSrc:jar
> Task :solr:docker:createBodySnippetDockerfile
> Task :solr:docker:createDockerfileLocal
> Task :solr:docker:assemblePackaging
> Task :solr:documentation:changesToHtml
> Task :solr:documentation:copyDocumentationAssets
> Task :solr:documentation:markdownToHtml
> Task :solr:documentation:copyChangesToHtmlForMiniSite
> Task :solr:documentation:copyMiniDocumentationAssets
> Task :solr:documentation:createMiniDocumentationIndex
> Task :solr:documentation:documentationMinimal
> Task :gitStatus
> Task :checkJdkInternalsExportedToGradle
> Task :solr:api:compileJava
> Task :solr:api:processResources NO-SOURCE
> Task :solr:api:classes
> Task :solr:api:resolve
SLF4J: No SLF4J providers were found.
SLF4J: Defaulting to no-operation (NOP) logger implementation
SLF4J: See https://www.slf4j.org/codes.html#noProviders for further details.
> Task :solr:solrj:openApiGenerate
################################################################################
# Thanks for using OpenAPI Generator. #
# Please consider donation to help us maintain this project ๐ #
# https://opencollective.com/openapi_generator/donate #
################################################################################
Successfully generated code to /home/jenkins/jenkins-slave/workspace/Solr/Solr-Docker-Nightly-main/solr/solrj/build/generated/
> Task :spotlessInternalRegisterDependencies
> Task :solr:solrj:generatedSpotlessHelper
> Task :solr:solrj:generatedSpotless
> Task :solr:solrj:compileJava
Note: Some input files use or override a deprecated API.
Note: Recompile with -Xlint:deprecation for details.
> Task :solr:solrj-streaming:compileJava
Note: Some input files use or override a deprecated API.
Note: Recompile with -Xlint:deprecation for details.
> Task :solr:solrj-zookeeper:compileJava
Note: Some input files use or override a deprecated API.
Note: Recompile with -Xlint:deprecation for details.
> Task :solr:core:compileJava
Note: Some input files use or override a deprecated API.
Note: Recompile with -Xlint:deprecation for details.
> Task :solr:core:processResources
> Task :solr:core:classes
> Task :solr:core:assemblePostJar
> Task :solr:example:assemblePackaging
> Task :solr:prometheus-exporter:compileJava
Note: Some input files use or override a deprecated API.
Note: Recompile with -Xlint:deprecation for details.
> Task :solr:prometheus-exporter:processResources NO-SOURCE
> Task :solr:prometheus-exporter:classes
> Task :solr:prometheus-exporter:jar
> Task :solr:prometheus-exporter:assemblePackaging
> Task :solr:api:jar
> Task :solr:core:jar
> Task :solr:solrj:processResources
> Task :solr:solrj:classes
> Task :solr:solrj:jar
> Task :solr:solrj-streaming:processResources
> Task :solr:solrj-streaming:classes
> Task :solr:solrj-streaming:jar
> Task :solr:solrj-zookeeper:processResources NO-SOURCE
> Task :solr:solrj-zookeeper:classes
> Task :solr:solrj-zookeeper:jar
> Task :solr:webapp:compileJava NO-SOURCE
> Task :solr:webapp:processResources NO-SOURCE
> Task :solr:webapp:classes UP-TO-DATE
> Task :solr:webapp:war
> Task :solr:server:assemblePackaging
> Task :solr:modules:analysis-extras:compileJava
Note: /home/jenkins/jenkins-slave/workspace/Solr/Solr-Docker-Nightly-main/solr/modules/analysis-extras/src/java/org/apache/solr/schema/ICUCollationField.java uses or overrides a deprecated API.
Note: Recompile with -Xlint:deprecation for details.
> Task :solr:modules:analysis-extras:processResources NO-SOURCE
> Task :solr:modules:analysis-extras:classes
> Task :solr:modules:analysis-extras:jar
> Task :solr:modules:analysis-extras:assemblePackaging
> Task :solr:modules:clustering:compileJava
> Task :solr:modules:clustering:processResources NO-SOURCE
> Task :solr:modules:clustering:classes
> Task :solr:modules:clustering:jar
> Task :solr:modules:clustering:assemblePackaging
> Task :solr:modules:extraction:compileJava
Note: /home/jenkins/jenkins-slave/workspace/Solr/Solr-Docker-Nightly-main/solr/modules/extraction/src/java/org/apache/solr/handler/extraction/ExtractingDocumentLoader.java uses or overrides a deprecated API.
Note: Recompile with -Xlint:deprecation for details.
> Task :solr:modules:extraction:processResources
> Task :solr:modules:extraction:classes
> Task :solr:modules:extraction:jar
> Task :solr:modules:extraction:assemblePackaging
> Task :solr:modules:gcs-repository:compileJava
Note: /home/jenkins/jenkins-slave/workspace/Solr/Solr-Docker-Nightly-main/solr/modules/gcs-repository/src/java/org/apache/solr/gcs/GCSConfigParser.java uses or overrides a deprecated API.
Note: Recompile with -Xlint:deprecation for details.
> Task :solr:modules:gcs-repository:processResources NO-SOURCE
> Task :solr:modules:gcs-repository:classes
> Task :solr:modules:gcs-repository:jar
> Task :solr:modules:gcs-repository:assemblePackaging
> Task :solr:modules:hadoop-auth:compileJava
Note: Some input files use or override a deprecated API.
Note: Recompile with -Xlint:deprecation for details.
> Task :solr:modules:hadoop-auth:processResources NO-SOURCE
> Task :solr:modules:hadoop-auth:classes
> Task :solr:modules:hadoop-auth:jar
> Task :solr:modules:hadoop-auth:assemblePackaging
> Task :solr:modules:hdfs:compileJava
Note: Some input files use or override a deprecated API.
Note: Recompile with -Xlint:deprecation for details.
> Task :solr:modules:hdfs:processResources NO-SOURCE
> Task :solr:modules:hdfs:classes
> Task :solr:modules:hdfs:jar
> Task :solr:modules:hdfs:assemblePackaging
> Task :solr:modules:jwt-auth:compileJava
> Task :solr:modules:jwt-auth:processResources NO-SOURCE
> Task :solr:modules:jwt-auth:classes
> Task :solr:modules:jwt-auth:jar
> Task :solr:modules:jwt-auth:assemblePackaging
> Task :solr:modules:langid:compileJava
Note: Some input files use or override a deprecated API.
Note: Recompile with -Xlint:deprecation for details.
> Task :solr:modules:langid:processResources
> Task :solr:modules:langid:classes
> Task :solr:modules:langid:jar
> Task :solr:modules:langid:assemblePackaging
> Task :solr:modules:ltr:compileJava
Note: Some input files use or override a deprecated API.
Note: Recompile with -Xlint:deprecation for details.
> Task :solr:modules:ltr:processResources NO-SOURCE
> Task :solr:modules:ltr:classes
> Task :solr:modules:ltr:jar
> Task :solr:modules:ltr:assemblePackaging
> Task :solr:modules:opentelemetry:compileJava
> Task :solr:modules:opentelemetry:processResources NO-SOURCE
> Task :solr:modules:opentelemetry:classes
> Task :solr:modules:opentelemetry:jar
> Task :solr:modules:opentelemetry:assemblePackaging
> Task :solr:modules:s3-repository:compileJava
> Task :solr:modules:s3-repository:processResources NO-SOURCE
> Task :solr:modules:s3-repository:classes
> Task :solr:modules:s3-repository:jar
> Task :solr:modules:s3-repository:assemblePackaging
> Task :solr:modules:scripting:compileJava
Note: /home/jenkins/jenkins-slave/workspace/Solr/Solr-Docker-Nightly-main/solr/modules/scripting/src/java/org/apache/solr/scripting/xslt/XSLTUpdateRequestHandler.java uses or overrides a deprecated API.
Note: Recompile with -Xlint:deprecation for details.
> Task :solr:modules:scripting:processResources NO-SOURCE
> Task :solr:modules:scripting:classes
> Task :solr:modules:scripting:jar
> Task :solr:modules:scripting:assemblePackaging
> Task :solr:modules:sql:compileJava
Note: Some input files use or override a deprecated API.
Note: Recompile with -Xlint:deprecation for details.
> Task :solr:modules:sql:processResources
> Task :solr:modules:sql:classes
> Task :solr:modules:sql:jar
> Task :solr:modules:sql:assemblePackaging
> Task :solr:packaging:fullDistTar
> Task :solr:docker:dockerBuild
#0 building with "default" instance using docker driver
#1 [internal] load remote build context
#1 DONE 8.8s
#1 [internal] load remote build context
#1 DONE 8.8s
#2 copy /context /
#2 DONE 1.6s
#3 [internal] load metadata for docker.io/library/eclipse-temurin:17-jre-jammy
#3 ...
#4 [auth] library/eclipse-temurin:pull token for registry-1.docker.io
#4 DONE 0.0s
#3 [internal] load metadata for docker.io/library/eclipse-temurin:17-jre-jammy
#3 DONE 1.0s
#5 [1/7] FROM docker.io/library/eclipse-temurin:17-jre-jammy@sha256:aa9b1434f46fa6fcaec6cb5b4003bb19a4c4244b1660169e672a18f42c04c473
#5 DONE 0.0s
#5 [1/7] FROM docker.io/library/eclipse-temurin:17-jre-jammy@sha256:aa9b1434f46fa6fcaec6cb5b4003bb19a4c4244b1660169e672a18f42c04c473
#5 resolve docker.io/library/eclipse-temurin:17-jre-jammy@sha256:aa9b1434f46fa6fcaec6cb5b4003bb19a4c4244b1660169e672a18f42c04c473 done
#5 sha256:8a21b8680d754f9f953b8285fb140879979a3b1fe038c1491df6dc0f9a04a1d3 1.37kB / 1.37kB done
#5 sha256:7927c7b0751594676a2156390a9b08b745dca2c7dd8a637aa42d9b14d02da4eb 6.62kB / 6.62kB done
#5 sha256:aa9b1434f46fa6fcaec6cb5b4003bb19a4c4244b1660169e672a18f42c04c473 1.21kB / 1.21kB done
#5 sha256:7de1c2853278b16ef01c0abfa4065794c145daefc507cb6cb6fb56a1803a58bb 0B / 734B 0.8s
#5 sha256:7de1c2853278b16ef01c0abfa4065794c145daefc507cb6cb6fb56a1803a58bb 734B / 734B 0.9s done
#5 extracting sha256:7de1c2853278b16ef01c0abfa4065794c145daefc507cb6cb6fb56a1803a58bb done
#5 DONE 1.2s
#6 [2/7] COPY / /opt/
#6 DONE 2.6s
#7 [3/7] RUN set -ex; groupadd -r --gid "8983" "solr"; useradd -r --uid "8983" --gid "8983" "solr"
#7 0.450 + groupadd -r --gid 8983 solr
#7 1.358 + useradd -r --uid 8983 --gid 8983 solr
#7 DONE 1.8s
#8 [4/7] RUN set -ex; (cd /opt; ln -s solr-*/ solr); rm -Rf /opt/solr/docs /opt/solr/docker/Dockerfile;
#8 0.250 + cd /opt
#8 0.250 + ln -s solr-10.0.0-SNAPSHOT/ solr
#8 0.254 + rm -Rf /opt/solr/docs /opt/solr/docker/Dockerfile
#8 DONE 0.3s
#9 [5/7] RUN set -ex; mkdir -p /opt/solr/server/solr/lib /docker-entrypoint-initdb.d; cp /opt/solr/bin/solr.in.sh /etc/default/solr.in.sh; mv /opt/solr/bin/solr.in.sh /opt/solr/bin/solr.in.sh.orig; mv /opt/solr/bin/solr.in.cmd /opt/solr/bin/solr.in.cmd.orig; chmod 0664 /etc/default/solr.in.sh; mkdir -p -m0770 /var/solr; chown -R "solr:0" /var/solr; test ! -e /opt/solr/modules || ln -s /opt/solr/modules /opt/solr/contrib; test ! -e /opt/solr/prometheus-exporter || ln -s /opt/solr/prometheus-exporter /opt/solr/modules/prometheus-exporter;
#9 0.238 + mkdir -p /opt/solr/server/solr/lib /docker-entrypoint-initdb.d
#9 0.243 + cp /opt/solr/bin/solr.in.sh /etc/default/solr.in.sh
#9 0.251 + mv /opt/solr/bin/solr.in.sh /opt/solr/bin/solr.in.sh.orig
#9 0.279 + mv /opt/solr/bin/solr.in.cmd /opt/solr/bin/solr.in.cmd.orig
#9 0.282 + chmod 0664 /etc/default/solr.in.sh
#9 0.285 + mkdir -p -m0770 /var/solr
#9 0.286 + chown -R solr:0 /var/solr
#9 0.290 + test ! -e /opt/solr/modules
#9 0.290 + ln -s /opt/solr/modules /opt/solr/contrib
#9 0.290 + test ! -e /opt/solr/prometheus-exporter
#9 0.290 + ln -s /opt/solr/prometheus-exporter /opt/solr/modules/prometheus-exporter
#9 DONE 0.3s
#10 [6/7] RUN set -ex; apt-get update; apt-get -y --no-install-recommends install acl lsof procps wget netcat gosu tini jattach; rm -rf /var/lib/apt/lists/*;
#10 0.269 + apt-get update
#10 1.042 Get:1 http://archive.ubuntu.com/ubuntu jammy InRelease [270 kB]
#10 1.363 Get:2 http://archive.ubuntu.com/ubuntu jammy-updates InRelease [119 kB]
#10 1.443 Get:3 http://archive.ubuntu.com/ubuntu jammy-backports InRelease [109 kB]
#10 1.774 Get:4 http://archive.ubuntu.com/ubuntu jammy/main amd64 Packages [1,792 kB]
#10 2.052 Get:5 http://archive.ubuntu.com/ubuntu jammy/universe amd64 Packages [17.5 MB]
#10 2.566 Get:6 http://archive.ubuntu.com/ubuntu jammy/multiverse amd64 Packages [266 kB]
#10 2.568 Get:7 http://archive.ubuntu.com/ubuntu jammy/restricted amd64 Packages [164 kB]
#10 2.570 Get:8 http://archive.ubuntu.com/ubuntu jammy-updates/main amd64 Packages [1,398 kB]
#10 2.583 Get:9 http://archive.ubuntu.com/ubuntu jammy-updates/universe amd64 Packages [1,274 kB]
#10 2.595 Get:10 http://archive.ubuntu.com/ubuntu jammy-updates/restricted amd64 Packages [1,330 kB]
#10 2.630 Get:11 http://archive.ubuntu.com/ubuntu jammy-updates/multiverse amd64 Packages [49.8 kB]
#10 2.633 Get:12 http://archive.ubuntu.com/ubuntu jammy-backports/main amd64 Packages [78.3 kB]
#10 2.635 Get:13 http://archive.ubuntu.com/ubuntu jammy-backports/universe amd64 Packages [32.6 kB]
#10 9.974 Get:14 http://security.ubuntu.com/ubuntu jammy-security InRelease [110 kB]
#10 10.31 Get:15 http://security.ubuntu.com/ubuntu jammy-security/universe amd64 Packages [1,009 kB]
#10 10.59 Get:16 http://security.ubuntu.com/ubuntu jammy-security/main amd64 Packages [1,131 kB]
#10 10.65 Get:17 http://security.ubuntu.com/ubuntu jammy-security/restricted amd64 Packages [1,305 kB]
#10 10.70 Get:18 http://security.ubuntu.com/ubuntu jammy-security/multiverse amd64 Packages [44.0 kB]
#10 10.88 Fetched 28.0 MB in 10s (2,820 kB/s)
#10 10.88 Reading package lists...
#10 11.79 + apt-get -y --no-install-recommends install acl lsof procps wget netcat gosu tini jattach
#10 11.84 Reading package lists...
#10 12.72 Building dependency tree...
#10 12.93 Reading state information...
#10 13.09 procps is already the newest version (2:3.3.17-6ubuntu2).
#10 13.09 wget is already the newest version (1.21.2-2ubuntu1).
#10 13.09 The following additional packages will be installed:
#10 13.09 libbsd0 libmd0 netcat-openbsd
#10 13.09 Suggested packages:
#10 13.09 perl
#10 13.15 The following NEW packages will be installed:
#10 13.15 acl gosu jattach libbsd0 libmd0 lsof netcat netcat-openbsd tini
#10 13.30 0 upgraded, 9 newly installed, 0 to remove and 4 not upgraded.
#10 13.30 Need to get 1,484 kB of archives.
#10 13.30 After this operation, 4,090 kB of additional disk space will be used.
#10 13.30 Get:1 http://archive.ubuntu.com/ubuntu jammy/main amd64 libmd0 amd64 1.0.4-1build1 [23.0 kB]
#10 13.43 Get:2 http://archive.ubuntu.com/ubuntu jammy/main amd64 libbsd0 amd64 0.11.5-1 [44.8 kB]
#10 13.50 Get:3 http://archive.ubuntu.com/ubuntu jammy/main amd64 netcat-openbsd amd64 1.218-4ubuntu1 [39.4 kB]
#10 13.55 Get:4 http://archive.ubuntu.com/ubuntu jammy/main amd64 lsof amd64 4.93.2+dfsg-1.1build2 [253 kB]
#10 13.66 Get:5 http://archive.ubuntu.com/ubuntu jammy/main amd64 acl amd64 2.3.1-1 [38.5 kB]
#10 13.67 Get:6 http://archive.ubuntu.com/ubuntu jammy/universe amd64 jattach amd64 2.0-1 [12.4 kB]
#10 13.67 Get:7 http://archive.ubuntu.com/ubuntu jammy/universe amd64 netcat all 1.218-4ubuntu1 [2,044 B]
#10 13.67 Get:8 http://archive.ubuntu.com/ubuntu jammy/universe amd64 tini amd64 0.19.0-1 [276 kB]
#10 13.72 Get:9 http://archive.ubuntu.com/ubuntu jammy/universe amd64 gosu amd64 1.14-1 [794 kB]
#10 15.43 debconf: delaying package configuration, since apt-utils is not installed
#10 15.47 Fetched 1,484 kB in 1s (2,381 kB/s)
#10 15.91 Selecting previously unselected package libmd0:amd64.
#10 15.91 (Reading database ... (Reading database ... 5%(Reading database ... 10%(Reading database ... 15%(Reading database ... 20%(Reading database ... 25%(Reading database ... 30%(Reading database ... 35%(Reading database ... 40%(Reading database ... 45%(Reading database ... 50%(Reading database ... 55%(Reading database ... 60%(Reading database ... 65%(Reading database ... 70%(Reading database ... 75%(Reading database ... 80%(Reading database ... 85%(Reading database ... 90%(Reading database ... 95%(Reading database ... 100%(Reading database ... 7953 files and directories currently installed.)
#10 16.58 Preparing to unpack .../0-libmd0_1.0.4-1build1_amd64.deb ...
#10 16.59 Unpacking libmd0:amd64 (1.0.4-1build1) ...
#10 16.62 Selecting previously unselected package libbsd0:amd64.
#10 16.62 Preparing to unpack .../1-libbsd0_0.11.5-1_amd64.deb ...
#10 16.62 Unpacking libbsd0:amd64 (0.11.5-1) ...
#10 16.64 Selecting previously unselected package netcat-openbsd.
#10 16.65 Preparing to unpack .../2-netcat-openbsd_1.218-4ubuntu1_amd64.deb ...
#10 16.65 Unpacking netcat-openbsd (1.218-4ubuntu1) ...
#10 16.67 Selecting previously unselected package lsof.
#10 16.67 Preparing to unpack .../3-lsof_4.93.2+dfsg-1.1build2_amd64.deb ...
#10 16.67 Unpacking lsof (4.93.2+dfsg-1.1build2) ...
#10 16.70 Selecting previously unselected package acl.
#10 16.70 Preparing to unpack .../4-acl_2.3.1-1_amd64.deb ...
#10 16.70 Unpacking acl (2.3.1-1) ...
#10 16.72 Selecting previously unselected package jattach.
#10 16.72 Preparing to unpack .../5-jattach_2.0-1_amd64.deb ...
#10 16.73 Unpacking jattach (2.0-1) ...
#10 16.74 Selecting previously unselected package netcat.
#10 16.74 Preparing to unpack .../6-netcat_1.218-4ubuntu1_all.deb ...
#10 16.75 Unpacking netcat (1.218-4ubuntu1) ...
#10 16.76 Selecting previously unselected package tini.
#10 16.77 Preparing to unpack .../7-tini_0.19.0-1_amd64.deb ...
#10 16.77 Unpacking tini (0.19.0-1) ...
#10 16.81 Selecting previously unselected package gosu.
#10 16.82 Preparing to unpack .../8-gosu_1.14-1_amd64.deb ...
#10 16.82 Unpacking gosu (1.14-1) ...
#10 16.86 Setting up jattach (2.0-1) ...
#10 16.87 Setting up acl (2.3.1-1) ...
#10 16.87 Setting up gosu (1.14-1) ...
#10 16.88 Setting up tini (0.19.0-1) ...
#10 16.89 Setting up lsof (4.93.2+dfsg-1.1build2) ...
#10 16.90 Setting up libmd0:amd64 (1.0.4-1build1) ...
#10 16.90 Setting up libbsd0:amd64 (0.11.5-1) ...
#10 16.91 Setting up netcat-openbsd (1.218-4ubuntu1) ...
#10 17.06 update-alternatives: using /bin/nc.openbsd to provide /bin/nc (nc) in auto mode
#10 17.06 update-alternatives: warning: skip creation of /usr/share/man/man1/nc.1.gz because associated file /usr/share/man/man1/nc_openbsd.1.gz (of link group nc) doesn't exist
#10 17.06 update-alternatives: warning: skip creation of /usr/share/man/man1/netcat.1.gz because associated file /usr/share/man/man1/nc_openbsd.1.gz (of link group nc) doesn't exist
#10 17.07 Setting up netcat (1.218-4ubuntu1) ...
#10 17.07 Processing triggers for libc-bin (2.35-0ubuntu3.4) ...
#10 19.12 + rm -rf /var/lib/apt/lists/archive.ubuntu.com_ubuntu_dists_jammy-backports_InRelease /var/lib/apt/lists/archive.ubuntu.com_ubuntu_dists_jammy-backports_main_binary-amd64_Packages.lz4 /var/lib/apt/lists/archive.ubuntu.com_ubuntu_dists_jammy-backports_universe_binary-amd64_Packages.lz4 /var/lib/apt/lists/archive.ubuntu.com_ubuntu_dists_jammy-updates_InRelease /var/lib/apt/lists/archive.ubuntu.com_ubuntu_dists_jammy-updates_main_binary-amd64_Packages.lz4 /var/lib/apt/lists/archive.ubuntu.com_ubuntu_dists_jammy-updates_multiverse_binary-amd64_Packages.lz4 /var/lib/apt/lists/archive.ubuntu.com_ubuntu_dists_jammy-updates_restricted_binary-amd64_Packages.lz4 /var/lib/apt/lists/archive.ubuntu.com_ubuntu_dists_jammy-updates_universe_binary-amd64_Packages.lz4 /var/lib/apt/lists/archive.ubuntu.com_ubuntu_dists_jammy_InRelease /var/lib/apt/lists/archive.ubuntu.com_ubuntu_dists_jammy_main_binary-amd64_Packages.lz4 /var/lib/apt/lists/archive.ubuntu.com_ubuntu_dists_jammy_multiverse_binary-amd64_Packages.lz4 /var/lib/apt/lists/archive.ubuntu.com_ubuntu_dists_jammy_restricted_binary-amd64_Packages.lz4 /var/lib/apt/lists/archive.ubuntu.com_ubuntu_dists_jammy_universe_binary-amd64_Packages.lz4 /var/lib/apt/lists/auxfiles /var/lib/apt/lists/lock /var/lib/apt/lists/partial /var/lib/apt/lists/security.ubuntu.com_ubuntu_dists_jammy-security_InRelease /var/lib/apt/lists/security.ubuntu.com_ubuntu_dists_jammy-security_main_binary-amd64_Packages.lz4 /var/lib/apt/lists/security.ubuntu.com_ubuntu_dists_jammy-security_multiverse_binary-amd64_Packages.lz4 /var/lib/apt/lists/security.ubuntu.com_ubuntu_dists_jammy-security_restricted_binary-amd64_Packages.lz4 /var/lib/apt/lists/security.ubuntu.com_ubuntu_dists_jammy-security_universe_binary-amd64_Packages.lz4
#10 DONE 19.2s
#11 [7/7] WORKDIR /opt/solr
#11 DONE 0.1s
#12 exporting to image
#12 exporting layers
#12 exporting layers 1.5s done
#12 writing image sha256:5f3798c64074f49e738b254ce8b393774187eb7c28c9c4548720818fd768b459 done
#12 DONE 1.5s
Solr Docker Image Created
ID: sha256:5f3798c64074f49e738b254ce8b393774187eb7c28c9c4548720818fd768b459
Base Image: eclipse-temurin:17-jre-jammy
Solr Version: 10.0.0-SNAPSHOT
Solr Distribution: Full
> Task :solr:docker:testDocker
Testing Solr Image ID: sha256:5f3798c64074f49e738b254ce8b393774187eb7c28c9c4548720818fd768b459 (sequentially)
Starting Solr Docker test: prometheus-exporter-standalone
Completed Solr Docker test: prometheus-exporter-standalone
Starting Solr Docker test: cloud_multi_node_embedded_zk
Completed Solr Docker test: cloud_multi_node_embedded_zk
Starting Solr Docker test: create_core_exec
Completed Solr Docker test: create_core_exec
Starting Solr Docker test: empty-varsolr-vol-ramdomuser-rootgroup
Completed Solr Docker test: empty-varsolr-vol-ramdomuser-rootgroup
Starting Solr Docker test: user_volume
Completed Solr Docker test: user_volume
Starting Solr Docker test: demo-tini
Completed Solr Docker test: demo-tini
Starting Solr Docker test: precreate_core
Completed Solr Docker test: precreate_core
Starting Solr Docker test: create_bad_core
Completed Solr Docker test: create_bad_core
Starting Solr Docker test: empty-varsolr-dir-ramdomuser-rootgroup
Completed Solr Docker test: empty-varsolr-dir-ramdomuser-rootgroup
Starting Solr Docker test: empty-varsolr-dir-solr
Completed Solr Docker test: empty-varsolr-dir-solr
Starting Solr Docker test: create_core
Completed Solr Docker test: create_core
Starting Solr Docker test: empty-varsolr-dir-user
Completed Solr Docker test: empty-varsolr-dir-user
Starting Solr Docker test: prometheus-exporter-cloud
Completed Solr Docker test: prometheus-exporter-cloud
Starting Solr Docker test: initdb
Completed Solr Docker test: initdb
Starting Solr Docker test: precreate_core_randomuser_rootgroup
Completed Solr Docker test: precreate_core_randomuser_rootgroup
Starting Solr Docker test: gosu
Completed Solr Docker test: gosu
Starting Solr Docker test: demo
Completed Solr Docker test: demo
Starting Solr Docker test: empty-varsolr-vol-solr-nocopy
Completed Solr Docker test: empty-varsolr-vol-solr-nocopy
Starting Solr Docker test: empty-varsolr-vol-solr
Completed Solr Docker test: empty-varsolr-vol-solr
Starting Solr Docker test: empty-varsolr-vol-user
Completed Solr Docker test: empty-varsolr-vol-user
Starting Solr Docker test: create_core_randomuser_rootgroup
Completed Solr Docker test: create_core_randomuser_rootgroup
Starting Solr Docker test: test_log4j
Completed Solr Docker test: test_log4j
> Task :solr:docker:dockerTag
Solr Docker Image Tagged
ID: sha256:5f3798c64074f49e738b254ce8b393774187eb7c28c9c4548720818fd768b459
Tag: apache/solr-nightly:10.0.0-SNAPSHOT
> Task :solr:docker:dockerPush
The push refers to repository [docker.io/apache/solr-nightly]
5f70bf18a086: Preparing
b105b3226a84: Preparing
e5a6018abb1a: Preparing
60660b188312: Preparing
767d5a618861: Preparing
9950163a528d: Preparing
f548841008be: Preparing
01ff1c4a73d6: Preparing
6a99f1702481: Preparing
fb91a4b6eff7: Preparing
256d88da4185: Preparing
9950163a528d: Waiting
6a99f1702481: Waiting
01ff1c4a73d6: Waiting
f548841008be: Waiting
fb91a4b6eff7: Waiting
256d88da4185: Waiting
5f70bf18a086: Layer already exists
767d5a618861: Pushed
60660b188312: Pushed
f548841008be: Layer already exists
e5a6018abb1a: Pushed
01ff1c4a73d6: Layer already exists
b105b3226a84: Pushed
6a99f1702481: Layer already exists
fb91a4b6eff7: Layer already exists
256d88da4185: Layer already exists
9950163a528d: Pushed
10.0.0-SNAPSHOT: digest: sha256:15a8bf237a5a91108334c45e97482e3ce6c688a8c290e52b483df5c4d8066660 size: 2622
Solr Docker Image Pushed: apache/solr-nightly:10.0.0-SNAPSHOT
Deprecated Gradle features were used in this build, making it incompatible with Gradle 9.0.
You can use '--warning-mode all' to show the individual deprecation warnings and determine if they come from your own scripts or plugins.
For more on this, please refer to https://docs.gradle.org/8.4/userguide/command_line_interface.html#sec:command_line_warnings in the Gradle documentation.
BUILD SUCCESSFUL in 9m 38s
85 actionable tasks: 85 executed
Publishing build scan...
https://ge.apache.org/s/rv7swvws4ablu
Build step 'Invoke Gradle script' changed build result to SUCCESS
[Gradle] - Launching build.
[Solr-Docker-Nightly-main] $ /home/jenkins/jenkins-slave/workspace/Solr/Solr-Docker-Nightly-main/gradlew -Psolr.docker.imageRepo=apache/solr-nightly -Psolr.docker.dist=slim testDocker dockerPush
To honour the JVM settings for this build a single-use Daemon process will be forked. For more on this, please refer to https://docs.gradle.org/8.4/userguide/gradle_daemon.html#sec:disabling_the_daemon in the Gradle documentation.
Daemon will be stopped at the end of the build
Gradle Enterprise plugins resolution: https://plugins.gradle.org/m2
Applying com.gradle.enterprise.gradleplugin.GradleEnterprisePlugin via init script
Connection to Gradle Enterprise: https://ge.apache.org, allowUntrustedServer: false
Enforcing Gradle Enterprise: https://ge.apache.org, allowUntrustedServer: false
Applying com.gradle.CommonCustomUserDataGradlePlugin via init script
> Task :buildSrc:compileJava UP-TO-DATE
> Task :buildSrc:compileGroovy NO-SOURCE
> Task :buildSrc:processResources NO-SOURCE
> Task :buildSrc:classes UP-TO-DATE
> Task :buildSrc:jar UP-TO-DATE
> Task :solr:docker:createBodySnippetDockerfile UP-TO-DATE
> Task :solr:docker:createDockerfileLocal UP-TO-DATE
> Task :solr:docker:assemblePackaging UP-TO-DATE
> Task :solr:documentation:changesToHtml UP-TO-DATE
> Task :solr:documentation:copyDocumentationAssets UP-TO-DATE
> Task :solr:documentation:markdownToHtml UP-TO-DATE
> Task :solr:documentation:copyChangesToHtmlForMiniSite UP-TO-DATE
> Task :solr:documentation:copyMiniDocumentationAssets UP-TO-DATE
> Task :solr:documentation:createMiniDocumentationIndex UP-TO-DATE
> Task :solr:documentation:documentationMinimal UP-TO-DATE
> Task :gitStatus
> Task :checkJdkInternalsExportedToGradle
> Task :solr:api:compileJava UP-TO-DATE
> Task :solr:api:processResources NO-SOURCE
> Task :solr:api:classes UP-TO-DATE
> Task :solr:api:resolve UP-TO-DATE
> Task :solr:solrj:openApiGenerate
################################################################################
# Thanks for using OpenAPI Generator. #
# Please consider donation to help us maintain this project ๐ #
# https://opencollective.com/openapi_generator/donate #
################################################################################
Successfully generated code to /home/jenkins/jenkins-slave/workspace/Solr/Solr-Docker-Nightly-main/solr/solrj/build/generated/
> Task :spotlessInternalRegisterDependencies UP-TO-DATE
> Task :solr:solrj:generatedSpotlessHelper
> Task :solr:solrj:generatedSpotless
> Task :solr:solrj:compileJava UP-TO-DATE
> Task :solr:solrj-streaming:compileJava UP-TO-DATE
> Task :solr:solrj-zookeeper:compileJava UP-TO-DATE
> Task :solr:core:compileJava UP-TO-DATE
> Task :solr:core:processResources UP-TO-DATE
> Task :solr:core:classes UP-TO-DATE
> Task :solr:core:assemblePostJar UP-TO-DATE
> Task :solr:example:assemblePackaging UP-TO-DATE
> Task :solr:api:jar UP-TO-DATE
> Task :solr:core:jar UP-TO-DATE
> Task :solr:solrj:processResources UP-TO-DATE
> Task :solr:solrj:classes UP-TO-DATE
> Task :solr:solrj:jar UP-TO-DATE
> Task :solr:solrj-streaming:processResources UP-TO-DATE
> Task :solr:solrj-streaming:classes UP-TO-DATE
> Task :solr:solrj-streaming:jar UP-TO-DATE
> Task :solr:solrj-zookeeper:processResources NO-SOURCE
> Task :solr:solrj-zookeeper:classes UP-TO-DATE
> Task :solr:solrj-zookeeper:jar UP-TO-DATE
> Task :solr:webapp:compileJava NO-SOURCE
> Task :solr:webapp:processResources NO-SOURCE
> Task :solr:webapp:classes UP-TO-DATE
> Task :solr:webapp:war UP-TO-DATE
> Task :solr:server:assemblePackaging UP-TO-DATE
> Task :solr:packaging:slimDistTar
> Task :solr:docker:dockerBuild
#0 building with "default" instance using docker driver
#1 [internal] load remote build context
#1 DONE 2.3s
#2 copy /context /
#2 DONE 0.8s
#3 [auth] library/eclipse-temurin:pull token for registry-1.docker.io
#3 DONE 0.0s
#4 [internal] load metadata for docker.io/library/eclipse-temurin:17-jre-jammy
#4 DONE 0.5s
#5 [1/7] FROM docker.io/library/eclipse-temurin:17-jre-jammy@sha256:aa9b1434f46fa6fcaec6cb5b4003bb19a4c4244b1660169e672a18f42c04c473
#5 DONE 0.0s
#5 [1/7] FROM docker.io/library/eclipse-temurin:17-jre-jammy@sha256:aa9b1434f46fa6fcaec6cb5b4003bb19a4c4244b1660169e672a18f42c04c473
#5 CACHED
#6 [2/7] COPY / /opt/
#6 DONE 1.0s
#7 [3/7] RUN set -ex; groupadd -r --gid "8983" "solr"; useradd -r --uid "8983" --gid "8983" "solr"
#7 0.271 + groupadd -r --gid 8983 solr
#7 0.297 + useradd -r --uid 8983 --gid 8983 solr
#7 DONE 0.5s
#8 [4/7] RUN set -ex; (cd /opt; ln -s solr-*/ solr); rm -Rf /opt/solr/docs /opt/solr/docker/Dockerfile;
#8 0.270 + cd /opt
#8 0.270 + ln -s solr-10.0.0-SNAPSHOT-slim/ solr
#8 0.270 + rm -Rf /opt/solr/docs /opt/solr/docker/Dockerfile
#8 DONE 0.4s
#9 [5/7] RUN set -ex; mkdir -p /opt/solr/server/solr/lib /docker-entrypoint-initdb.d; cp /opt/solr/bin/solr.in.sh /etc/default/solr.in.sh; mv /opt/solr/bin/solr.in.sh /opt/solr/bin/solr.in.sh.orig; mv /opt/solr/bin/solr.in.cmd /opt/solr/bin/solr.in.cmd.orig; chmod 0664 /etc/default/solr.in.sh; mkdir -p -m0770 /var/solr; chown -R "solr:0" /var/solr; test ! -e /opt/solr/modules || ln -s /opt/solr/modules /opt/solr/contrib; test ! -e /opt/solr/prometheus-exporter || ln -s /opt/solr/prometheus-exporter /opt/solr/modules/prometheus-exporter;
#9 0.228 + mkdir -p /opt/solr/server/solr/lib /docker-entrypoint-initdb.d
#9 0.229 + cp /opt/solr/bin/solr.in.sh /etc/default/solr.in.sh
#9 0.231 + mv /opt/solr/bin/solr.in.sh /opt/solr/bin/solr.in.sh.orig
#9 0.236 + mv /opt/solr/bin/solr.in.cmd /opt/solr/bin/solr.in.cmd.orig
#9 0.241 + chmod 0664 /etc/default/solr.in.sh
#9 0.242 + mkdir -p -m0770 /var/solr
#9 0.243 + chown -R solr:0 /var/solr
#9 0.243 + test ! -e /opt/solr/modules
#9 0.243 + test ! -e /opt/solr/prometheus-exporter
#9 DONE 0.4s
#10 [6/7] RUN set -ex; apt-get update; apt-get -y --no-install-recommends install acl lsof procps wget netcat gosu tini jattach; rm -rf /var/lib/apt/lists/*;
#10 0.308 + apt-get update
#10 0.455 Get:1 http://archive.ubuntu.com/ubuntu jammy InRelease [270 kB]
#10 0.463 Get:2 http://security.ubuntu.com/ubuntu jammy-security InRelease [110 kB]
#10 0.795 Get:3 http://archive.ubuntu.com/ubuntu jammy-updates InRelease [119 kB]
#10 0.798 Get:4 http://security.ubuntu.com/ubuntu jammy-security/restricted amd64 Packages [1,305 kB]
#10 0.875 Get:5 http://archive.ubuntu.com/ubuntu jammy-backports InRelease [109 kB]
#10 0.955 Get:6 http://archive.ubuntu.com/ubuntu jammy/restricted amd64 Packages [164 kB]
#10 0.989 Get:7 http://archive.ubuntu.com/ubuntu jammy/multiverse amd64 Packages [266 kB]
#10 1.028 Get:8 http://archive.ubuntu.com/ubuntu jammy/main amd64 Packages [1,792 kB]
#10 1.105 Get:9 http://security.ubuntu.com/ubuntu jammy-security/universe amd64 Packages [1,009 kB]
#10 1.136 Get:10 http://security.ubuntu.com/ubuntu jammy-security/main amd64 Packages [1,131 kB]
#10 1.164 Get:11 http://archive.ubuntu.com/ubuntu jammy/universe amd64 Packages [17.5 MB]
#10 1.188 Get:12 http://security.ubuntu.com/ubuntu jammy-security/multiverse amd64 Packages [44.0 kB]
#10 1.584 Get:13 http://archive.ubuntu.com/ubuntu jammy-updates/multiverse amd64 Packages [49.8 kB]
#10 1.587 Get:14 http://archive.ubuntu.com/ubuntu jammy-updates/main amd64 Packages [1,398 kB]
#10 1.599 Get:15 http://archive.ubuntu.com/ubuntu jammy-updates/restricted amd64 Packages [1,330 kB]
#10 1.610 Get:16 http://archive.ubuntu.com/ubuntu jammy-updates/universe amd64 Packages [1,274 kB]
#10 1.660 Get:17 http://archive.ubuntu.com/ubuntu jammy-backports/universe amd64 Packages [32.6 kB]
#10 1.663 Get:18 http://archive.ubuntu.com/ubuntu jammy-backports/main amd64 Packages [78.3 kB]
#10 2.656 Fetched 28.0 MB in 2s (12.0 MB/s)
#10 2.656 Reading package lists...
#10 3.486 + apt-get -y --no-install-recommends install acl lsof procps wget netcat gosu tini jattach
#10 3.523 Reading package lists...
#10 4.378 Building dependency tree...
#10 4.539 Reading state information...
#10 4.682 procps is already the newest version (2:3.3.17-6ubuntu2).
#10 4.682 wget is already the newest version (1.21.2-2ubuntu1).
#10 4.682 The following additional packages will be installed:
#10 4.683 libbsd0 libmd0 netcat-openbsd
#10 4.684 Suggested packages:
#10 4.684 perl
#10 4.741 The following NEW packages will be installed:
#10 4.743 acl gosu jattach libbsd0 libmd0 lsof netcat netcat-openbsd tini
#10 5.150 0 upgraded, 9 newly installed, 0 to remove and 4 not upgraded.
#10 5.150 Need to get 1,484 kB of archives.
#10 5.150 After this operation, 4,090 kB of additional disk space will be used.
#10 5.150 Get:1 http://archive.ubuntu.com/ubuntu jammy/main amd64 libmd0 amd64 1.0.4-1build1 [23.0 kB]
#10 5.415 Get:2 http://archive.ubuntu.com/ubuntu jammy/main amd64 libbsd0 amd64 0.11.5-1 [44.8 kB]
#10 5.547 Get:3 http://archive.ubuntu.com/ubuntu jammy/main amd64 netcat-openbsd amd64 1.218-4ubuntu1 [39.4 kB]
#10 5.638 Get:4 http://archive.ubuntu.com/ubuntu jammy/main amd64 lsof amd64 4.93.2+dfsg-1.1build2 [253 kB]
#10 5.866 Get:5 http://archive.ubuntu.com/ubuntu jammy/main amd64 acl amd64 2.3.1-1 [38.5 kB]
#10 5.883 Get:6 http://archive.ubuntu.com/ubuntu jammy/universe amd64 jattach amd64 2.0-1 [12.4 kB]
#10 5.889 Get:7 http://archive.ubuntu.com/ubuntu jammy/universe amd64 netcat all 1.218-4ubuntu1 [2,044 B]
#10 5.890 Get:8 http://archive.ubuntu.com/ubuntu jammy/universe amd64 tini amd64 0.19.0-1 [276 kB]
#10 5.983 Get:9 http://archive.ubuntu.com/ubuntu jammy/universe amd64 gosu amd64 1.14-1 [794 kB]
#10 6.238 debconf: delaying package configuration, since apt-utils is not installed
#10 6.266 Fetched 1,484 kB in 1s (1,084 kB/s)
#10 6.289 Selecting previously unselected package libmd0:amd64.
#10 6.289 (Reading database ... (Reading database ... 5%(Reading database ... 10%(Reading database ... 15%(Reading database ... 20%(Reading database ... 25%(Reading database ... 30%(Reading database ... 35%(Reading database ... 40%(Reading database ... 45%(Reading database ... 50%(Reading database ... 55%(Reading database ... 60%(Reading database ... 65%(Reading database ... 70%(Reading database ... 75%(Reading database ... 80%(Reading database ... 85%(Reading database ... 90%(Reading database ... 95%(Reading database ... 100%(Reading database ... 7953 files and directories currently installed.)
#10 6.296 Preparing to unpack .../0-libmd0_1.0.4-1build1_amd64.deb ...
#10 6.302 Unpacking libmd0:amd64 (1.0.4-1build1) ...
#10 6.331 Selecting previously unselected package libbsd0:amd64.
#10 6.332 Preparing to unpack .../1-libbsd0_0.11.5-1_amd64.deb ...
#10 6.337 Unpacking libbsd0:amd64 (0.11.5-1) ...
#10 6.362 Selecting previously unselected package netcat-openbsd.
#10 6.365 Preparing to unpack .../2-netcat-openbsd_1.218-4ubuntu1_amd64.deb ...
#10 6.369 Unpacking netcat-openbsd (1.218-4ubuntu1) ...
#10 6.390 Selecting previously unselected package lsof.
#10 6.391 Preparing to unpack .../3-lsof_4.93.2+dfsg-1.1build2_amd64.deb ...
#10 6.393 Unpacking lsof (4.93.2+dfsg-1.1build2) ...
#10 6.417 Selecting previously unselected package acl.
#10 6.418 Preparing to unpack .../4-acl_2.3.1-1_amd64.deb ...
#10 6.420 Unpacking acl (2.3.1-1) ...
#10 6.449 Selecting previously unselected package jattach.
#10 6.451 Preparing to unpack .../5-jattach_2.0-1_amd64.deb ...
#10 6.453 Unpacking jattach (2.0-1) ...
#10 6.473 Selecting previously unselected package netcat.
#10 6.475 Preparing to unpack .../6-netcat_1.218-4ubuntu1_all.deb ...
#10 6.477 Unpacking netcat (1.218-4ubuntu1) ...
#10 6.512 Selecting previously unselected package tini.
#10 6.513 Preparing to unpack .../7-tini_0.19.0-1_amd64.deb ...
#10 6.517 Unpacking tini (0.19.0-1) ...
#10 6.567 Selecting previously unselected package gosu.
#10 6.568 Preparing to unpack .../8-gosu_1.14-1_amd64.deb ...
#10 6.574 Unpacking gosu (1.14-1) ...
#10 6.621 Setting up jattach (2.0-1) ...
#10 6.628 Setting up acl (2.3.1-1) ...
#10 6.635 Setting up gosu (1.14-1) ...
#10 6.642 Setting up tini (0.19.0-1) ...
#10 6.650 Setting up lsof (4.93.2+dfsg-1.1build2) ...
#10 6.659 Setting up libmd0:amd64 (1.0.4-1build1) ...
#10 6.669 Setting up libbsd0:amd64 (0.11.5-1) ...
#10 6.676 Setting up netcat-openbsd (1.218-4ubuntu1) ...
#10 6.683 update-alternatives: using /bin/nc.openbsd to provide /bin/nc (nc) in auto mode
#10 6.683 update-alternatives: warning: skip creation of /usr/share/man/man1/nc.1.gz because associated file /usr/share/man/man1/nc_openbsd.1.gz (of link group nc) doesn't exist
#10 6.683 update-alternatives: warning: skip creation of /usr/share/man/man1/netcat.1.gz because associated file /usr/share/man/man1/nc_openbsd.1.gz (of link group nc) doesn't exist
#10 6.688 Setting up netcat (1.218-4ubuntu1) ...
#10 6.694 Processing triggers for libc-bin (2.35-0ubuntu3.4) ...
#10 6.727 + rm -rf /var/lib/apt/lists/archive.ubuntu.com_ubuntu_dists_jammy-backports_InRelease /var/lib/apt/lists/archive.ubuntu.com_ubuntu_dists_jammy-backports_main_binary-amd64_Packages.lz4 /var/lib/apt/lists/archive.ubuntu.com_ubuntu_dists_jammy-backports_universe_binary-amd64_Packages.lz4 /var/lib/apt/lists/archive.ubuntu.com_ubuntu_dists_jammy-updates_InRelease /var/lib/apt/lists/archive.ubuntu.com_ubuntu_dists_jammy-updates_main_binary-amd64_Packages.lz4 /var/lib/apt/lists/archive.ubuntu.com_ubuntu_dists_jammy-updates_multiverse_binary-amd64_Packages.lz4 /var/lib/apt/lists/archive.ubuntu.com_ubuntu_dists_jammy-updates_restricted_binary-amd64_Packages.lz4 /var/lib/apt/lists/archive.ubuntu.com_ubuntu_dists_jammy-updates_universe_binary-amd64_Packages.lz4 /var/lib/apt/lists/archive.ubuntu.com_ubuntu_dists_jammy_InRelease /var/lib/apt/lists/archive.ubuntu.com_ubuntu_dists_jammy_main_binary-amd64_Packages.lz4 /var/lib/apt/lists/archive.ubuntu.com_ubuntu_dists_jammy_multiverse_binary-amd64_Packages.lz4 /var/lib/apt/lists/archive.ubuntu.com_ubuntu_dists_jammy_restricted_binary-amd64_Packages.lz4 /var/lib/apt/lists/archive.ubuntu.com_ubuntu_dists_jammy_universe_binary-amd64_Packages.lz4 /var/lib/apt/lists/auxfiles /var/lib/apt/lists/lock /var/lib/apt/lists/partial /var/lib/apt/lists/security.ubuntu.com_ubuntu_dists_jammy-security_InRelease /var/lib/apt/lists/security.ubuntu.com_ubuntu_dists_jammy-security_main_binary-amd64_Packages.lz4 /var/lib/apt/lists/security.ubuntu.com_ubuntu_dists_jammy-security_multiverse_binary-amd64_Packages.lz4 /var/lib/apt/lists/security.ubuntu.com_ubuntu_dists_jammy-security_restricted_binary-amd64_Packages.lz4 /var/lib/apt/lists/security.ubuntu.com_ubuntu_dists_jammy-security_universe_binary-amd64_Packages.lz4
#10 DONE 6.8s
#11 [7/7] WORKDIR /opt/solr
#11 DONE 0.0s
#12 exporting to image
#12 exporting layers
#12 exporting layers 0.5s done
#12 writing image sha256:1967055133086211fc580376284bc687a920cd3a79619d25aeaf6c0106417355 done
#12 DONE 0.5s
Solr Docker Image Created
ID: sha256:1967055133086211fc580376284bc687a920cd3a79619d25aeaf6c0106417355
Base Image: eclipse-temurin:17-jre-jammy
Solr Version: 10.0.0-SNAPSHOT
Solr Distribution: Slim
> Task :solr:docker:testDocker
Testing Solr Image ID: sha256:1967055133086211fc580376284bc687a920cd3a79619d25aeaf6c0106417355 (sequentially)
Starting Solr Docker test: prometheus-exporter-standalone
> Task :solr:docker:testDocker FAILED
FAILURE: Build failed with an exception.
* Where:
Build file '/home/jenkins/jenkins-slave/workspace/Solr/Solr-Docker-Nightly-main/solr/docker/build.gradle' line: 620
* What went wrong:
Execution failed for task ':solr:docker:testDocker'.
> There was a failure while executing work items
> A failure occurred while executing TestDockerImageTask$SingleTestAction
> Docker test failure=1: Test: prometheus-exporter-standalone Output: /home/jenkins/jenkins-slave/workspace/Solr/Solr-Docker-Nightly-main/solr/docker/build/test-results/prometheus-exporter-standalone
* Try:
> Run with --stacktrace option to get the stack trace.
> Run with --info or --debug option to get more log output.
> Get more help at https://help.gradle.org.
Deprecated Gradle features were used in this build, making it incompatible with Gradle 9.0.
You can use '--warning-mode all' to show the individual deprecation warnings and determine if they come from your own scripts or plugins.
For more on this, please refer to https://docs.gradle.org/8.4/userguide/command_line_interface.html#sec:command_line_warnings in the Gradle documentation.
BUILD FAILED in 58s
38 actionable tasks: 8 executed, 30 up-to-date
Publishing build scan...
https://ge.apache.org/s/rl3icbcrjuoiq
Build step 'Invoke Gradle script' changed build result to FAILURE
Build step 'Invoke Gradle script' marked build as failure
Email was triggered for: Failure - Any
Sending email for trigger: Failure - Any