You are viewing a plain text version of this content. The canonical link for it is here.
Posted to oak-dev@jackrabbit.apache.org by Apache Jenkins Server <je...@builds.apache.org> on 2018/11/04 13:38:28 UTC
BUILD FAILURE: Jackrabbit Oak - Build # 1765 - Failure
The Apache Jenkins build system has built Jackrabbit Oak (build #1765)
Status: Failure
Check console output at https://builds.apache.org/job/Jackrabbit%20Oak/1765/ to view the results.
Changes:
[catholicon] OAK-7608: Throw exception if all properties name are given wrong for faceting
We shall always throw an exception if facets are requested but the index
doesn't support all of them.
[catholicon] OAK-7850: Indexes that don't support facets being queried should not participate in execution plan
Test results:
1 tests failed.
FAILED: org.apache.jackrabbit.oak.segment.ExternalBlobIT.testNullBlobId
Error Message:
expected:<4002> but was:<3735>
Stack Trace:
java.lang.AssertionError: expected:<4002> but was:<3735>
at org.apache.jackrabbit.oak.segment.ExternalBlobIT.testNullBlobId(ExternalBlobIT.java:128)